phoenix-commits mailing list archives

Site index · List index
Message view « Date » · « Thread »
Top « Date » · « Thread »
From Apache Jenkins Server <jenk...@builds.apache.org>
Subject Build failed in Jenkins: Phoenix-omid2 #69
Date Mon, 18 Jun 2018 09:47:24 GMT
See <https://builds.apache.org/job/Phoenix-omid2/69/display/redirect?page=changes>

Changes:

[jamestaylor] Fix ALTER TABLE ... SET TRANSACTION_PROVIDER and remove dumpTable calls

------------------------------------------
[...truncated 248.34 KB...]
[INFO] Running org.apache.phoenix.end2end.join.SortMergeJoinNoIndexIT
[INFO] Tests run: 34, Failures: 0, Errors: 0, Skipped: 0, Time elapsed: 644.569 s - in org.apache.phoenix.end2end.join.HashJoinLocalIndexIT
[INFO] Tests run: 34, Failures: 0, Errors: 0, Skipped: 0, Time elapsed: 233.357 s - in org.apache.phoenix.end2end.join.SortMergeJoinNoIndexIT
[INFO] Running org.apache.phoenix.end2end.join.SubqueryIT
[INFO] Running org.apache.phoenix.end2end.join.SubqueryUsingSortMergeJoinIT
[INFO] Tests run: 34, Failures: 0, Errors: 0, Skipped: 0, Time elapsed: 414.792 s - in org.apache.phoenix.end2end.join.SortMergeJoinGlobalIndexIT
[INFO] Running org.apache.phoenix.end2end.salted.SaltedTableIT
[INFO] Tests run: 8, Failures: 0, Errors: 0, Skipped: 0, Time elapsed: 20.312 s - in org.apache.phoenix.end2end.salted.SaltedTableIT
[INFO] Running org.apache.phoenix.end2end.salted.SaltedTableUpsertSelectIT
[INFO] Tests run: 6, Failures: 0, Errors: 0, Skipped: 0, Time elapsed: 45.179 s - in org.apache.phoenix.end2end.salted.SaltedTableUpsertSelectIT
[INFO] Running org.apache.phoenix.end2end.salted.SaltedTableVarLengthRowKeyIT
[INFO] Tests run: 1, Failures: 0, Errors: 0, Skipped: 0, Time elapsed: 2.341 s - in org.apache.phoenix.end2end.salted.SaltedTableVarLengthRowKeyIT
[INFO] Running org.apache.phoenix.iterate.PhoenixQueryTimeoutIT
[INFO] Tests run: 2, Failures: 0, Errors: 0, Skipped: 0, Time elapsed: 4.969 s - in org.apache.phoenix.iterate.PhoenixQueryTimeoutIT
[INFO] Running org.apache.phoenix.iterate.RoundRobinResultIteratorIT
[INFO] Tests run: 15, Failures: 0, Errors: 0, Skipped: 0, Time elapsed: 188.79 s - in org.apache.phoenix.end2end.join.SubqueryUsingSortMergeJoinIT
[INFO] Running org.apache.phoenix.replication.SystemCatalogWALEntryFilterIT
[INFO] Tests run: 2, Failures: 0, Errors: 0, Skipped: 0, Time elapsed: 0.181 s - in org.apache.phoenix.replication.SystemCatalogWALEntryFilterIT
[INFO] Running org.apache.phoenix.rpc.UpdateCacheIT
[INFO] Tests run: 9, Failures: 0, Errors: 0, Skipped: 0, Time elapsed: 66.365 s - in org.apache.phoenix.iterate.RoundRobinResultIteratorIT
[INFO] Tests run: 24, Failures: 0, Errors: 0, Skipped: 0, Time elapsed: 278.753 s - in org.apache.phoenix.end2end.join.SubqueryIT
[INFO] Tests run: 7, Failures: 0, Errors: 0, Skipped: 0, Time elapsed: 28.539 s - in org.apache.phoenix.rpc.UpdateCacheIT
[INFO] Running org.apache.phoenix.tx.FlappingTransactionIT
[INFO] Running org.apache.phoenix.trace.PhoenixTableMetricsWriterIT
[INFO] Tests run: 4, Failures: 0, Errors: 0, Skipped: 0, Time elapsed: 11.461 s - in org.apache.phoenix.tx.FlappingTransactionIT
[INFO] Running org.apache.phoenix.tx.ParameterizedTransactionIT
[INFO] Tests run: 2, Failures: 0, Errors: 0, Skipped: 0, Time elapsed: 12.42 s - in org.apache.phoenix.trace.PhoenixTableMetricsWriterIT
[INFO] Running org.apache.phoenix.tx.TransactionIT
[INFO] Running org.apache.phoenix.trace.PhoenixTracingEndToEndIT
[INFO] Tests run: 34, Failures: 0, Errors: 0, Skipped: 0, Time elapsed: 640.41 s - in org.apache.phoenix.end2end.join.SortMergeJoinLocalIndexIT
[INFO] Running org.apache.phoenix.tx.TxCheckpointIT
[ERROR] Tests run: 11, Failures: 0, Errors: 1, Skipped: 0, Time elapsed: 81.774 s <<<
FAILURE! - in org.apache.phoenix.tx.TransactionIT
[ERROR] testWithMixOfTxProviders[TransactionIT_provider=TEPHRA](org.apache.phoenix.tx.TransactionIT)
 Time elapsed: 4.309 s  <<< ERROR!
java.lang.IllegalArgumentException: No network 'en*'/'eth*' interfaces found
	at org.apache.phoenix.tx.TransactionIT.testWithMixOfTxProviders(TransactionIT.java:142)

[INFO] Running org.apache.phoenix.util.IndexScrutinyIT
[INFO] Tests run: 8, Failures: 0, Errors: 0, Skipped: 0, Time elapsed: 91.86 s - in org.apache.phoenix.trace.PhoenixTracingEndToEndIT
[INFO] Tests run: 3, Failures: 0, Errors: 0, Skipped: 0, Time elapsed: 20.463 s - in org.apache.phoenix.util.IndexScrutinyIT
[ERROR] Tests run: 52, Failures: 4, Errors: 0, Skipped: 0, Time elapsed: 255.212 s <<<
FAILURE! - in org.apache.phoenix.tx.ParameterizedTransactionIT
[ERROR] testNonTxToTxTable[ParameterizedTransactionIT_mutable=false,columnEncoded=false,transactionProvider=TEPHRA](org.apache.phoenix.tx.ParameterizedTransactionIT)
 Time elapsed: 8.197 s  <<< FAILURE!
java.lang.AssertionError
	at org.apache.phoenix.tx.ParameterizedTransactionIT.testNonTxToTxTable(ParameterizedTransactionIT.java:314)

[ERROR] testNonTxToTxTable[ParameterizedTransactionIT_mutable=false,columnEncoded=true,transactionProvider=TEPHRA](org.apache.phoenix.tx.ParameterizedTransactionIT)
 Time elapsed: 7.989 s  <<< FAILURE!
java.lang.AssertionError
	at org.apache.phoenix.tx.ParameterizedTransactionIT.testNonTxToTxTable(ParameterizedTransactionIT.java:314)

[ERROR] testNonTxToTxTable[ParameterizedTransactionIT_mutable=true,columnEncoded=false,transactionProvider=TEPHRA](org.apache.phoenix.tx.ParameterizedTransactionIT)
 Time elapsed: 7.951 s  <<< FAILURE!
java.lang.AssertionError
	at org.apache.phoenix.tx.ParameterizedTransactionIT.testNonTxToTxTable(ParameterizedTransactionIT.java:314)

[ERROR] testNonTxToTxTable[ParameterizedTransactionIT_mutable=true,columnEncoded=true,transactionProvider=TEPHRA](org.apache.phoenix.tx.ParameterizedTransactionIT)
 Time elapsed: 8.052 s  <<< FAILURE!
java.lang.AssertionError
	at org.apache.phoenix.tx.ParameterizedTransactionIT.testNonTxToTxTable(ParameterizedTransactionIT.java:314)

[INFO] Tests run: 40, Failures: 0, Errors: 0, Skipped: 0, Time elapsed: 303.052 s - in org.apache.phoenix.tx.TxCheckpointIT
[INFO] 
[INFO] Results:
[INFO] 
[ERROR] Failures: 
[ERROR]   ParameterizedTransactionIT.testNonTxToTxTable:314
[ERROR]   ParameterizedTransactionIT.testNonTxToTxTable:314
[ERROR]   ParameterizedTransactionIT.testNonTxToTxTable:314
[ERROR]   ParameterizedTransactionIT.testNonTxToTxTable:314
[ERROR] Errors: 
[ERROR]   TransactionIT.testWithMixOfTxProviders:142 ยป IllegalArgument No network 'en*'/...
[INFO] 
[ERROR] Tests run: 3418, Failures: 4, Errors: 1, Skipped: 3
[INFO] 
[INFO] 
[INFO] --- maven-failsafe-plugin:2.20:integration-test (HBaseManagedTimeTests) @ phoenix-core
---
[INFO] 
[INFO] -------------------------------------------------------
[INFO]  T E S T S
[INFO] -------------------------------------------------------
[INFO] 
[INFO] Results:
[INFO] 
[INFO] Tests run: 0, Failures: 0, Errors: 0, Skipped: 0
[INFO] 
[INFO] 
[INFO] --- maven-failsafe-plugin:2.20:integration-test (NeedTheirOwnClusterTests) @ phoenix-core
---
[INFO] 
[INFO] -------------------------------------------------------
[INFO]  T E S T S
[INFO] -------------------------------------------------------
[INFO] Running org.apache.hadoop.hbase.regionserver.wal.WALReplayWithIndexWritesAndCompressedWALIT
[INFO] Running org.apache.phoenix.end2end.ChangePermissionsIT
[INFO] Running org.apache.hadoop.hbase.regionserver.wal.WALRecoveryRegionPostOpenIT
[INFO] Tests run: 1, Failures: 0, Errors: 0, Skipped: 0, Time elapsed: 47.578 s - in org.apache.hadoop.hbase.regionserver.wal.WALReplayWithIndexWritesAndCompressedWALIT
[INFO] Tests run: 1, Failures: 0, Errors: 0, Skipped: 0, Time elapsed: 8.33 s - in org.apache.hadoop.hbase.regionserver.wal.WALRecoveryRegionPostOpenIT
[INFO] Running org.apache.phoenix.end2end.ColumnEncodedImmutableNonTxStatsCollectorIT
[INFO] Running org.apache.phoenix.end2end.ColumnEncodedImmutableTxStatsCollectorIT
[INFO] Running org.apache.phoenix.end2end.ColumnEncodedMutableNonTxStatsCollectorIT
[WARNING] Tests run: 26, Failures: 0, Errors: 0, Skipped: 4, Time elapsed: 142.369 s - in
org.apache.phoenix.end2end.ColumnEncodedImmutableNonTxStatsCollectorIT
[WARNING] Tests run: 26, Failures: 0, Errors: 0, Skipped: 4, Time elapsed: 145.704 s - in
org.apache.phoenix.end2end.ColumnEncodedImmutableTxStatsCollectorIT
[WARNING] Tests run: 26, Failures: 0, Errors: 0, Skipped: 4, Time elapsed: 146.462 s - in
org.apache.phoenix.end2end.ColumnEncodedMutableNonTxStatsCollectorIT
[INFO] Running org.apache.phoenix.end2end.ConnectionUtilIT
[INFO] Running org.apache.phoenix.end2end.ColumnEncodedMutableTxStatsCollectorIT
[INFO] Tests run: 1, Failures: 0, Errors: 0, Skipped: 0, Time elapsed: 41.041 s - in org.apache.phoenix.end2end.ConnectionUtilIT
[INFO] Running org.apache.phoenix.end2end.ContextClassloaderIT
[INFO] Tests run: 3, Failures: 0, Errors: 0, Skipped: 0, Time elapsed: 2.64 s - in org.apache.phoenix.end2end.ContextClassloaderIT
[INFO] Running org.apache.phoenix.end2end.CostBasedDecisionIT
[INFO] Running org.apache.phoenix.end2end.CountDistinctCompressionIT
[INFO] Tests run: 1, Failures: 0, Errors: 0, Skipped: 0, Time elapsed: 2.674 s - in org.apache.phoenix.end2end.CountDistinctCompressionIT
[WARNING] Tests run: 26, Failures: 0, Errors: 0, Skipped: 4, Time elapsed: 139.877 s - in
org.apache.phoenix.end2end.ColumnEncodedMutableTxStatsCollectorIT
[INFO] Running org.apache.phoenix.end2end.CsvBulkLoadToolIT
[INFO] Running org.apache.phoenix.end2end.DropSchemaIT
[INFO] Tests run: 2, Failures: 0, Errors: 0, Skipped: 0, Time elapsed: 23.349 s - in org.apache.phoenix.end2end.DropSchemaIT
[INFO] Tests run: 12, Failures: 0, Errors: 0, Skipped: 0, Time elapsed: 111.094 s - in org.apache.phoenix.end2end.CsvBulkLoadToolIT
[INFO] Running org.apache.phoenix.end2end.FlappingLocalIndexIT
[INFO] Running org.apache.phoenix.end2end.IndexExtendedIT
[INFO] Tests run: 12, Failures: 0, Errors: 0, Skipped: 0, Time elapsed: 171.153 s - in org.apache.phoenix.end2end.FlappingLocalIndexIT
[INFO] Tests run: 32, Failures: 0, Errors: 0, Skipped: 0, Time elapsed: 172.603 s - in org.apache.phoenix.end2end.IndexExtendedIT
[INFO] Running org.apache.phoenix.end2end.IndexScrutinyToolIT
[INFO] Running org.apache.phoenix.end2end.IndexToolForPartialBuildIT
[INFO] Tests run: 12, Failures: 0, Errors: 0, Skipped: 0, Time elapsed: 860.496 s - in org.apache.phoenix.end2end.ChangePermissionsIT
[INFO] Tests run: 1, Failures: 0, Errors: 0, Skipped: 0, Time elapsed: 14.68 s - in org.apache.phoenix.end2end.IndexToolForPartialBuildIT
[INFO] Tests run: 20, Failures: 0, Errors: 0, Skipped: 0, Time elapsed: 522.141 s - in org.apache.phoenix.end2end.CostBasedDecisionIT
[INFO] Running org.apache.phoenix.end2end.IndexToolForPartialBuildWithNamespaceEnabledIT
[INFO] Running org.apache.phoenix.end2end.IndexToolIT
[INFO] Tests run: 2, Failures: 0, Errors: 0, Skipped: 0, Time elapsed: 24.371 s - in org.apache.phoenix.end2end.IndexToolForPartialBuildWithNamespaceEnabledIT
[INFO] Running org.apache.phoenix.end2end.MigrateSystemTablesToSystemNamespaceIT
[INFO] Running org.apache.phoenix.end2end.LocalIndexSplitMergeIT
[INFO] Tests run: 33, Failures: 0, Errors: 0, Skipped: 0, Time elapsed: 413.931 s - in org.apache.phoenix.end2end.IndexScrutinyToolIT
[INFO] Tests run: 4, Failures: 0, Errors: 0, Skipped: 0, Time elapsed: 295.299 s - in org.apache.phoenix.end2end.MigrateSystemTablesToSystemNamespaceIT
[INFO] Running org.apache.phoenix.end2end.NonColumnEncodedImmutableNonTxStatsCollectorIT
[INFO] Running org.apache.phoenix.end2end.NonColumnEncodedImmutableTxStatsCollectorIT
[INFO] Tests run: 3, Failures: 0, Errors: 0, Skipped: 0, Time elapsed: 445.913 s - in org.apache.phoenix.end2end.LocalIndexSplitMergeIT
[WARNING] Tests run: 26, Failures: 0, Errors: 0, Skipped: 4, Time elapsed: 131.998 s - in
org.apache.phoenix.end2end.NonColumnEncodedImmutableNonTxStatsCollectorIT
[WARNING] Tests run: 26, Failures: 0, Errors: 0, Skipped: 4, Time elapsed: 142.037 s - in
org.apache.phoenix.end2end.NonColumnEncodedImmutableTxStatsCollectorIT
[INFO] Running org.apache.phoenix.end2end.PartialResultServerConfigurationIT
[INFO] Running org.apache.phoenix.end2end.PhoenixDriverIT
[INFO] Tests run: 1, Failures: 0, Errors: 0, Skipped: 0, Time elapsed: 44.451 s - in org.apache.phoenix.end2end.PartialResultServerConfigurationIT
[INFO] Running org.apache.phoenix.end2end.QueryLoggerIT
[INFO] Tests run: 4, Failures: 0, Errors: 0, Skipped: 0, Time elapsed: 68.423 s - in org.apache.phoenix.end2end.PhoenixDriverIT
[INFO] Running org.apache.phoenix.end2end.QueryTimeoutIT
[INFO] Tests run: 2, Failures: 0, Errors: 0, Skipped: 0, Time elapsed: 11.781 s - in org.apache.phoenix.end2end.QueryTimeoutIT
[INFO] Tests run: 7, Failures: 0, Errors: 0, Skipped: 0, Time elapsed: 55.694 s - in org.apache.phoenix.end2end.QueryLoggerIT
[INFO] Running org.apache.phoenix.end2end.QueryWithLimitIT
[INFO] Tests run: 2, Failures: 0, Errors: 0, Skipped: 0, Time elapsed: 5.372 s - in org.apache.phoenix.end2end.QueryWithLimitIT
[INFO] Running org.apache.phoenix.end2end.RebuildIndexConnectionPropsIT
[INFO] Tests run: 1, Failures: 0, Errors: 0, Skipped: 0, Time elapsed: 0.553 s - in org.apache.phoenix.end2end.RebuildIndexConnectionPropsIT
[INFO] Running org.apache.phoenix.end2end.RegexBulkLoadToolIT
[INFO] Running org.apache.phoenix.end2end.RenewLeaseIT
[INFO] Tests run: 1, Failures: 0, Errors: 0, Skipped: 0, Time elapsed: 28.521 s - in org.apache.phoenix.end2end.RenewLeaseIT
[INFO] Running org.apache.phoenix.end2end.SequencePointInTimeIT
[INFO] Tests run: 1, Failures: 0, Errors: 0, Skipped: 0, Time elapsed: 0.175 s - in org.apache.phoenix.end2end.SequencePointInTimeIT
[INFO] Tests run: 10, Failures: 0, Errors: 0, Skipped: 0, Time elapsed: 82.955 s - in org.apache.phoenix.end2end.RegexBulkLoadToolIT
[INFO] Running org.apache.phoenix.end2end.SystemCatalogCreationOnConnectionIT
[INFO] Running org.apache.phoenix.end2end.SpillableGroupByIT
[INFO] Tests run: 3, Failures: 0, Errors: 0, Skipped: 0, Time elapsed: 15.686 s - in org.apache.phoenix.end2end.SpillableGroupByIT
[INFO] Running org.apache.phoenix.end2end.SysTableNamespaceMappedStatsCollectorIT
[INFO] Running org.apache.phoenix.end2end.SystemCatalogIT
[INFO] Tests run: 1, Failures: 0, Errors: 0, Skipped: 0, Time elapsed: 121.269 s - in org.apache.phoenix.end2end.SystemCatalogIT
[INFO] Running org.apache.phoenix.end2end.SystemTablePermissionsIT
[WARNING] Tests run: 26, Failures: 0, Errors: 0, Skipped: 4, Time elapsed: 133.08 s - in org.apache.phoenix.end2end.SysTableNamespaceMappedStatsCollectorIT
[INFO] Running org.apache.phoenix.end2end.TableDDLPermissionsIT
[INFO] Tests run: 2, Failures: 0, Errors: 0, Skipped: 0, Time elapsed: 132.399 s - in org.apache.phoenix.end2end.SystemTablePermissionsIT
[INFO] Running org.apache.phoenix.end2end.TableSnapshotReadsMapReduceIT
[INFO] Tests run: 3, Failures: 0, Errors: 0, Skipped: 0, Time elapsed: 25.148 s - in org.apache.phoenix.end2end.TableSnapshotReadsMapReduceIT
[INFO] Running org.apache.phoenix.end2end.UpdateCacheAcrossDifferentClientsIT
[INFO] Tests run: 6, Failures: 0, Errors: 0, Skipped: 0, Time elapsed: 40.819 s - in org.apache.phoenix.end2end.UpdateCacheAcrossDifferentClientsIT
[INFO] Tests run: 96, Failures: 0, Errors: 0, Skipped: 0, Time elapsed: 1,292.448 s - in org.apache.phoenix.end2end.IndexToolIT
[INFO] Running org.apache.phoenix.end2end.UserDefinedFunctionsIT
[INFO] Running org.apache.phoenix.end2end.index.ImmutableIndexIT
[INFO] Tests run: 16, Failures: 0, Errors: 0, Skipped: 0, Time elapsed: 126.661 s - in org.apache.phoenix.end2end.UserDefinedFunctionsIT
[INFO] Tests run: 4, Failures: 0, Errors: 0, Skipped: 0, Time elapsed: 500.206 s - in org.apache.phoenix.end2end.TableDDLPermissionsIT
[INFO] Running org.apache.phoenix.end2end.index.MutableIndexFailureIT
[INFO] Running org.apache.phoenix.end2end.index.LocalIndexIT
[INFO] Tests run: 14, Failures: 0, Errors: 0, Skipped: 0, Time elapsed: 756.047 s - in org.apache.phoenix.end2end.SystemCatalogCreationOnConnectionIT
[INFO] Running org.apache.phoenix.end2end.index.MutableIndexRebuilderIT
[INFO] Tests run: 1, Failures: 0, Errors: 0, Skipped: 0, Time elapsed: 56.767 s - in org.apache.phoenix.end2end.index.MutableIndexRebuilderIT
[INFO] Running org.apache.phoenix.end2end.index.MutableIndexReplicationIT
[INFO] Tests run: 1, Failures: 0, Errors: 0, Skipped: 0, Time elapsed: 35.831 s - in org.apache.phoenix.end2end.index.MutableIndexReplicationIT
[INFO] Running org.apache.phoenix.end2end.index.PartialIndexRebuilderIT
[WARNING] Tests run: 40, Failures: 0, Errors: 0, Skipped: 16, Time elapsed: 388.201 s - in
org.apache.phoenix.end2end.index.ImmutableIndexIT
[INFO] Running org.apache.phoenix.end2end.index.txn.TxWriteFailureIT
[INFO] Tests run: 21, Failures: 0, Errors: 0, Skipped: 0, Time elapsed: 366.817 s - in org.apache.phoenix.end2end.index.MutableIndexFailureIT
[INFO] Tests run: 8, Failures: 0, Errors: 0, Skipped: 0, Time elapsed: 46.244 s - in org.apache.phoenix.end2end.index.txn.TxWriteFailureIT
[INFO] Tests run: 36, Failures: 0, Errors: 0, Skipped: 0, Time elapsed: 427.23 s - in org.apache.phoenix.end2end.index.LocalIndexIT
[INFO] Running org.apache.phoenix.execute.PartialCommitIT
[INFO] Running org.apache.phoenix.execute.UpsertSelectOverlappingBatchesIT
[INFO] Running org.apache.phoenix.hbase.index.FailForUnsupportedHBaseVersionsIT
[INFO] Tests run: 2, Failures: 0, Errors: 0, Skipped: 0, Time elapsed: 24.051 s - in org.apache.phoenix.hbase.index.FailForUnsupportedHBaseVersionsIT
[INFO] Tests run: 6, Failures: 0, Errors: 0, Skipped: 0, Time elapsed: 48.216 s - in org.apache.phoenix.execute.PartialCommitIT
[INFO] Tests run: 3, Failures: 0, Errors: 0, Skipped: 0, Time elapsed: 75.615 s - in org.apache.phoenix.execute.UpsertSelectOverlappingBatchesIT
[INFO] Running org.apache.phoenix.iterate.RoundRobinResultIteratorWithStatsIT
[INFO] Tests run: 1, Failures: 0, Errors: 0, Skipped: 0, Time elapsed: 10.115 s - in org.apache.phoenix.iterate.RoundRobinResultIteratorWithStatsIT
[INFO] Running org.apache.phoenix.iterate.ScannerLeaseRenewalIT
[INFO] Tests run: 25, Failures: 0, Errors: 0, Skipped: 0, Time elapsed: 332.261 s - in org.apache.phoenix.end2end.index.PartialIndexRebuilderIT
[INFO] Running org.apache.phoenix.monitoring.PhoenixMetricsIT
[INFO] Running org.apache.phoenix.rpc.PhoenixClientRpcIT
[INFO] Tests run: 2, Failures: 0, Errors: 0, Skipped: 0, Time elapsed: 7.244 s - in org.apache.phoenix.rpc.PhoenixClientRpcIT
[INFO] Running org.apache.phoenix.rpc.PhoenixServerRpcIT
[INFO] Tests run: 2, Failures: 0, Errors: 0, Skipped: 0, Time elapsed: 19.631 s - in org.apache.phoenix.rpc.PhoenixServerRpcIT
[INFO] Tests run: 22, Failures: 0, Errors: 0, Skipped: 0, Time elapsed: 90.266 s - in org.apache.phoenix.monitoring.PhoenixMetricsIT
[INFO] Tests run: 2, Failures: 0, Errors: 0, Skipped: 0, Time elapsed: 169.22 s - in org.apache.phoenix.iterate.ScannerLeaseRenewalIT
[INFO] 
[INFO] Results:
[INFO] 
[WARNING] Tests run: 668, Failures: 0, Errors: 0, Skipped: 44
[INFO] 
[INFO] 
[INFO] --- maven-failsafe-plugin:2.20:verify (ParallelStatsEnabledTest) @ phoenix-core ---
[INFO] ------------------------------------------------------------------------
[INFO] Reactor Summary:
[INFO] 
[INFO] Apache Phoenix ..................................... SUCCESS [  2.759 s]
[INFO] Phoenix Core ....................................... FAILURE [  02:57 h]
[INFO] Phoenix - Flume .................................... SKIPPED
[INFO] Phoenix - Kafka .................................... SKIPPED
[INFO] Phoenix - Pig ...................................... SKIPPED
[INFO] Phoenix Query Server Client ........................ SKIPPED
[INFO] Phoenix Query Server ............................... SKIPPED
[INFO] Phoenix - Pherf .................................... SKIPPED
[INFO] Phoenix - Spark .................................... SKIPPED
[INFO] Phoenix - Hive ..................................... SKIPPED
[INFO] Phoenix Client ..................................... SKIPPED
[INFO] Phoenix Server ..................................... SKIPPED
[INFO] Phoenix Assembly ................................... SKIPPED
[INFO] Phoenix - Tracing Web Application .................. SKIPPED
[INFO] Phoenix Load Balancer .............................. SKIPPED
[INFO] ------------------------------------------------------------------------
[INFO] BUILD FAILURE
[INFO] ------------------------------------------------------------------------
[INFO] Total time: 02:57 h
[INFO] Finished at: 2018-06-18T09:46:27Z
[INFO] Final Memory: 61M/1002M
[INFO] ------------------------------------------------------------------------
[ERROR] Failed to execute goal org.apache.maven.plugins:maven-failsafe-plugin:2.20:verify
(ParallelStatsEnabledTest) on project phoenix-core: There are test failures.
[ERROR] 
[ERROR] Please refer to <https://builds.apache.org/job/Phoenix-omid2/ws/phoenix-core/target/failsafe-reports>
for the individual test results.
[ERROR] Please refer to dump files (if any exist) [date]-jvmRun[N].dump, [date].dumpstream
and [date]-jvmRun[N].dumpstream.
[ERROR] -> [Help 1]
[ERROR] 
[ERROR] To see the full stack trace of the errors, re-run Maven with the -e switch.
[ERROR] Re-run Maven using the -X switch to enable full debug logging.
[ERROR] 
[ERROR] For more information about the errors and possible solutions, please read the following
articles:
[ERROR] [Help 1] http://cwiki.apache.org/confluence/display/MAVEN/MojoFailureException
[ERROR] 
[ERROR] After correcting the problems, you can resume the build with the command
[ERROR]   mvn <goals> -rf :phoenix-core
Build step 'Invoke top-level Maven targets' marked build as failure
Archiving artifacts
[Fast Archiver] No prior successful build to compare, so performing full copy of artifacts
Recording test results

Mime
View raw message