phoenix-commits mailing list archives

Site index · List index
Message view « Date » · « Thread »
Top « Date » · « Thread »
From Apache Jenkins Server <jenk...@builds.apache.org>
Subject Build failed in Jenkins: Phoenix-omid2 #75
Date Tue, 19 Jun 2018 01:03:28 GMT
See <https://builds.apache.org/job/Phoenix-omid2/75/display/redirect>

------------------------------------------
[...truncated 251.89 KB...]
[INFO] Running org.apache.phoenix.iterate.RoundRobinResultIteratorIT
[INFO] Tests run: 9, Failures: 0, Errors: 0, Skipped: 0, Time elapsed: 76.517 s - in org.apache.phoenix.iterate.RoundRobinResultIteratorIT
[INFO] Running org.apache.phoenix.replication.SystemCatalogWALEntryFilterIT
[INFO] Tests run: 2, Failures: 0, Errors: 0, Skipped: 0, Time elapsed: 0.345 s - in org.apache.phoenix.replication.SystemCatalogWALEntryFilterIT
[INFO] Running org.apache.phoenix.rpc.UpdateCacheIT
[INFO] Tests run: 7, Failures: 0, Errors: 0, Skipped: 0, Time elapsed: 42.866 s - in org.apache.phoenix.rpc.UpdateCacheIT
[INFO] Running org.apache.phoenix.trace.PhoenixTableMetricsWriterIT
[INFO] Tests run: 24, Failures: 0, Errors: 0, Skipped: 0, Time elapsed: 392.327 s - in org.apache.phoenix.end2end.join.SubqueryIT
[INFO] Tests run: 15, Failures: 0, Errors: 0, Skipped: 0, Time elapsed: 280.104 s - in org.apache.phoenix.end2end.join.SubqueryUsingSortMergeJoinIT
[INFO] Tests run: 2, Failures: 0, Errors: 0, Skipped: 0, Time elapsed: 14.535 s - in org.apache.phoenix.trace.PhoenixTableMetricsWriterIT
[INFO] Running org.apache.phoenix.tx.ParameterizedTransactionIT
[INFO] Running org.apache.phoenix.tx.FlappingTransactionIT
[INFO] Running org.apache.phoenix.trace.PhoenixTracingEndToEndIT
[ERROR] Tests run: 4, Failures: 2, Errors: 0, Skipped: 0, Time elapsed: 18.417 s <<<
FAILURE! - in org.apache.phoenix.tx.FlappingTransactionIT
[ERROR] testInflightUpdateNotSeen[FlappingTransactionIT_transactionProvider=OMID](org.apache.phoenix.tx.FlappingTransactionIT)
 Time elapsed: 4.669 s  <<< FAILURE!
java.lang.AssertionError
	at org.apache.phoenix.tx.FlappingTransactionIT.testInflightUpdateNotSeen(FlappingTransactionIT.java:162)

[ERROR] testInflightDeleteNotSeen[FlappingTransactionIT_transactionProvider=OMID](org.apache.phoenix.tx.FlappingTransactionIT)
 Time elapsed: 4.517 s  <<< FAILURE!
java.lang.AssertionError: expected:<2> but was:<1>
	at org.apache.phoenix.tx.FlappingTransactionIT.testInflightDeleteNotSeen(FlappingTransactionIT.java:215)

[INFO] Running org.apache.phoenix.tx.TransactionIT
[INFO] Tests run: 34, Failures: 0, Errors: 0, Skipped: 0, Time elapsed: 817.162 s - in org.apache.phoenix.end2end.join.SortMergeJoinLocalIndexIT
[ERROR] Tests run: 11, Failures: 1, Errors: 0, Skipped: 0, Time elapsed: 75.89 s <<<
FAILURE! - in org.apache.phoenix.tx.TransactionIT
[ERROR] testFailureToRollbackAfterDelete[TransactionIT_provider=OMID](org.apache.phoenix.tx.TransactionIT)
 Time elapsed: 7.363 s  <<< FAILURE!
org.junit.ComparisonFailure: expected:<[a]> but was:<[b]>
	at org.apache.phoenix.tx.TransactionIT.testFailureToRollbackAfterDelete(TransactionIT.java:118)

[INFO] Running org.apache.phoenix.util.IndexScrutinyIT
[INFO] Tests run: 8, Failures: 0, Errors: 0, Skipped: 0, Time elapsed: 104.225 s - in org.apache.phoenix.trace.PhoenixTracingEndToEndIT
[INFO] Running org.apache.phoenix.tx.TxCheckpointIT
[INFO] Tests run: 3, Failures: 0, Errors: 0, Skipped: 0, Time elapsed: 29.445 s - in org.apache.phoenix.util.IndexScrutinyIT
[INFO] Tests run: 26, Failures: 0, Errors: 0, Skipped: 0, Time elapsed: 176.512 s - in org.apache.phoenix.tx.ParameterizedTransactionIT
[INFO] Tests run: 20, Failures: 0, Errors: 0, Skipped: 0, Time elapsed: 231.367 s - in org.apache.phoenix.tx.TxCheckpointIT
[INFO] 
[INFO] Results:
[INFO] 
[ERROR] Failures: 
[ERROR]   FlappingTransactionIT.testInflightDeleteNotSeen:215 expected:<2> but was:<1>
[ERROR]   FlappingTransactionIT.testInflightUpdateNotSeen:162
[ERROR]   TransactionIT.testFailureToRollbackAfterDelete:118 expected:<[a]> but was:<[b]>
[ERROR] Errors: 
[ERROR]   MutableRollbackIT.testCheckpointAndRollback:470 » Commit java.lang.IllegalArgu...
[ERROR]   MutableRollbackIT.testCheckpointAndRollback:470 » Commit java.lang.IllegalArgu...
[INFO] 
[ERROR] Tests run: 3276, Failures: 3, Errors: 2, Skipped: 3
[INFO] 
[INFO] 
[INFO] --- maven-failsafe-plugin:2.20:integration-test (HBaseManagedTimeTests) @ phoenix-core
---
[INFO] 
[INFO] -------------------------------------------------------
[INFO]  T E S T S
[INFO] -------------------------------------------------------
[INFO] 
[INFO] Results:
[INFO] 
[INFO] Tests run: 0, Failures: 0, Errors: 0, Skipped: 0
[INFO] 
[INFO] 
[INFO] --- maven-failsafe-plugin:2.20:integration-test (NeedTheirOwnClusterTests) @ phoenix-core
---
[INFO] 
[INFO] -------------------------------------------------------
[INFO]  T E S T S
[INFO] -------------------------------------------------------
[INFO] Running org.apache.hadoop.hbase.regionserver.wal.WALReplayWithIndexWritesAndCompressedWALIT
[INFO] Running org.apache.phoenix.end2end.ChangePermissionsIT
[INFO] Tests run: 1, Failures: 0, Errors: 0, Skipped: 0, Time elapsed: 47.183 s - in org.apache.hadoop.hbase.regionserver.wal.WALReplayWithIndexWritesAndCompressedWALIT
[INFO] Running org.apache.hadoop.hbase.regionserver.wal.WALRecoveryRegionPostOpenIT
[INFO] Tests run: 1, Failures: 0, Errors: 0, Skipped: 0, Time elapsed: 14.625 s - in org.apache.hadoop.hbase.regionserver.wal.WALRecoveryRegionPostOpenIT
[INFO] Running org.apache.phoenix.end2end.ColumnEncodedImmutableNonTxStatsCollectorIT
[INFO] Running org.apache.phoenix.end2end.ConnectionUtilIT
[INFO] Running org.apache.phoenix.end2end.ColumnEncodedMutableNonTxStatsCollectorIT
[INFO] Tests run: 1, Failures: 0, Errors: 0, Skipped: 0, Time elapsed: 55.77 s - in org.apache.phoenix.end2end.ConnectionUtilIT
[INFO] Running org.apache.phoenix.end2end.ContextClassloaderIT
[INFO] Tests run: 3, Failures: 0, Errors: 0, Skipped: 0, Time elapsed: 4.699 s - in org.apache.phoenix.end2end.ContextClassloaderIT
[WARNING] Tests run: 26, Failures: 0, Errors: 0, Skipped: 4, Time elapsed: 185.686 s - in
org.apache.phoenix.end2end.ColumnEncodedImmutableNonTxStatsCollectorIT
[WARNING] Tests run: 26, Failures: 0, Errors: 0, Skipped: 4, Time elapsed: 188.382 s - in
org.apache.phoenix.end2end.ColumnEncodedMutableNonTxStatsCollectorIT
[INFO] Running org.apache.phoenix.end2end.CostBasedDecisionIT
[INFO] Running org.apache.phoenix.end2end.CountDistinctCompressionIT
[INFO] Tests run: 1, Failures: 0, Errors: 0, Skipped: 0, Time elapsed: 4.746 s - in org.apache.phoenix.end2end.CountDistinctCompressionIT
[INFO] Running org.apache.phoenix.end2end.CsvBulkLoadToolIT
[INFO] Running org.apache.phoenix.end2end.DropSchemaIT
[INFO] Tests run: 2, Failures: 0, Errors: 0, Skipped: 0, Time elapsed: 37.676 s - in org.apache.phoenix.end2end.DropSchemaIT
[INFO] Tests run: 12, Failures: 0, Errors: 0, Skipped: 0, Time elapsed: 116.525 s - in org.apache.phoenix.end2end.CsvBulkLoadToolIT
[INFO] Running org.apache.phoenix.end2end.FlappingLocalIndexIT
[INFO] Running org.apache.phoenix.end2end.IndexExtendedIT
[INFO] Tests run: 32, Failures: 0, Errors: 0, Skipped: 0, Time elapsed: 192.238 s - in org.apache.phoenix.end2end.IndexExtendedIT
[INFO] Tests run: 12, Failures: 0, Errors: 0, Skipped: 0, Time elapsed: 210.691 s - in org.apache.phoenix.end2end.FlappingLocalIndexIT
[INFO] Running org.apache.phoenix.end2end.IndexScrutinyToolIT
[INFO] Running org.apache.phoenix.end2end.IndexToolForPartialBuildIT
[INFO] Tests run: 20, Failures: 0, Errors: 0, Skipped: 0, Time elapsed: 550.898 s - in org.apache.phoenix.end2end.CostBasedDecisionIT
[INFO] Tests run: 1, Failures: 0, Errors: 0, Skipped: 0, Time elapsed: 16.291 s - in org.apache.phoenix.end2end.IndexToolForPartialBuildIT
[INFO] Running org.apache.phoenix.end2end.IndexToolForPartialBuildWithNamespaceEnabledIT
[INFO] Running org.apache.phoenix.end2end.IndexToolIT
[INFO] Tests run: 2, Failures: 0, Errors: 0, Skipped: 0, Time elapsed: 30.032 s - in org.apache.phoenix.end2end.IndexToolForPartialBuildWithNamespaceEnabledIT
[INFO] Running org.apache.phoenix.end2end.LocalIndexSplitMergeIT
[INFO] Tests run: 12, Failures: 0, Errors: 0, Skipped: 0, Time elapsed: 1,288.746 s - in org.apache.phoenix.end2end.ChangePermissionsIT
[INFO] Running org.apache.phoenix.end2end.MigrateSystemTablesToSystemNamespaceIT
[INFO] Tests run: 33, Failures: 0, Errors: 0, Skipped: 0, Time elapsed: 474.068 s - in org.apache.phoenix.end2end.IndexScrutinyToolIT
[INFO] Running org.apache.phoenix.end2end.NonColumnEncodedImmutableNonTxStatsCollectorIT
[INFO] Tests run: 3, Failures: 0, Errors: 0, Skipped: 0, Time elapsed: 424.615 s - in org.apache.phoenix.end2end.LocalIndexSplitMergeIT
[INFO] Running org.apache.phoenix.end2end.NonColumnEncodedImmutableTxStatsCollectorIT
[WARNING] Tests run: 26, Failures: 0, Errors: 0, Skipped: 4, Time elapsed: 175.434 s - in
org.apache.phoenix.end2end.NonColumnEncodedImmutableNonTxStatsCollectorIT
[INFO] Running org.apache.phoenix.end2end.PartialResultServerConfigurationIT
[INFO] Tests run: 4, Failures: 0, Errors: 0, Skipped: 0, Time elapsed: 392.158 s - in org.apache.phoenix.end2end.MigrateSystemTablesToSystemNamespaceIT
[INFO] Tests run: 1, Failures: 0, Errors: 0, Skipped: 0, Time elapsed: 53.783 s - in org.apache.phoenix.end2end.PartialResultServerConfigurationIT
[INFO] Running org.apache.phoenix.end2end.PhoenixDriverIT
[WARNING] Tests run: 26, Failures: 0, Errors: 0, Skipped: 4, Time elapsed: 174.61 s - in org.apache.phoenix.end2end.NonColumnEncodedImmutableTxStatsCollectorIT
[INFO] Running org.apache.phoenix.end2end.QueryLoggerIT
[INFO] Tests run: 4, Failures: 0, Errors: 0, Skipped: 0, Time elapsed: 82.805 s - in org.apache.phoenix.end2end.PhoenixDriverIT
[INFO] Tests run: 7, Failures: 0, Errors: 0, Skipped: 0, Time elapsed: 57.855 s - in org.apache.phoenix.end2end.QueryLoggerIT
[INFO] Running org.apache.phoenix.end2end.QueryTimeoutIT
[INFO] Tests run: 2, Failures: 0, Errors: 0, Skipped: 0, Time elapsed: 13.656 s - in org.apache.phoenix.end2end.QueryTimeoutIT
[INFO] Running org.apache.phoenix.end2end.QueryWithLimitIT
[INFO] Tests run: 2, Failures: 0, Errors: 0, Skipped: 0, Time elapsed: 9.522 s - in org.apache.phoenix.end2end.QueryWithLimitIT
[INFO] Running org.apache.phoenix.end2end.RebuildIndexConnectionPropsIT
[INFO] Tests run: 1, Failures: 0, Errors: 0, Skipped: 0, Time elapsed: 0.689 s - in org.apache.phoenix.end2end.RebuildIndexConnectionPropsIT
[INFO] Running org.apache.phoenix.end2end.RegexBulkLoadToolIT
[INFO] Running org.apache.phoenix.end2end.RenewLeaseIT
[INFO] Tests run: 1, Failures: 0, Errors: 0, Skipped: 0, Time elapsed: 28.529 s - in org.apache.phoenix.end2end.RenewLeaseIT
[INFO] Running org.apache.phoenix.end2end.SequencePointInTimeIT
[INFO] Tests run: 1, Failures: 0, Errors: 0, Skipped: 0, Time elapsed: 0.115 s - in org.apache.phoenix.end2end.SequencePointInTimeIT
[INFO] Tests run: 10, Failures: 0, Errors: 0, Skipped: 0, Time elapsed: 90.044 s - in org.apache.phoenix.end2end.RegexBulkLoadToolIT
[INFO] Running org.apache.phoenix.end2end.SystemCatalogCreationOnConnectionIT
[INFO] Running org.apache.phoenix.end2end.SpillableGroupByIT
[INFO] Tests run: 3, Failures: 0, Errors: 0, Skipped: 0, Time elapsed: 16.512 s - in org.apache.phoenix.end2end.SpillableGroupByIT
[INFO] Running org.apache.phoenix.end2end.SysTableNamespaceMappedStatsCollectorIT
[INFO] Running org.apache.phoenix.end2end.SystemCatalogIT
[WARNING] Tests run: 13, Failures: 0, Errors: 0, Skipped: 2, Time elapsed: 83.552 s - in org.apache.phoenix.end2end.SysTableNamespaceMappedStatsCollectorIT
[INFO] Running org.apache.phoenix.end2end.SystemTablePermissionsIT
[INFO] Tests run: 1, Failures: 0, Errors: 0, Skipped: 0, Time elapsed: 162.209 s - in org.apache.phoenix.end2end.SystemCatalogIT
[INFO] Running org.apache.phoenix.end2end.TableDDLPermissionsIT
[INFO] Tests run: 2, Failures: 0, Errors: 0, Skipped: 0, Time elapsed: 134.722 s - in org.apache.phoenix.end2end.SystemTablePermissionsIT
[INFO] Running org.apache.phoenix.end2end.TableSnapshotReadsMapReduceIT
[INFO] Tests run: 3, Failures: 0, Errors: 0, Skipped: 0, Time elapsed: 28.049 s - in org.apache.phoenix.end2end.TableSnapshotReadsMapReduceIT
[INFO] Running org.apache.phoenix.end2end.UpdateCacheAcrossDifferentClientsIT
[INFO] Tests run: 6, Failures: 0, Errors: 0, Skipped: 0, Time elapsed: 58.462 s - in org.apache.phoenix.end2end.UpdateCacheAcrossDifferentClientsIT
[INFO] Running org.apache.phoenix.end2end.UserDefinedFunctionsIT
[INFO] Tests run: 96, Failures: 0, Errors: 0, Skipped: 0, Time elapsed: 1,649.567 s - in org.apache.phoenix.end2end.IndexToolIT
[INFO] Running org.apache.phoenix.end2end.index.ImmutableIndexIT
[INFO] Tests run: 16, Failures: 0, Errors: 0, Skipped: 0, Time elapsed: 173.937 s - in org.apache.phoenix.end2end.UserDefinedFunctionsIT
[INFO] Tests run: 4, Failures: 0, Errors: 0, Skipped: 0, Time elapsed: 581.828 s - in org.apache.phoenix.end2end.TableDDLPermissionsIT
[INFO] Running org.apache.phoenix.end2end.index.LocalIndexIT
[INFO] Running org.apache.phoenix.end2end.index.MutableIndexFailureIT
[INFO] Tests run: 14, Failures: 0, Errors: 0, Skipped: 0, Time elapsed: 919.552 s - in org.apache.phoenix.end2end.SystemCatalogCreationOnConnectionIT
[INFO] Running org.apache.phoenix.end2end.index.MutableIndexRebuilderIT
[INFO] Tests run: 1, Failures: 0, Errors: 0, Skipped: 0, Time elapsed: 70.256 s - in org.apache.phoenix.end2end.index.MutableIndexRebuilderIT
[INFO] Running org.apache.phoenix.end2end.index.MutableIndexReplicationIT
[WARNING] Tests run: 30, Failures: 0, Errors: 0, Skipped: 12, Time elapsed: 373.152 s - in
org.apache.phoenix.end2end.index.ImmutableIndexIT
[INFO] Tests run: 1, Failures: 0, Errors: 0, Skipped: 0, Time elapsed: 43.238 s - in org.apache.phoenix.end2end.index.MutableIndexReplicationIT
[INFO] Running org.apache.phoenix.end2end.index.PartialIndexRebuilderIT
[INFO] Running org.apache.phoenix.end2end.index.txn.TxWriteFailureIT
[INFO] Tests run: 8, Failures: 0, Errors: 0, Skipped: 0, Time elapsed: 54.06 s - in org.apache.phoenix.end2end.index.txn.TxWriteFailureIT
[ERROR] Tests run: 21, Failures: 4, Errors: 0, Skipped: 0, Time elapsed: 447.111 s <<<
FAILURE! - in org.apache.phoenix.end2end.index.MutableIndexFailureIT
[ERROR] testIndexWriteFailure[MutableIndexFailureIT_transactionProvider=OMID,localIndex=true,isNamespaceMapped=false,disableIndexOnWriteFailure=false,failRebuildTask=false,throwIndexWriteFailure=null](org.apache.phoenix.end2end.index.MutableIndexFailureIT)
 Time elapsed: 15.492 s  <<< FAILURE!
org.junit.ComparisonFailure: expected:<a[]> but was:<a[3]>
	at org.apache.phoenix.end2end.index.MutableIndexFailureIT.validateDataWithIndex(MutableIndexFailureIT.java:427)
	at org.apache.phoenix.end2end.index.MutableIndexFailureIT.testIndexWriteFailure(MutableIndexFailureIT.java:359)

[ERROR] testIndexWriteFailure[MutableIndexFailureIT_transactionProvider=OMID,localIndex=true,isNamespaceMapped=true,disableIndexOnWriteFailure=false,failRebuildTask=false,throwIndexWriteFailure=null](org.apache.phoenix.end2end.index.MutableIndexFailureIT)
 Time elapsed: 18.576 s  <<< FAILURE!
org.junit.ComparisonFailure: expected:<a[]> but was:<a[3]>
	at org.apache.phoenix.end2end.index.MutableIndexFailureIT.validateDataWithIndex(MutableIndexFailureIT.java:427)
	at org.apache.phoenix.end2end.index.MutableIndexFailureIT.testIndexWriteFailure(MutableIndexFailureIT.java:359)

[ERROR] testIndexWriteFailure[MutableIndexFailureIT_transactionProvider=OMID,localIndex=false,isNamespaceMapped=false,disableIndexOnWriteFailure=false,failRebuildTask=false,throwIndexWriteFailure=null](org.apache.phoenix.end2end.index.MutableIndexFailureIT)
 Time elapsed: 21.006 s  <<< FAILURE!
org.junit.ComparisonFailure: expected:<a[]> but was:<a[3]>
	at org.apache.phoenix.end2end.index.MutableIndexFailureIT.validateDataWithIndex(MutableIndexFailureIT.java:427)
	at org.apache.phoenix.end2end.index.MutableIndexFailureIT.testIndexWriteFailure(MutableIndexFailureIT.java:359)

[ERROR] testIndexWriteFailure[MutableIndexFailureIT_transactionProvider=OMID,localIndex=false,isNamespaceMapped=true,disableIndexOnWriteFailure=false,failRebuildTask=false,throwIndexWriteFailure=null](org.apache.phoenix.end2end.index.MutableIndexFailureIT)
 Time elapsed: 19.868 s  <<< FAILURE!
org.junit.ComparisonFailure: expected:<a[]> but was:<a[3]>
	at org.apache.phoenix.end2end.index.MutableIndexFailureIT.validateDataWithIndex(MutableIndexFailureIT.java:427)
	at org.apache.phoenix.end2end.index.MutableIndexFailureIT.testIndexWriteFailure(MutableIndexFailureIT.java:359)

[INFO] Tests run: 36, Failures: 0, Errors: 0, Skipped: 0, Time elapsed: 497.458 s - in org.apache.phoenix.end2end.index.LocalIndexIT
[INFO] Running org.apache.phoenix.execute.PartialCommitIT
[INFO] Running org.apache.phoenix.hbase.index.FailForUnsupportedHBaseVersionsIT
[INFO] Tests run: 2, Failures: 0, Errors: 0, Skipped: 0, Time elapsed: 37.009 s - in org.apache.phoenix.hbase.index.FailForUnsupportedHBaseVersionsIT
[INFO] Running org.apache.phoenix.execute.UpsertSelectOverlappingBatchesIT
[INFO] Tests run: 6, Failures: 0, Errors: 0, Skipped: 0, Time elapsed: 80.706 s - in org.apache.phoenix.execute.PartialCommitIT
[INFO] Running org.apache.phoenix.iterate.RoundRobinResultIteratorWithStatsIT
[INFO] Tests run: 1, Failures: 0, Errors: 0, Skipped: 0, Time elapsed: 10.075 s - in org.apache.phoenix.iterate.RoundRobinResultIteratorWithStatsIT
[INFO] Running org.apache.phoenix.iterate.ScannerLeaseRenewalIT
[INFO] Tests run: 3, Failures: 0, Errors: 0, Skipped: 0, Time elapsed: 77.621 s - in org.apache.phoenix.execute.UpsertSelectOverlappingBatchesIT
[INFO] Running org.apache.phoenix.monitoring.PhoenixMetricsIT
[INFO] Running org.apache.phoenix.rpc.PhoenixClientRpcIT
[INFO] Tests run: 2, Failures: 0, Errors: 0, Skipped: 0, Time elapsed: 7.528 s - in org.apache.phoenix.rpc.PhoenixClientRpcIT
[INFO] Tests run: 25, Failures: 0, Errors: 0, Skipped: 0, Time elapsed: 383.506 s - in org.apache.phoenix.end2end.index.PartialIndexRebuilderIT
[INFO] Running org.apache.phoenix.rpc.PhoenixServerRpcIT
[INFO] Tests run: 2, Failures: 0, Errors: 0, Skipped: 0, Time elapsed: 20.181 s - in org.apache.phoenix.rpc.PhoenixServerRpcIT
[INFO] Tests run: 22, Failures: 0, Errors: 0, Skipped: 0, Time elapsed: 118.869 s - in org.apache.phoenix.monitoring.PhoenixMetricsIT
[INFO] Tests run: 2, Failures: 0, Errors: 0, Skipped: 0, Time elapsed: 169.371 s - in org.apache.phoenix.iterate.ScannerLeaseRenewalIT
[INFO] 
[INFO] Results:
[INFO] 
[ERROR] Failures: 
[ERROR]   MutableIndexFailureIT.testIndexWriteFailure:359->validateDataWithIndex:427 expected:<a[]>
but was:<a[3]>
[ERROR]   MutableIndexFailureIT.testIndexWriteFailure:359->validateDataWithIndex:427 expected:<a[]>
but was:<a[3]>
[ERROR]   MutableIndexFailureIT.testIndexWriteFailure:359->validateDataWithIndex:427 expected:<a[]>
but was:<a[3]>
[ERROR]   MutableIndexFailureIT.testIndexWriteFailure:359->validateDataWithIndex:427 expected:<a[]>
but was:<a[3]>
[INFO] 
[ERROR] Tests run: 593, Failures: 4, Errors: 0, Skipped: 30
[INFO] 
[INFO] 
[INFO] --- maven-failsafe-plugin:2.20:verify (ParallelStatsEnabledTest) @ phoenix-core ---
[INFO] ------------------------------------------------------------------------
[INFO] Reactor Summary:
[INFO] 
[INFO] Apache Phoenix ..................................... SUCCESS [  3.162 s]
[INFO] Phoenix Core ....................................... FAILURE [  03:33 h]
[INFO] Phoenix - Flume .................................... SKIPPED
[INFO] Phoenix - Kafka .................................... SKIPPED
[INFO] Phoenix - Pig ...................................... SKIPPED
[INFO] Phoenix Query Server Client ........................ SKIPPED
[INFO] Phoenix Query Server ............................... SKIPPED
[INFO] Phoenix - Pherf .................................... SKIPPED
[INFO] Phoenix - Spark .................................... SKIPPED
[INFO] Phoenix - Hive ..................................... SKIPPED
[INFO] Phoenix Client ..................................... SKIPPED
[INFO] Phoenix Server ..................................... SKIPPED
[INFO] Phoenix Assembly ................................... SKIPPED
[INFO] Phoenix - Tracing Web Application .................. SKIPPED
[INFO] Phoenix Load Balancer .............................. SKIPPED
[INFO] ------------------------------------------------------------------------
[INFO] BUILD FAILURE
[INFO] ------------------------------------------------------------------------
[INFO] Total time: 03:33 h
[INFO] Finished at: 2018-06-19T00:55:15Z
[INFO] Final Memory: 61M/915M
[INFO] ------------------------------------------------------------------------
[ERROR] Failed to execute goal org.apache.maven.plugins:maven-failsafe-plugin:2.20:verify
(ParallelStatsEnabledTest) on project phoenix-core: There are test failures.
[ERROR] 
[ERROR] Please refer to <https://builds.apache.org/job/Phoenix-omid2/ws/phoenix-core/target/failsafe-reports>
for the individual test results.
[ERROR] Please refer to dump files (if any exist) [date]-jvmRun[N].dump, [date].dumpstream
and [date]-jvmRun[N].dumpstream.
[ERROR] -> [Help 1]
[ERROR] 
[ERROR] To see the full stack trace of the errors, re-run Maven with the -e switch.
[ERROR] Re-run Maven using the -X switch to enable full debug logging.
[ERROR] 
[ERROR] For more information about the errors and possible solutions, please read the following
articles:
[ERROR] [Help 1] http://cwiki.apache.org/confluence/display/MAVEN/MojoFailureException
[ERROR] 
[ERROR] After correcting the problems, you can resume the build with the command
[ERROR]   mvn <goals> -rf :phoenix-core
Build step 'Invoke top-level Maven targets' marked build as failure
Archiving artifacts
[Fast Archiver] Compressed 909.76 MB of artifacts by 12.3% relative to #71
Recording test results

Mime
View raw message