phoenix-commits mailing list archives

Site index · List index
Message view « Date » · « Thread »
Top « Date » · « Thread »
From Apache Jenkins Server <jenk...@builds.apache.org>
Subject Build failed in Jenkins: Phoenix-omid2 #67
Date Sun, 17 Jun 2018 23:48:01 GMT
See <https://builds.apache.org/job/Phoenix-omid2/67/display/redirect>

------------------------------------------
[...truncated 258.70 KB...]
[INFO] Tests run: 0, Failures: 0, Errors: 0, Skipped: 0
[INFO] 
[INFO] 
[INFO] --- maven-failsafe-plugin:2.20:integration-test (NeedTheirOwnClusterTests) @ phoenix-core
---
[INFO] 
[INFO] -------------------------------------------------------
[INFO]  T E S T S
[INFO] -------------------------------------------------------
[INFO] Running org.apache.hadoop.hbase.regionserver.wal.WALReplayWithIndexWritesAndCompressedWALIT
[INFO] Running org.apache.phoenix.end2end.ChangePermissionsIT
[INFO] Running org.apache.hadoop.hbase.regionserver.wal.WALRecoveryRegionPostOpenIT
[INFO] Tests run: 1, Failures: 0, Errors: 0, Skipped: 0, Time elapsed: 27.258 s - in org.apache.hadoop.hbase.regionserver.wal.WALReplayWithIndexWritesAndCompressedWALIT
[INFO] Tests run: 1, Failures: 0, Errors: 0, Skipped: 0, Time elapsed: 5.908 s - in org.apache.hadoop.hbase.regionserver.wal.WALRecoveryRegionPostOpenIT
[INFO] Running org.apache.phoenix.end2end.ColumnEncodedImmutableNonTxStatsCollectorIT
[INFO] Running org.apache.phoenix.end2end.ConnectionUtilIT
[INFO] Running org.apache.phoenix.end2end.ColumnEncodedMutableNonTxStatsCollectorIT
[INFO] Tests run: 1, Failures: 0, Errors: 0, Skipped: 0, Time elapsed: 24.169 s - in org.apache.phoenix.end2end.ConnectionUtilIT
[INFO] Running org.apache.phoenix.end2end.ContextClassloaderIT
[INFO] Tests run: 3, Failures: 0, Errors: 0, Skipped: 0, Time elapsed: 2.561 s - in org.apache.phoenix.end2end.ContextClassloaderIT
[WARNING] Tests run: 26, Failures: 0, Errors: 0, Skipped: 4, Time elapsed: 104.045 s - in
org.apache.phoenix.end2end.ColumnEncodedImmutableNonTxStatsCollectorIT
[INFO] Running org.apache.phoenix.end2end.CostBasedDecisionIT
[WARNING] Tests run: 26, Failures: 0, Errors: 0, Skipped: 4, Time elapsed: 102.685 s - in
org.apache.phoenix.end2end.ColumnEncodedMutableNonTxStatsCollectorIT
[INFO] Running org.apache.phoenix.end2end.CountDistinctCompressionIT
[INFO] Tests run: 1, Failures: 0, Errors: 0, Skipped: 0, Time elapsed: 2.503 s - in org.apache.phoenix.end2end.CountDistinctCompressionIT
[INFO] Running org.apache.phoenix.end2end.CsvBulkLoadToolIT
[INFO] Running org.apache.phoenix.end2end.DropSchemaIT
[INFO] Tests run: 2, Failures: 0, Errors: 0, Skipped: 0, Time elapsed: 18.076 s - in org.apache.phoenix.end2end.DropSchemaIT
[INFO] Tests run: 12, Failures: 0, Errors: 0, Skipped: 0, Time elapsed: 81.198 s - in org.apache.phoenix.end2end.CsvBulkLoadToolIT
[INFO] Running org.apache.phoenix.end2end.FlappingLocalIndexIT
[INFO] Running org.apache.phoenix.end2end.IndexExtendedIT
[INFO] Tests run: 12, Failures: 0, Errors: 0, Skipped: 0, Time elapsed: 139.108 s - in org.apache.phoenix.end2end.FlappingLocalIndexIT
[INFO] Tests run: 32, Failures: 0, Errors: 0, Skipped: 0, Time elapsed: 137.926 s - in org.apache.phoenix.end2end.IndexExtendedIT
[INFO] Tests run: 20, Failures: 0, Errors: 0, Skipped: 0, Time elapsed: 333.404 s - in org.apache.phoenix.end2end.CostBasedDecisionIT
[INFO] Running org.apache.phoenix.end2end.IndexScrutinyToolIT
[INFO] Running org.apache.phoenix.end2end.IndexToolForPartialBuildIT
[INFO] Tests run: 1, Failures: 0, Errors: 0, Skipped: 0, Time elapsed: 9.611 s - in org.apache.phoenix.end2end.IndexToolForPartialBuildIT
[INFO] Running org.apache.phoenix.end2end.IndexToolForPartialBuildWithNamespaceEnabledIT
[INFO] Tests run: 2, Failures: 0, Errors: 0, Skipped: 0, Time elapsed: 18.982 s - in org.apache.phoenix.end2end.IndexToolForPartialBuildWithNamespaceEnabledIT
[INFO] Running org.apache.phoenix.end2end.IndexToolIT
[INFO] Tests run: 12, Failures: 0, Errors: 0, Skipped: 0, Time elapsed: 584.136 s - in org.apache.phoenix.end2end.ChangePermissionsIT
[INFO] Running org.apache.phoenix.end2end.MigrateSystemTablesToSystemNamespaceIT
[INFO] Running org.apache.phoenix.end2end.LocalIndexSplitMergeIT
[INFO] Tests run: 33, Failures: 0, Errors: 0, Skipped: 0, Time elapsed: 330.363 s - in org.apache.phoenix.end2end.IndexScrutinyToolIT
[INFO] Tests run: 4, Failures: 0, Errors: 0, Skipped: 0, Time elapsed: 246.874 s - in org.apache.phoenix.end2end.MigrateSystemTablesToSystemNamespaceIT
[INFO] Running org.apache.phoenix.end2end.NonColumnEncodedImmutableNonTxStatsCollectorIT
[INFO] Running org.apache.phoenix.end2end.NonColumnEncodedImmutableTxStatsCollectorIT
[WARNING] Tests run: 26, Failures: 0, Errors: 0, Skipped: 4, Time elapsed: 101.233 s - in
org.apache.phoenix.end2end.NonColumnEncodedImmutableNonTxStatsCollectorIT
[WARNING] Tests run: 26, Failures: 0, Errors: 0, Skipped: 4, Time elapsed: 106.777 s - in
org.apache.phoenix.end2end.NonColumnEncodedImmutableTxStatsCollectorIT
[INFO] Running org.apache.phoenix.end2end.PartialResultServerConfigurationIT
[INFO] Running org.apache.phoenix.end2end.PhoenixDriverIT
[INFO] Tests run: 1, Failures: 0, Errors: 0, Skipped: 0, Time elapsed: 36.466 s - in org.apache.phoenix.end2end.PartialResultServerConfigurationIT
[INFO] Tests run: 4, Failures: 0, Errors: 0, Skipped: 0, Time elapsed: 49.852 s - in org.apache.phoenix.end2end.PhoenixDriverIT
[INFO] Tests run: 3, Failures: 0, Errors: 0, Skipped: 0, Time elapsed: 460.067 s - in org.apache.phoenix.end2end.LocalIndexSplitMergeIT
[INFO] Running org.apache.phoenix.end2end.QueryLoggerIT
[INFO] Running org.apache.phoenix.end2end.QueryTimeoutIT
[INFO] Running org.apache.phoenix.end2end.QueryWithLimitIT
[INFO] Tests run: 2, Failures: 0, Errors: 0, Skipped: 0, Time elapsed: 8.424 s - in org.apache.phoenix.end2end.QueryTimeoutIT
[INFO] Tests run: 2, Failures: 0, Errors: 0, Skipped: 0, Time elapsed: 4.927 s - in org.apache.phoenix.end2end.QueryWithLimitIT
[INFO] Tests run: 7, Failures: 0, Errors: 0, Skipped: 0, Time elapsed: 52.17 s - in org.apache.phoenix.end2end.QueryLoggerIT
[INFO] Running org.apache.phoenix.end2end.RebuildIndexConnectionPropsIT
[INFO] Tests run: 1, Failures: 0, Errors: 0, Skipped: 0, Time elapsed: 0.387 s - in org.apache.phoenix.end2end.RebuildIndexConnectionPropsIT
[INFO] Running org.apache.phoenix.end2end.RegexBulkLoadToolIT
[INFO] Running org.apache.phoenix.end2end.RenewLeaseIT
[INFO] Running org.apache.phoenix.end2end.SequencePointInTimeIT
[INFO] Tests run: 1, Failures: 0, Errors: 0, Skipped: 0, Time elapsed: 0.085 s - in org.apache.phoenix.end2end.SequencePointInTimeIT
[INFO] Tests run: 1, Failures: 0, Errors: 0, Skipped: 0, Time elapsed: 26.376 s - in org.apache.phoenix.end2end.RenewLeaseIT
[INFO] Tests run: 10, Failures: 0, Errors: 0, Skipped: 0, Time elapsed: 69.055 s - in org.apache.phoenix.end2end.RegexBulkLoadToolIT
[INFO] Running org.apache.phoenix.end2end.SystemCatalogCreationOnConnectionIT
[INFO] Running org.apache.phoenix.end2end.SpillableGroupByIT
[INFO] Running org.apache.phoenix.end2end.SysTableNamespaceMappedStatsCollectorIT
[INFO] Tests run: 3, Failures: 0, Errors: 0, Skipped: 0, Time elapsed: 9.714 s - in org.apache.phoenix.end2end.SpillableGroupByIT
[INFO] Running org.apache.phoenix.end2end.SystemCatalogIT
[WARNING] Tests run: 13, Failures: 0, Errors: 0, Skipped: 2, Time elapsed: 47.963 s - in org.apache.phoenix.end2end.SysTableNamespaceMappedStatsCollectorIT
[INFO] Running org.apache.phoenix.end2end.SystemTablePermissionsIT
[INFO] Tests run: 1, Failures: 0, Errors: 0, Skipped: 0, Time elapsed: 88.446 s - in org.apache.phoenix.end2end.SystemCatalogIT
[INFO] Running org.apache.phoenix.end2end.TableDDLPermissionsIT
[INFO] Tests run: 2, Failures: 0, Errors: 0, Skipped: 0, Time elapsed: 74.244 s - in org.apache.phoenix.end2end.SystemTablePermissionsIT
[INFO] Running org.apache.phoenix.end2end.TableSnapshotReadsMapReduceIT
[INFO] Tests run: 3, Failures: 0, Errors: 0, Skipped: 0, Time elapsed: 18.544 s - in org.apache.phoenix.end2end.TableSnapshotReadsMapReduceIT
[INFO] Running org.apache.phoenix.end2end.UpdateCacheAcrossDifferentClientsIT
[INFO] Tests run: 6, Failures: 0, Errors: 0, Skipped: 0, Time elapsed: 33.043 s - in org.apache.phoenix.end2end.UpdateCacheAcrossDifferentClientsIT
[INFO] Running org.apache.phoenix.end2end.UserDefinedFunctionsIT
[INFO] Tests run: 96, Failures: 0, Errors: 0, Skipped: 0, Time elapsed: 1,101.83 s - in org.apache.phoenix.end2end.IndexToolIT
[INFO] Tests run: 16, Failures: 0, Errors: 0, Skipped: 0, Time elapsed: 112.799 s - in org.apache.phoenix.end2end.UserDefinedFunctionsIT
[INFO] Tests run: 4, Failures: 0, Errors: 0, Skipped: 0, Time elapsed: 343.276 s - in org.apache.phoenix.end2end.TableDDLPermissionsIT
[INFO] Running org.apache.phoenix.end2end.index.ImmutableIndexIT
[INFO] Running org.apache.phoenix.end2end.index.MutableIndexFailureIT
[INFO] Running org.apache.phoenix.end2end.index.LocalIndexIT
[INFO] Tests run: 14, Failures: 0, Errors: 0, Skipped: 0, Time elapsed: 592.628 s - in org.apache.phoenix.end2end.SystemCatalogCreationOnConnectionIT
[INFO] Running org.apache.phoenix.end2end.index.MutableIndexRebuilderIT
[INFO] Tests run: 1, Failures: 0, Errors: 0, Skipped: 0, Time elapsed: 38.686 s - in org.apache.phoenix.end2end.index.MutableIndexRebuilderIT
[INFO] Running org.apache.phoenix.end2end.index.MutableIndexReplicationIT
[INFO] Tests run: 1, Failures: 0, Errors: 0, Skipped: 0, Time elapsed: 24.849 s - in org.apache.phoenix.end2end.index.MutableIndexReplicationIT
[INFO] Running org.apache.phoenix.end2end.index.PartialIndexRebuilderIT
[ERROR] Tests run: 21, Failures: 1, Errors: 12, Skipped: 0, Time elapsed: 246.833 s <<<
FAILURE! - in org.apache.phoenix.end2end.index.MutableIndexFailureIT
[ERROR] testIndexWriteFailure[MutableIndexFailureIT_transactionProvider=null,localIndex=false,isNamespaceMapped=true,disableIndexOnWriteFailure=true,failRebuildTask=false,throwIndexWriteFailure=null](org.apache.phoenix.end2end.index.MutableIndexFailureIT)
 Time elapsed: 10.919 s  <<< ERROR!
org.apache.hadoop.hbase.TableNotFoundException: Table 'T000002.A_FAIL_IDX' was not found,
got: T000001.FAIL_TABLE.
	at org.apache.phoenix.end2end.index.MutableIndexFailureIT.updateTable(MutableIndexFailureIT.java:473)
	at org.apache.phoenix.end2end.index.MutableIndexFailureIT.testIndexWriteFailure(MutableIndexFailureIT.java:297)

[ERROR] testIndexWriteFailure[MutableIndexFailureIT_transactionProvider=null,localIndex=false,isNamespaceMapped=true,disableIndexOnWriteFailure=true,failRebuildTask=false,throwIndexWriteFailure=true](org.apache.phoenix.end2end.index.MutableIndexFailureIT)
 Time elapsed: 10.853 s  <<< ERROR!
org.apache.hadoop.hbase.TableNotFoundException: Table 'T000003.A_FAIL_IDX' was not found,
got: T000002:FAIL_TABLE.
	at org.apache.phoenix.end2end.index.MutableIndexFailureIT.updateTable(MutableIndexFailureIT.java:473)
	at org.apache.phoenix.end2end.index.MutableIndexFailureIT.testIndexWriteFailure(MutableIndexFailureIT.java:297)

[ERROR] testIndexWriteFailure[MutableIndexFailureIT_transactionProvider=null,localIndex=true,isNamespaceMapped=true,disableIndexOnWriteFailure=true,failRebuildTask=false,throwIndexWriteFailure=null](org.apache.phoenix.end2end.index.MutableIndexFailureIT)
 Time elapsed: 9.669 s  <<< ERROR!
org.apache.hadoop.hbase.TableNotFoundException: Table 'T000005.A_FAIL_IDX' was not found,
got: T000004.FAIL_TABLE.
	at org.apache.phoenix.end2end.index.MutableIndexFailureIT.updateTable(MutableIndexFailureIT.java:473)
	at org.apache.phoenix.end2end.index.MutableIndexFailureIT.testIndexWriteFailure(MutableIndexFailureIT.java:297)

[ERROR] testIndexWriteFailure[MutableIndexFailureIT_transactionProvider=null,localIndex=true,isNamespaceMapped=false,disableIndexOnWriteFailure=null,failRebuildTask=false,throwIndexWriteFailure=null](org.apache.phoenix.end2end.index.MutableIndexFailureIT)
 Time elapsed: 8.715 s  <<< ERROR!
org.apache.hadoop.hbase.TableNotFoundException: Table 'T000006.A_FAIL_IDX' was not found,
got: T000005:FAIL_TABLE.
	at org.apache.phoenix.end2end.index.MutableIndexFailureIT.updateTable(MutableIndexFailureIT.java:473)
	at org.apache.phoenix.end2end.index.MutableIndexFailureIT.testIndexWriteFailure(MutableIndexFailureIT.java:297)

[ERROR] testIndexWriteFailure[MutableIndexFailureIT_transactionProvider=OMID,localIndex=true,isNamespaceMapped=false,disableIndexOnWriteFailure=false,failRebuildTask=false,throwIndexWriteFailure=null](org.apache.phoenix.end2end.index.MutableIndexFailureIT)
 Time elapsed: 9.964 s  <<< ERROR!
org.apache.hadoop.hbase.TableNotFoundException: Table 'T000007.A_FAIL_IDX' was not found,
got: T000006.FAIL_TABLE.
	at org.apache.phoenix.end2end.index.MutableIndexFailureIT.updateTable(MutableIndexFailureIT.java:473)
	at org.apache.phoenix.end2end.index.MutableIndexFailureIT.testIndexWriteFailure(MutableIndexFailureIT.java:297)

[ERROR] testIndexWriteFailure[MutableIndexFailureIT_transactionProvider=OMID,localIndex=true,isNamespaceMapped=true,disableIndexOnWriteFailure=false,failRebuildTask=false,throwIndexWriteFailure=null](org.apache.phoenix.end2end.index.MutableIndexFailureIT)
 Time elapsed: 10.904 s  <<< ERROR!
org.apache.hadoop.hbase.TableNotFoundException: Table 'T000008.A_FAIL_IDX' was not found,
got: T000007.FAIL_TABLE.
	at org.apache.phoenix.end2end.index.MutableIndexFailureIT.updateTable(MutableIndexFailureIT.java:473)
	at org.apache.phoenix.end2end.index.MutableIndexFailureIT.testIndexWriteFailure(MutableIndexFailureIT.java:297)

[ERROR] testIndexWriteFailure[MutableIndexFailureIT_transactionProvider=OMID,localIndex=false,isNamespaceMapped=false,disableIndexOnWriteFailure=false,failRebuildTask=false,throwIndexWriteFailure=null](org.apache.phoenix.end2end.index.MutableIndexFailureIT)
 Time elapsed: 11.605 s  <<< FAILURE!
org.junit.ComparisonFailure: expected:<a[]> but was:<a[3]>
	at org.apache.phoenix.end2end.index.MutableIndexFailureIT.validateDataWithIndex(MutableIndexFailureIT.java:428)
	at org.apache.phoenix.end2end.index.MutableIndexFailureIT.testIndexWriteFailure(MutableIndexFailureIT.java:359)

[ERROR] testIndexWriteFailure[MutableIndexFailureIT_transactionProvider=OMID,localIndex=false,isNamespaceMapped=true,disableIndexOnWriteFailure=false,failRebuildTask=false,throwIndexWriteFailure=null](org.apache.phoenix.end2end.index.MutableIndexFailureIT)
 Time elapsed: 12.123 s  <<< ERROR!
org.apache.hadoop.hbase.TableNotFoundException: Table 'T000010.A_FAIL_IDX' was not found,
got: T000009.FAIL_TABLE.
	at org.apache.phoenix.end2end.index.MutableIndexFailureIT.updateTable(MutableIndexFailureIT.java:473)
	at org.apache.phoenix.end2end.index.MutableIndexFailureIT.testIndexWriteFailure(MutableIndexFailureIT.java:297)

[ERROR] testIndexWriteFailure[MutableIndexFailureIT_transactionProvider=null,localIndex=true,isNamespaceMapped=false,disableIndexOnWriteFailure=false,failRebuildTask=false,throwIndexWriteFailure=null](org.apache.phoenix.end2end.index.MutableIndexFailureIT)
 Time elapsed: 8.555 s  <<< ERROR!
org.apache.hadoop.hbase.TableNotFoundException: Table 'T000012.A_FAIL_IDX' was not found,
got: T000011.FAIL_TABLE.
	at org.apache.phoenix.end2end.index.MutableIndexFailureIT.updateTable(MutableIndexFailureIT.java:473)
	at org.apache.phoenix.end2end.index.MutableIndexFailureIT.testIndexWriteFailure(MutableIndexFailureIT.java:297)

[ERROR] testIndexWriteFailure[MutableIndexFailureIT_transactionProvider=null,localIndex=true,isNamespaceMapped=false,disableIndexOnWriteFailure=true,failRebuildTask=false,throwIndexWriteFailure=null](org.apache.phoenix.end2end.index.MutableIndexFailureIT)
 Time elapsed: 8.598 s  <<< ERROR!
org.apache.hadoop.hbase.TableNotFoundException: Table 'T000016.A_FAIL_IDX' was not found,
got: T000015.FAIL_TABLE.
	at org.apache.phoenix.end2end.index.MutableIndexFailureIT.updateTable(MutableIndexFailureIT.java:473)
	at org.apache.phoenix.end2end.index.MutableIndexFailureIT.testIndexWriteFailure(MutableIndexFailureIT.java:297)

[ERROR] testIndexWriteFailure[MutableIndexFailureIT_transactionProvider=null,localIndex=true,isNamespaceMapped=false,disableIndexOnWriteFailure=true,failRebuildTask=false,throwIndexWriteFailure=null](org.apache.phoenix.end2end.index.MutableIndexFailureIT)
 Time elapsed: 8.528 s  <<< ERROR!
org.apache.hadoop.hbase.TableNotFoundException: Table 'T000017.A_FAIL_IDX' was not found,
got: T000016.FAIL_TABLE.
	at org.apache.phoenix.end2end.index.MutableIndexFailureIT.updateTable(MutableIndexFailureIT.java:473)
	at org.apache.phoenix.end2end.index.MutableIndexFailureIT.testIndexWriteFailure(MutableIndexFailureIT.java:297)

[ERROR] testIndexWriteFailure[MutableIndexFailureIT_transactionProvider=null,localIndex=false,isNamespaceMapped=true,disableIndexOnWriteFailure=true,failRebuildTask=true,throwIndexWriteFailure=null](org.apache.phoenix.end2end.index.MutableIndexFailureIT)
 Time elapsed: 10.851 s  <<< ERROR!
org.apache.hadoop.hbase.TableNotFoundException: Table 'T000019.A_FAIL_IDX' was not found,
got: T000018.FAIL_TABLE.
	at org.apache.phoenix.end2end.index.MutableIndexFailureIT.updateTable(MutableIndexFailureIT.java:473)
	at org.apache.phoenix.end2end.index.MutableIndexFailureIT.testIndexWriteFailure(MutableIndexFailureIT.java:297)

[ERROR] testIndexWriteFailure[MutableIndexFailureIT_transactionProvider=null,localIndex=false,isNamespaceMapped=true,disableIndexOnWriteFailure=false,failRebuildTask=true,throwIndexWriteFailure=false](org.apache.phoenix.end2end.index.MutableIndexFailureIT)
 Time elapsed: 10.592 s  <<< ERROR!
org.apache.hadoop.hbase.TableNotFoundException: Table 'T000021.A_FAIL_IDX' was not found,
got: T000020.FAIL_TABLE.
	at org.apache.phoenix.end2end.index.MutableIndexFailureIT.updateTable(MutableIndexFailureIT.java:473)
	at org.apache.phoenix.end2end.index.MutableIndexFailureIT.testIndexWriteFailure(MutableIndexFailureIT.java:297)

[WARNING] Tests run: 30, Failures: 0, Errors: 0, Skipped: 12, Time elapsed: 301.99 s - in
org.apache.phoenix.end2end.index.ImmutableIndexIT
[INFO] Running org.apache.phoenix.end2end.index.txn.TxWriteFailureIT
[INFO] Tests run: 8, Failures: 0, Errors: 0, Skipped: 0, Time elapsed: 38.052 s - in org.apache.phoenix.end2end.index.txn.TxWriteFailureIT
[INFO] Running org.apache.phoenix.execute.PartialCommitIT
[INFO] Tests run: 36, Failures: 0, Errors: 0, Skipped: 0, Time elapsed: 356.672 s - in org.apache.phoenix.end2end.index.LocalIndexIT
[INFO] Running org.apache.phoenix.hbase.index.FailForUnsupportedHBaseVersionsIT
[INFO] Running org.apache.phoenix.execute.UpsertSelectOverlappingBatchesIT
[INFO] Tests run: 2, Failures: 0, Errors: 0, Skipped: 0, Time elapsed: 17.894 s - in org.apache.phoenix.hbase.index.FailForUnsupportedHBaseVersionsIT
[INFO] Tests run: 6, Failures: 0, Errors: 0, Skipped: 0, Time elapsed: 42.613 s - in org.apache.phoenix.execute.PartialCommitIT
[INFO] Running org.apache.phoenix.iterate.RoundRobinResultIteratorWithStatsIT
[INFO] Tests run: 1, Failures: 0, Errors: 0, Skipped: 0, Time elapsed: 6.055 s - in org.apache.phoenix.iterate.RoundRobinResultIteratorWithStatsIT
[INFO] Running org.apache.phoenix.iterate.ScannerLeaseRenewalIT
[INFO] Tests run: 3, Failures: 0, Errors: 0, Skipped: 0, Time elapsed: 67.552 s - in org.apache.phoenix.execute.UpsertSelectOverlappingBatchesIT
[INFO] Running org.apache.phoenix.monitoring.PhoenixMetricsIT
[INFO] Running org.apache.phoenix.rpc.PhoenixClientRpcIT
[INFO] Tests run: 25, Failures: 0, Errors: 0, Skipped: 0, Time elapsed: 251.043 s - in org.apache.phoenix.end2end.index.PartialIndexRebuilderIT
[INFO] Tests run: 2, Failures: 0, Errors: 0, Skipped: 0, Time elapsed: 4.07 s - in org.apache.phoenix.rpc.PhoenixClientRpcIT
[INFO] Running org.apache.phoenix.rpc.PhoenixServerRpcIT
[INFO] Tests run: 22, Failures: 0, Errors: 0, Skipped: 0, Time elapsed: 62.289 s - in org.apache.phoenix.monitoring.PhoenixMetricsIT
[INFO] Tests run: 2, Failures: 0, Errors: 0, Skipped: 0, Time elapsed: 13.336 s - in org.apache.phoenix.rpc.PhoenixServerRpcIT
[INFO] Tests run: 2, Failures: 0, Errors: 0, Skipped: 0, Time elapsed: 162.953 s - in org.apache.phoenix.iterate.ScannerLeaseRenewalIT
[INFO] 
[INFO] Results:
[INFO] 
[ERROR] Failures: 
[ERROR]   MutableIndexFailureIT.testIndexWriteFailure:359->validateDataWithIndex:428 expected:<a[]>
but was:<a[3]>
[ERROR] Errors: 
[ERROR]   MutableIndexFailureIT.testIndexWriteFailure:297->updateTable:473 » TableNotFound
[ERROR]   MutableIndexFailureIT.testIndexWriteFailure:297->updateTable:473 » TableNotFound
[ERROR]   MutableIndexFailureIT.testIndexWriteFailure:297->updateTable:473 » TableNotFound
[ERROR]   MutableIndexFailureIT.testIndexWriteFailure:297->updateTable:473 » TableNotFound
[ERROR]   MutableIndexFailureIT.testIndexWriteFailure:297->updateTable:473 » TableNotFound
[ERROR]   MutableIndexFailureIT.testIndexWriteFailure:297->updateTable:473 » TableNotFound
[ERROR]   MutableIndexFailureIT.testIndexWriteFailure:297->updateTable:473 » TableNotFound
[ERROR]   MutableIndexFailureIT.testIndexWriteFailure:297->updateTable:473 » TableNotFound
[ERROR]   MutableIndexFailureIT.testIndexWriteFailure:297->updateTable:473 » TableNotFound
[ERROR] org.apache.phoenix.end2end.index.MutableIndexFailureIT.testIndexWriteFailure[MutableIndexFailureIT_transactionProvider=null,localIndex=true,isNamespaceMapped=false,disableIndexOnWriteFailure=true,failRebuildTask=false,throwIndexWriteFailure=null](org.apache.phoenix.end2end.index.MutableIndexFailureIT)
[ERROR]   Run 1: MutableIndexFailureIT.testIndexWriteFailure:297->updateTable:473 » TableNotFound
[ERROR]   Run 2: MutableIndexFailureIT.testIndexWriteFailure:297->updateTable:473 » TableNotFound
[INFO] 
[ERROR]   MutableIndexFailureIT.testIndexWriteFailure:297->updateTable:473 » TableNotFound
[INFO] 
[ERROR] Tests run: 592, Failures: 1, Errors: 11, Skipped: 30
[INFO] 
[INFO] 
[INFO] --- maven-failsafe-plugin:2.20:verify (ParallelStatsEnabledTest) @ phoenix-core ---
[INFO] ------------------------------------------------------------------------
[INFO] Reactor Summary:
[INFO] 
[INFO] Apache Phoenix ..................................... SUCCESS [  1.746 s]
[INFO] Phoenix Core ....................................... FAILURE [  02:12 h]
[INFO] Phoenix - Flume .................................... SKIPPED
[INFO] Phoenix - Kafka .................................... SKIPPED
[INFO] Phoenix - Pig ...................................... SKIPPED
[INFO] Phoenix Query Server Client ........................ SKIPPED
[INFO] Phoenix Query Server ............................... SKIPPED
[INFO] Phoenix - Pherf .................................... SKIPPED
[INFO] Phoenix - Spark .................................... SKIPPED
[INFO] Phoenix - Hive ..................................... SKIPPED
[INFO] Phoenix Client ..................................... SKIPPED
[INFO] Phoenix Server ..................................... SKIPPED
[INFO] Phoenix Assembly ................................... SKIPPED
[INFO] Phoenix - Tracing Web Application .................. SKIPPED
[INFO] Phoenix Load Balancer .............................. SKIPPED
[INFO] ------------------------------------------------------------------------
[INFO] BUILD FAILURE
[INFO] ------------------------------------------------------------------------
[INFO] Total time: 02:12 h
[INFO] Finished at: 2018-06-17T23:47:19Z
[INFO] Final Memory: 61M/863M
[INFO] ------------------------------------------------------------------------
[ERROR] Failed to execute goal org.apache.maven.plugins:maven-failsafe-plugin:2.20:verify
(ParallelStatsEnabledTest) on project phoenix-core: There are test failures.
[ERROR] 
[ERROR] Please refer to <https://builds.apache.org/job/Phoenix-omid2/ws/phoenix-core/target/failsafe-reports>
for the individual test results.
[ERROR] Please refer to dump files (if any exist) [date]-jvmRun[N].dump, [date].dumpstream
and [date]-jvmRun[N].dumpstream.
[ERROR] -> [Help 1]
[ERROR] 
[ERROR] To see the full stack trace of the errors, re-run Maven with the -e switch.
[ERROR] Re-run Maven using the -X switch to enable full debug logging.
[ERROR] 
[ERROR] For more information about the errors and possible solutions, please read the following
articles:
[ERROR] [Help 1] http://cwiki.apache.org/confluence/display/MAVEN/MojoFailureException
[ERROR] 
[ERROR] After correcting the problems, you can resume the build with the command
[ERROR]   mvn <goals> -rf :phoenix-core
Build step 'Invoke top-level Maven targets' marked build as failure
Archiving artifacts
[Fast Archiver] No prior successful build to compare, so performing full copy of artifacts
Recording test results

Mime
View raw message