phoenix-commits mailing list archives

Site index · List index
Message view « Date » · « Thread »
Top « Date » · « Thread »
From Apache Jenkins Server <jenk...@builds.apache.org>
Subject Build failed in Jenkins: Phoenix | Master #2017
Date Thu, 10 May 2018 20:56:59 GMT
See <https://builds.apache.org/job/Phoenix-master/2017/display/redirect?page=changes>

Changes:

[ssa] PHOENIX-4534 upsert/delete/upsert for the same row corrupts the

------------------------------------------
[...truncated 83.53 KB...]
[INFO] Tests run: 1, Failures: 0, Errors: 0, Skipped: 0, Time elapsed: 4.426 s - in org.apache.phoenix.end2end.DropTableIT
[INFO] Running org.apache.phoenix.end2end.DynamicColumnIT
[INFO] Tests run: 5, Failures: 0, Errors: 0, Skipped: 0, Time elapsed: 137.163 s - in org.apache.phoenix.end2end.DistinctPrefixFilterIT
[INFO] Running org.apache.phoenix.end2end.DynamicFamilyIT
[INFO] Tests run: 4, Failures: 0, Errors: 0, Skipped: 0, Time elapsed: 8.757 s - in org.apache.phoenix.end2end.DynamicFamilyIT
[INFO] Running org.apache.phoenix.end2end.DynamicUpsertIT
[INFO] Tests run: 49, Failures: 0, Errors: 0, Skipped: 0, Time elapsed: 458.071 s - in org.apache.phoenix.end2end.CastAndCoerceIT
[INFO] Tests run: 7, Failures: 0, Errors: 0, Skipped: 0, Time elapsed: 31.385 s - in org.apache.phoenix.end2end.DynamicUpsertIT
[INFO] Running org.apache.phoenix.end2end.EvaluationOfORIT
[INFO] Tests run: 6, Failures: 0, Errors: 0, Skipped: 0, Time elapsed: 73.767 s - in org.apache.phoenix.end2end.DynamicColumnIT
[INFO] Running org.apache.phoenix.end2end.ExecuteStatementsIT
[INFO] Tests run: 2, Failures: 0, Errors: 0, Skipped: 0, Time elapsed: 4.756 s - in org.apache.phoenix.end2end.EvaluationOfORIT
[INFO] Running org.apache.phoenix.end2end.ExpFunctionEnd2EndIT
[INFO] Running org.apache.phoenix.end2end.EncodeFunctionIT
[INFO] Tests run: 3, Failures: 0, Errors: 0, Skipped: 0, Time elapsed: 30.849 s - in org.apache.phoenix.end2end.ExpFunctionEnd2EndIT
[INFO] Tests run: 2, Failures: 0, Errors: 0, Skipped: 0, Time elapsed: 34.183 s - in org.apache.phoenix.end2end.ExecuteStatementsIT
[INFO] Tests run: 7, Failures: 0, Errors: 0, Skipped: 0, Time elapsed: 43.265 s - in org.apache.phoenix.end2end.EncodeFunctionIT
[INFO] Running org.apache.phoenix.end2end.FirstValueFunctionIT
[INFO] Tests run: 32, Failures: 0, Errors: 0, Skipped: 0, Time elapsed: 298.241 s - in org.apache.phoenix.end2end.DeleteIT
[INFO] Tests run: 56, Failures: 0, Errors: 0, Skipped: 0, Time elapsed: 411.797 s - in org.apache.phoenix.end2end.DateTimeIT
[INFO] Running org.apache.phoenix.end2end.ExplainPlanWithStatsDisabledIT
[INFO] Running org.apache.phoenix.end2end.ExtendedQueryExecIT
[INFO] Tests run: 7, Failures: 0, Errors: 0, Skipped: 0, Time elapsed: 30.395 s - in org.apache.phoenix.end2end.FirstValueFunctionIT
[INFO] Running org.apache.phoenix.end2end.FunkyNamesIT
[INFO] Tests run: 4, Failures: 0, Errors: 0, Skipped: 0, Time elapsed: 17.614 s - in org.apache.phoenix.end2end.ExtendedQueryExecIT
[INFO] Running org.apache.phoenix.end2end.GetSetByteBitFunctionEnd2EndIT
[INFO] Tests run: 1, Failures: 0, Errors: 0, Skipped: 0, Time elapsed: 4.393 s - in org.apache.phoenix.end2end.GetSetByteBitFunctionEnd2EndIT
[INFO] Tests run: 3, Failures: 0, Errors: 0, Skipped: 0, Time elapsed: 13.069 s - in org.apache.phoenix.end2end.FunkyNamesIT
[INFO] Running org.apache.phoenix.end2end.ImmutableTablePropertiesIT
[INFO] Tests run: 63, Failures: 0, Errors: 0, Skipped: 0, Time elapsed: 594.278 s - in org.apache.phoenix.end2end.CaseStatementIT
[INFO] Running org.apache.phoenix.end2end.GroupByIT
[INFO] Running org.apache.phoenix.end2end.FirstValuesFunctionIT
[INFO] Tests run: 1, Failures: 0, Errors: 0, Skipped: 0, Time elapsed: 5.043 s - in org.apache.phoenix.end2end.FirstValuesFunctionIT
[INFO] Running org.apache.phoenix.end2end.FlappingAlterTableIT
[INFO] Running org.apache.phoenix.end2end.InQueryIT
[INFO] Tests run: 5, Failures: 0, Errors: 0, Skipped: 0, Time elapsed: 26.292 s - in org.apache.phoenix.end2end.ImmutableTablePropertiesIT
[INFO] Running org.apache.phoenix.end2end.InstrFunctionIT
[INFO] Tests run: 2, Failures: 0, Errors: 0, Skipped: 0, Time elapsed: 23.43 s - in org.apache.phoenix.end2end.FlappingAlterTableIT
[INFO] Running org.apache.phoenix.end2end.IntArithmeticIT
[INFO] Tests run: 13, Failures: 0, Errors: 0, Skipped: 0, Time elapsed: 74.641 s - in org.apache.phoenix.end2end.ExplainPlanWithStatsDisabledIT
[INFO] Running org.apache.phoenix.end2end.IsNullIT
[INFO] Running org.apache.phoenix.end2end.InListIT
[INFO] Tests run: 3, Failures: 0, Errors: 0, Skipped: 0, Time elapsed: 13.002 s - in org.apache.phoenix.end2end.IsNullIT
[INFO] Running org.apache.phoenix.end2end.LastValueFunctionIT
[INFO] Tests run: 8, Failures: 0, Errors: 0, Skipped: 0, Time elapsed: 34.95 s - in org.apache.phoenix.end2end.InstrFunctionIT
[INFO] Tests run: 11, Failures: 0, Errors: 0, Skipped: 0, Time elapsed: 46.378 s - in org.apache.phoenix.end2end.LastValueFunctionIT
[INFO] Running org.apache.phoenix.end2end.LastValuesFunctionIT
[INFO] Running org.apache.phoenix.end2end.LikeExpressionIT
[INFO] Tests run: 18, Failures: 0, Errors: 0, Skipped: 0, Time elapsed: 78.618 s - in org.apache.phoenix.end2end.LastValuesFunctionIT
[INFO] Running org.apache.phoenix.end2end.LnLogFunctionEnd2EndIT
[INFO] Tests run: 1, Failures: 0, Errors: 0, Skipped: 0, Time elapsed: 9.188 s - in org.apache.phoenix.end2end.LnLogFunctionEnd2EndIT
[INFO] Running org.apache.phoenix.end2end.MD5FunctionIT
[INFO] Tests run: 3, Failures: 0, Errors: 0, Skipped: 0, Time elapsed: 13.023 s - in org.apache.phoenix.end2end.MD5FunctionIT
[INFO] Running org.apache.phoenix.end2end.MapReduceIT
[INFO] Tests run: 9, Failures: 0, Errors: 0, Skipped: 0, Time elapsed: 70.085 s - in org.apache.phoenix.end2end.LikeExpressionIT
[INFO] Running org.apache.phoenix.end2end.MappingTableDataTypeIT
[INFO] Tests run: 1, Failures: 0, Errors: 0, Skipped: 0, Time elapsed: 12.502 s - in org.apache.phoenix.end2end.MappingTableDataTypeIT
[INFO] Running org.apache.phoenix.end2end.MetaDataEndPointIT
[INFO] Tests run: 3, Failures: 0, Errors: 0, Skipped: 0, Time elapsed: 31.496 s - in org.apache.phoenix.end2end.MapReduceIT
[INFO] Running org.apache.phoenix.end2end.MinMaxAggregateFunctionIT
[INFO] Tests run: 1, Failures: 0, Errors: 0, Skipped: 0, Time elapsed: 8.681 s - in org.apache.phoenix.end2end.MetaDataEndPointIT
[INFO] Running org.apache.phoenix.end2end.ModulusExpressionIT
[INFO] Tests run: 1, Failures: 0, Errors: 0, Skipped: 0, Time elapsed: 4.477 s - in org.apache.phoenix.end2end.MinMaxAggregateFunctionIT
[INFO] Running org.apache.phoenix.end2end.MutationStateIT
[INFO] Tests run: 11, Failures: 0, Errors: 0, Skipped: 0, Time elapsed: 49.386 s - in org.apache.phoenix.end2end.ModulusExpressionIT
[INFO] Tests run: 2, Failures: 0, Errors: 0, Skipped: 0, Time elapsed: 20.337 s - in org.apache.phoenix.end2end.MutationStateIT
[INFO] Running org.apache.phoenix.end2end.NativeHBaseTypesIT
[INFO] Running org.apache.phoenix.end2end.NamespaceSchemaMappingIT
[INFO] Tests run: 1, Failures: 0, Errors: 0, Skipped: 0, Time elapsed: 16.821 s - in org.apache.phoenix.end2end.NamespaceSchemaMappingIT
[INFO] Running org.apache.phoenix.end2end.NotQueryWithGlobalImmutableIndexesIT
[INFO] Tests run: 7, Failures: 0, Errors: 0, Skipped: 0, Time elapsed: 79.992 s - in org.apache.phoenix.end2end.NativeHBaseTypesIT
[INFO] Running org.apache.phoenix.end2end.NotQueryWithLocalImmutableIndexesIT
[INFO] Tests run: 63, Failures: 0, Errors: 0, Skipped: 0, Time elapsed: 581.263 s - in org.apache.phoenix.end2end.InQueryIT
[INFO] Running org.apache.phoenix.end2end.NthValueFunctionIT
[INFO] Tests run: 63, Failures: 0, Errors: 0, Skipped: 0, Time elapsed: 645.215 s - in org.apache.phoenix.end2end.GroupByIT
[INFO] Tests run: 70, Failures: 0, Errors: 0, Skipped: 0, Time elapsed: 651.793 s - in org.apache.phoenix.end2end.IntArithmeticIT
[INFO] Running org.apache.phoenix.end2end.NullIT
[INFO] Tests run: 44, Failures: 0, Errors: 0, Skipped: 0, Time elapsed: 335.988 s - in org.apache.phoenix.end2end.NotQueryWithGlobalImmutableIndexesIT
[INFO] Tests run: 14, Failures: 0, Errors: 0, Skipped: 0, Time elapsed: 61.034 s - in org.apache.phoenix.end2end.NthValueFunctionIT
[INFO] Running org.apache.phoenix.end2end.OnDuplicateKeyIT
[INFO] Running org.apache.phoenix.end2end.NumericArithmeticIT
[INFO] Running org.apache.phoenix.end2end.OctetLengthFunctionEnd2EndIT
[INFO] Tests run: 1, Failures: 0, Errors: 0, Skipped: 0, Time elapsed: 4.332 s - in org.apache.phoenix.end2end.OctetLengthFunctionEnd2EndIT
[INFO] Running org.apache.phoenix.end2end.OrderByIT
[INFO] Tests run: 33, Failures: 0, Errors: 0, Skipped: 0, Time elapsed: 374.191 s - in org.apache.phoenix.end2end.NotQueryWithLocalImmutableIndexesIT
[INFO] Running org.apache.phoenix.end2end.PartialScannerResultsDisabledIT
[INFO] Tests run: 21, Failures: 0, Errors: 0, Skipped: 0, Time elapsed: 92.774 s - in org.apache.phoenix.end2end.NumericArithmeticIT
[INFO] Running org.apache.phoenix.end2end.PercentileIT
[INFO] Tests run: 18, Failures: 0, Errors: 0, Skipped: 0, Time elapsed: 74.499 s - in org.apache.phoenix.end2end.PercentileIT
[INFO] Running org.apache.phoenix.end2end.PhoenixRuntimeIT
[INFO] Tests run: 2, Failures: 0, Errors: 0, Skipped: 0, Time elapsed: 41.848 s - in org.apache.phoenix.end2end.PhoenixRuntimeIT
[INFO] Running org.apache.phoenix.end2end.PointInTimeQueryIT
[INFO] Tests run: 48, Failures: 0, Errors: 0, Skipped: 0, Time elapsed: 431.689 s - in org.apache.phoenix.end2end.OnDuplicateKeyIT
[INFO] Running org.apache.phoenix.end2end.PowerFunctionEnd2EndIT
[ERROR] Tests run: 13, Failures: 0, Errors: 1, Skipped: 0, Time elapsed: 442.744 s <<<
FAILURE! - in org.apache.phoenix.end2end.OrderByIT
[ERROR] testOrderByReverseOptimizationWithNUllsLastBug3491(org.apache.phoenix.end2end.OrderByIT)
 Time elapsed: 304.378 s  <<< ERROR!
java.sql.SQLTimeoutException: Operation timed out.
	at org.apache.phoenix.end2end.OrderByIT.doTestOrderByReverseOptimizationWithNUllsLastBug3491(OrderByIT.java:1018)
	at org.apache.phoenix.end2end.OrderByIT.testOrderByReverseOptimizationWithNUllsLastBug3491(OrderByIT.java:970)

[INFO] Tests run: 1, Failures: 0, Errors: 0, Skipped: 0, Time elapsed: 8.938 s - in org.apache.phoenix.end2end.PowerFunctionEnd2EndIT
[INFO] Running org.apache.phoenix.end2end.ProductMetricsIT
[INFO] Running org.apache.phoenix.end2end.PrimitiveTypeIT
[INFO] Tests run: 28, Failures: 0, Errors: 0, Skipped: 0, Time elapsed: 1,228.152 s - in org.apache.phoenix.end2end.InListIT
[INFO] Tests run: 9, Failures: 0, Errors: 0, Skipped: 0, Time elapsed: 39.306 s - in org.apache.phoenix.end2end.PrimitiveTypeIT
[INFO] Running org.apache.phoenix.end2end.QueryExecWithoutSCNIT
[INFO] Tests run: 1, Failures: 0, Errors: 0, Skipped: 0, Time elapsed: 4.623 s - in org.apache.phoenix.end2end.QueryExecWithoutSCNIT
[INFO] Running org.apache.phoenix.end2end.QueryIT
[INFO] Running org.apache.phoenix.end2end.QueryDatabaseMetaDataIT
[INFO] Tests run: 55, Failures: 0, Errors: 0, Skipped: 0, Time elapsed: 245.157 s - in org.apache.phoenix.end2end.ProductMetricsIT
[INFO] Running org.apache.phoenix.end2end.QueryMoreIT
[INFO] Tests run: 18, Failures: 0, Errors: 0, Skipped: 0, Time elapsed: 168.59 s - in org.apache.phoenix.end2end.QueryDatabaseMetaDataIT
[INFO] Running org.apache.phoenix.end2end.QueryWithOffsetIT
[INFO] Tests run: 8, Failures: 0, Errors: 0, Skipped: 0, Time elapsed: 36.346 s - in org.apache.phoenix.end2end.QueryWithOffsetIT
[INFO] Running org.apache.phoenix.end2end.RTrimFunctionIT
[INFO] Tests run: 9, Failures: 0, Errors: 0, Skipped: 0, Time elapsed: 87.122 s - in org.apache.phoenix.end2end.QueryMoreIT
[INFO] Running org.apache.phoenix.end2end.RangeScanIT
[INFO] Tests run: 2, Failures: 0, Errors: 0, Skipped: 0, Time elapsed: 8.71 s - in org.apache.phoenix.end2end.RTrimFunctionIT
[INFO] Running org.apache.phoenix.end2end.ReadOnlyIT
[INFO] Tests run: 1, Failures: 0, Errors: 0, Skipped: 0, Time elapsed: 9.561 s - in org.apache.phoenix.end2end.ReadOnlyIT
[INFO] Running org.apache.phoenix.end2end.RegexpReplaceFunctionIT
[INFO] Tests run: 2, Failures: 0, Errors: 0, Skipped: 0, Time elapsed: 8.709 s - in org.apache.phoenix.end2end.RegexpReplaceFunctionIT
[INFO] Running org.apache.phoenix.end2end.RegexpSplitFunctionIT
[INFO] Tests run: 12, Failures: 0, Errors: 0, Skipped: 0, Time elapsed: 47.435 s - in org.apache.phoenix.end2end.RegexpSplitFunctionIT
[INFO] Running org.apache.phoenix.end2end.RegexpSubstrFunctionIT
[INFO] Tests run: 2, Failures: 0, Errors: 0, Skipped: 0, Time elapsed: 7.105 s - in org.apache.phoenix.end2end.RegexpSubstrFunctionIT
[INFO] Running org.apache.phoenix.end2end.ReverseFunctionIT
[INFO] Tests run: 5, Failures: 0, Errors: 0, Skipped: 0, Time elapsed: 19.783 s - in org.apache.phoenix.end2end.ReverseFunctionIT
[INFO] Tests run: 42, Failures: 0, Errors: 0, Skipped: 0, Time elapsed: 381.67 s - in org.apache.phoenix.end2end.QueryIT
[INFO] Running org.apache.phoenix.end2end.ReverseScanIT
[INFO] Running org.apache.phoenix.end2end.RoundFloorCeilFuncIT
[INFO] Tests run: 5, Failures: 0, Errors: 0, Skipped: 0, Time elapsed: 26.294 s - in org.apache.phoenix.end2end.ReverseScanIT
[INFO] Running org.apache.phoenix.end2end.RowTimestampIT
[INFO] Tests run: 16, Failures: 0, Errors: 0, Skipped: 0, Time elapsed: 87.29 s - in org.apache.phoenix.end2end.RowTimestampIT
[INFO] Running org.apache.phoenix.end2end.RowValueConstructorIT
[INFO] Tests run: 33, Failures: 0, Errors: 0, Skipped: 0, Time elapsed: 148.643 s - in org.apache.phoenix.end2end.RoundFloorCeilFuncIT
[INFO] Running org.apache.phoenix.end2end.SequenceBulkAllocationIT
[INFO] Tests run: 56, Failures: 0, Errors: 0, Skipped: 0, Time elapsed: 27.496 s - in org.apache.phoenix.end2end.SequenceBulkAllocationIT
[INFO] Running org.apache.phoenix.end2end.SequenceIT
[INFO] Tests run: 55, Failures: 0, Errors: 0, Skipped: 0, Time elapsed: 70.732 s - in org.apache.phoenix.end2end.SequenceIT
[INFO] Running org.apache.phoenix.end2end.SerialIteratorsIT
[INFO] Tests run: 1, Failures: 0, Errors: 0, Skipped: 0, Time elapsed: 4.416 s - in org.apache.phoenix.end2end.SerialIteratorsIT
[INFO] Running org.apache.phoenix.end2end.ServerExceptionIT
[INFO] Tests run: 1, Failures: 0, Errors: 0, Skipped: 0, Time elapsed: 4.345 s - in org.apache.phoenix.end2end.ServerExceptionIT
[INFO] Running org.apache.phoenix.end2end.SetPropertyOnEncodedTableIT
[INFO] Tests run: 32, Failures: 0, Errors: 0, Skipped: 0, Time elapsed: 277.213 s - in org.apache.phoenix.end2end.SetPropertyOnEncodedTableIT
[INFO] Running org.apache.phoenix.end2end.SetPropertyOnNonEncodedTableIT
[INFO] Tests run: 32, Failures: 0, Errors: 0, Skipped: 0, Time elapsed: 277.752 s - in org.apache.phoenix.end2end.SetPropertyOnNonEncodedTableIT
[INFO] Running org.apache.phoenix.end2end.SignFunctionEnd2EndIT
[INFO] Tests run: 2, Failures: 0, Errors: 0, Skipped: 0, Time elapsed: 17.498 s - in org.apache.phoenix.end2end.SignFunctionEnd2EndIT
[INFO] Running org.apache.phoenix.end2end.SkipScanAfterManualSplitIT
[INFO] Tests run: 3, Failures: 0, Errors: 0, Skipped: 0, Time elapsed: 30.625 s - in org.apache.phoenix.end2end.SkipScanAfterManualSplitIT
[INFO] Running org.apache.phoenix.end2end.SkipScanQueryIT
[INFO] Tests run: 13, Failures: 0, Errors: 0, Skipped: 0, Time elapsed: 55.713 s - in org.apache.phoenix.end2end.SkipScanQueryIT
[INFO] Running org.apache.phoenix.end2end.SortMergeJoinMoreIT
[INFO] Tests run: 6, Failures: 0, Errors: 0, Skipped: 0, Time elapsed: 85.246 s - in org.apache.phoenix.end2end.SortMergeJoinMoreIT
[INFO] Running org.apache.phoenix.end2end.SortOrderIT
[INFO] Tests run: 46, Failures: 0, Errors: 0, Skipped: 0, Time elapsed: 296.83 s - in org.apache.phoenix.end2end.SortOrderIT
[INFO] Running org.apache.phoenix.end2end.SpooledTmpFileDeleteIT
[INFO] Tests run: 1, Failures: 0, Errors: 0, Skipped: 0, Time elapsed: 4.85 s - in org.apache.phoenix.end2end.SpooledTmpFileDeleteIT
[INFO] Running org.apache.phoenix.end2end.SqrtFunctionEnd2EndIT
[INFO] Tests run: 2, Failures: 0, Errors: 0, Skipped: 0, Time elapsed: 17.58 s - in org.apache.phoenix.end2end.SqrtFunctionEnd2EndIT
[INFO] Running org.apache.phoenix.end2end.StatementHintsIT
[INFO] Tests run: 2, Failures: 0, Errors: 0, Skipped: 0, Time elapsed: 4.359 s - in org.apache.phoenix.end2end.StatementHintsIT
[INFO] Running org.apache.phoenix.end2end.StddevIT
[INFO] Tests run: 4, Failures: 0, Errors: 0, Skipped: 0, Time elapsed: 18.047 s - in org.apache.phoenix.end2end.StddevIT
[INFO] Running org.apache.phoenix.end2end.StoreNullsIT
[ERROR] Tests run: 10, Failures: 0, Errors: 2, Skipped: 0, Time elapsed: 10,269.416 s <<<
FAILURE! - in org.apache.phoenix.end2end.DistinctCountIT
[ERROR] testDistinctCountOnIndexTab(org.apache.phoenix.end2end.DistinctCountIT)  Time elapsed:
1,228.915 s  <<< ERROR!
org.apache.phoenix.execute.CommitException: org.apache.hadoop.hbase.client.RetriesExhaustedWithDetailsException:
Failed 3 actions: Operation Timeout: 3 times, servers with issues: asf934.gq1.ygridcore.net,35261,1525974812240
	at org.apache.phoenix.end2end.DistinctCountIT.testDistinctCountOnIndexTab(DistinctCountIT.java:462)
Caused by: org.apache.hadoop.hbase.client.RetriesExhaustedWithDetailsException: Failed 3 actions:
Operation Timeout: 3 times, servers with issues: asf934.gq1.ygridcore.net,35261,1525974812240
	at org.apache.phoenix.end2end.DistinctCountIT.testDistinctCountOnIndexTab(DistinctCountIT.java:462)

[ERROR] testDistinctCountWithGroupByOrdered(org.apache.phoenix.end2end.DistinctCountIT)  Time
elapsed: 9,004.331 s  <<< ERROR!
org.apache.phoenix.exception.PhoenixIOException: callTimeout=1200000, callDuration=9000110:
Call to asf934.gq1.ygridcore.net/67.195.81.168:35261 failed on local exception: org.apache.hadoop.hbase.ipc.CallTimeoutException:
Call id=509, waitTime=9000006, rpcTimetout=9000000 row '  T000133' on table 'SYSTEM.CATALOG'
at region=SYSTEM.CATALOG,,1525974825072.1ffd4eac0226cdc8bbc18cc33fcb56a1., hostname=asf934.gq1.ygridcore.net,35261,1525974812240,
seqNum=2
	at org.apache.phoenix.end2end.DistinctCountIT.initATableValues(DistinctCountIT.java:271)
	at org.apache.phoenix.end2end.DistinctCountIT.testDistinctCountWithGroupByOrdered(DistinctCountIT.java:184)
Caused by: java.net.SocketTimeoutException: callTimeout=1200000, callDuration=9000110: Call
to asf934.gq1.ygridcore.net/67.195.81.168:35261 failed on local exception: org.apache.hadoop.hbase.ipc.CallTimeoutException:
Call id=509, waitTime=9000006, rpcTimetout=9000000 row '  T000133' on table 'SYSTEM.CATALOG'
at region=SYSTEM.CATALOG,,1525974825072.1ffd4eac0226cdc8bbc18cc33fcb56a1., hostname=asf934.gq1.ygridcore.net,35261,1525974812240,
seqNum=2
Caused by: java.io.IOException: Call to asf934.gq1.ygridcore.net/67.195.81.168:35261 failed
on local exception: org.apache.hadoop.hbase.ipc.CallTimeoutException: Call id=509, waitTime=9000006,
rpcTimetout=9000000
Caused by: org.apache.hadoop.hbase.ipc.CallTimeoutException: Call id=509, waitTime=9000006,
rpcTimetout=9000000

[INFO] Running org.apache.phoenix.end2end.StoreNullsPropIT
Build timed out (after 200 minutes). Marking the build as failed.
Build was aborted
Archiving artifacts
ERROR: Failed to archive artifacts: **/surefire-reports/*,**/failsafe-reports/*.xml,**/*.txt,**/*.jar,**/bin/*.py,**/bin/*.xml,**/bin/*.properties
hudson.remoting.ProxyException: java.lang.Throwable
	at hudson.remoting.FastPipedOutputStream.<init>(FastPipedOutputStream.java:49)
	at hudson.remoting.Pipe.readObject(Pipe.java:191)
	at sun.reflect.GeneratedMethodAccessor40.invoke(Unknown Source)
	at sun.reflect.DelegatingMethodAccessorImpl.invoke(DelegatingMethodAccessorImpl.java:43)
	at java.lang.reflect.Method.invoke(Method.java:498)
	at java.io.ObjectStreamClass.invokeReadObject(ObjectStreamClass.java:1058)
	at java.io.ObjectInputStream.readSerialData(ObjectInputStream.java:2136)
	at java.io.ObjectInputStream.readOrdinaryObject(ObjectInputStream.java:2027)
	at java.io.ObjectInputStream.readObject0(ObjectInputStream.java:1535)
	at java.io.ObjectInputStream.defaultReadFields(ObjectInputStream.java:2245)
	at java.io.ObjectInputStream.readSerialData(ObjectInputStream.java:2169)
	at java.io.ObjectInputStream.readOrdinaryObject(ObjectInputStream.java:2027)
	at java.io.ObjectInputStream.readObject0(ObjectInputStream.java:1535)
	at java.io.ObjectInputStream.defaultReadFields(ObjectInputStream.java:2245)
	at java.io.ObjectInputStream.readSerialData(ObjectInputStream.java:2169)
	at java.io.ObjectInputStream.readOrdinaryObject(ObjectInputStream.java:2027)
	at java.io.ObjectInputStream.readObject0(ObjectInputStream.java:1535)
	at java.io.ObjectInputStream.readObject(ObjectInputStream.java:422)
	at hudson.remoting.UserRequest.deserialize(UserRequest.java:274)
	at hudson.remoting.UserRequest.perform(UserRequest.java:185)
	at hudson.remoting.UserRequest.perform(UserRequest.java:53)
	at hudson.remoting.Request$2.run(Request.java:358)
Caused: hudson.remoting.ProxyException: java.io.IOException: Reader side has already been
abandoned
	at hudson.remoting.FastPipedOutputStream.sink(FastPipedOutputStream.java:81)
	at hudson.remoting.FastPipedOutputStream.write(FastPipedOutputStream.java:151)
	at hudson.remoting.FastPipedOutputStream.write(FastPipedOutputStream.java:138)
	at hudson.remoting.ProxyOutputStream$Chunk$1.run(ProxyOutputStream.java:256)
	at hudson.remoting.PipeWriter$1.run(PipeWriter.java:158)
	at java.util.concurrent.Executors$RunnableAdapter.call(Executors.java:511)
	at java.util.concurrent.FutureTask.run(FutureTask.java:266)
	at hudson.remoting.SingleLaneExecutorService$1.run(SingleLaneExecutorService.java:112)
	at hudson.remoting.InterceptingExecutorService$1.call(InterceptingExecutorService.java:72)
	at java.util.concurrent.FutureTask.run(FutureTask.java:266)
	at java.util.concurrent.ThreadPoolExecutor.runWorker(ThreadPoolExecutor.java:1142)
	at java.util.concurrent.ThreadPoolExecutor$Worker.run(ThreadPoolExecutor.java:617)
	at java.lang.Thread.run(Thread.java:748)
Caused: java.io.IOException: Pipe is already closed
	at hudson.remoting.PipeWindow.checkDeath(PipeWindow.java:110)
	at hudson.remoting.PipeWindow$Real.get(PipeWindow.java:207)
	at hudson.remoting.ProxyOutputStream.write(ProxyOutputStream.java:125)
	at java.io.BufferedOutputStream.flushBuffer(BufferedOutputStream.java:82)
	at java.io.BufferedOutputStream.write(BufferedOutputStream.java:126)
	at java.util.zip.GZIPOutputStream.finish(GZIPOutputStream.java:168)
	at java.util.zip.DeflaterOutputStream.close(DeflaterOutputStream.java:238)
	at jsync.protocol.BaseWriter.close(BaseWriter.java:14)
	at jsync.protocol.BlockIterableWriter.close(BlockIterableWriter.java:26)
	at com.cloudbees.jenkins.plugins.jsync.archiver.JSyncArtifactManager.remoteSync(JSyncArtifactManager.java:151)
	at com.cloudbees.jenkins.plugins.jsync.archiver.JSyncArtifactManager.archive(JSyncArtifactManager.java:76)
	at hudson.tasks.ArtifactArchiver.perform(ArtifactArchiver.java:245)
	at hudson.tasks.BuildStepCompatibilityLayer.perform(BuildStepCompatibilityLayer.java:81)
	at hudson.tasks.BuildStepMonitor$1.perform(BuildStepMonitor.java:20)
	at hudson.model.AbstractBuild$AbstractBuildExecution.perform(AbstractBuild.java:744)
	at hudson.model.AbstractBuild$AbstractBuildExecution.performAllBuildSteps(AbstractBuild.java:690)
	at hudson.model.Build$BuildExecution.post2(Build.java:186)
	at hudson.model.AbstractBuild$AbstractBuildExecution.post(AbstractBuild.java:635)
	at hudson.model.Run.execute(Run.java:1749)
	at hudson.model.FreeStyleBuild.run(FreeStyleBuild.java:43)
	at hudson.model.ResourceController.execute(ResourceController.java:97)
	at hudson.model.Executor.run(Executor.java:429)
Recording test results
Not sending mail to unregistered user ankitsinghal59@gmail.com

Mime
View raw message