phoenix-commits mailing list archives

Site index · List index
Message view « Date » · « Thread »
Top « Date » · « Thread »
From Apache Jenkins Server <jenk...@builds.apache.org>
Subject Build failed in Jenkins: Phoenix | Master #2024
Date Tue, 15 May 2018 21:49:20 GMT
See <https://builds.apache.org/job/Phoenix-master/2024/display/redirect?page=changes>

Changes:

[jtaylor] PHOENIX-4737 Use position as column qualifier for APPEND_ONLY_SCHEMA

[jtaylor] PHOENIX-3163 Split during global index creation may cause ERROR 201

------------------------------------------
[...truncated 83.87 KB...]
[INFO] Tests run: 9, Failures: 0, Errors: 0, Skipped: 0, Time elapsed: 39.427 s - in org.apache.phoenix.end2end.DateArithmeticIT
[INFO] Running org.apache.phoenix.end2end.DecodeFunctionIT
[INFO] Tests run: 6, Failures: 0, Errors: 0, Skipped: 0, Time elapsed: 26.578 s - in org.apache.phoenix.end2end.DecodeFunctionIT
[INFO] Running org.apache.phoenix.end2end.DefaultColumnValueIT
[INFO] Tests run: 52, Failures: 0, Errors: 0, Skipped: 0, Time elapsed: 709.514 s - in org.apache.phoenix.end2end.AlterTableWithViewsIT
[INFO] Tests run: 17, Failures: 0, Errors: 0, Skipped: 0, Time elapsed: 87.832 s - in org.apache.phoenix.end2end.CursorWithRowValueConstructorIT
[INFO] Running org.apache.phoenix.end2end.DeleteIT
[INFO] Running org.apache.phoenix.end2end.DerivedTableIT
[INFO] Tests run: 22, Failures: 0, Errors: 0, Skipped: 0, Time elapsed: 153.518 s - in org.apache.phoenix.end2end.CreateTableIT
[INFO] Running org.apache.phoenix.end2end.DisableLocalIndexIT
[INFO] Tests run: 1, Failures: 0, Errors: 0, Skipped: 0, Time elapsed: 9.062 s - in org.apache.phoenix.end2end.DisableLocalIndexIT
[INFO] Running org.apache.phoenix.end2end.DistinctCountIT
[WARNING] Tests run: 15, Failures: 0, Errors: 0, Skipped: 1, Time elapsed: 229.402 s - in
org.apache.phoenix.end2end.ConcurrentMutationsIT
[INFO] Running org.apache.phoenix.end2end.DistinctPrefixFilterIT
[INFO] Tests run: 10, Failures: 0, Errors: 0, Skipped: 0, Time elapsed: 48.785 s - in org.apache.phoenix.end2end.DistinctCountIT
[INFO] Running org.apache.phoenix.end2end.DropTableIT
[INFO] Tests run: 1, Failures: 0, Errors: 0, Skipped: 0, Time elapsed: 4.692 s - in org.apache.phoenix.end2end.DropTableIT
[INFO] Running org.apache.phoenix.end2end.DynamicColumnIT
[INFO] Tests run: 18, Failures: 0, Errors: 0, Skipped: 0, Time elapsed: 132.43 s - in org.apache.phoenix.end2end.DerivedTableIT
[INFO] Running org.apache.phoenix.end2end.DynamicFamilyIT
[INFO] Tests run: 4, Failures: 0, Errors: 0, Skipped: 0, Time elapsed: 9.181 s - in org.apache.phoenix.end2end.DynamicFamilyIT
[INFO] Running org.apache.phoenix.end2end.DynamicUpsertIT
[INFO] Tests run: 49, Failures: 0, Errors: 0, Skipped: 0, Time elapsed: 465.831 s - in org.apache.phoenix.end2end.CastAndCoerceIT
[INFO] Tests run: 7, Failures: 0, Errors: 0, Skipped: 0, Time elapsed: 26.955 s - in org.apache.phoenix.end2end.DynamicUpsertIT
[INFO] Running org.apache.phoenix.end2end.EvaluationOfORIT
[INFO] Tests run: 2, Failures: 0, Errors: 0, Skipped: 0, Time elapsed: 4.536 s - in org.apache.phoenix.end2end.EvaluationOfORIT
[INFO] Running org.apache.phoenix.end2end.ExecuteStatementsIT
[INFO] Tests run: 6, Failures: 0, Errors: 0, Skipped: 0, Time elapsed: 69.933 s - in org.apache.phoenix.end2end.DynamicColumnIT
[INFO] Running org.apache.phoenix.end2end.ExpFunctionEnd2EndIT
[INFO] Tests run: 2, Failures: 0, Errors: 0, Skipped: 0, Time elapsed: 30.902 s - in org.apache.phoenix.end2end.ExecuteStatementsIT
[INFO] Running org.apache.phoenix.end2end.EncodeFunctionIT
[INFO] Tests run: 3, Failures: 0, Errors: 0, Skipped: 0, Time elapsed: 26.105 s - in org.apache.phoenix.end2end.ExpFunctionEnd2EndIT
[INFO] Running org.apache.phoenix.end2end.ExtendedQueryExecIT
[INFO] Tests run: 5, Failures: 0, Errors: 0, Skipped: 0, Time elapsed: 142.925 s - in org.apache.phoenix.end2end.DistinctPrefixFilterIT
[INFO] Tests run: 4, Failures: 0, Errors: 0, Skipped: 0, Time elapsed: 18.108 s - in org.apache.phoenix.end2end.ExtendedQueryExecIT
[INFO] Tests run: 7, Failures: 0, Errors: 0, Skipped: 0, Time elapsed: 38.222 s - in org.apache.phoenix.end2end.EncodeFunctionIT
[INFO] Running org.apache.phoenix.end2end.FlappingAlterTableIT
[INFO] Running org.apache.phoenix.end2end.ExplainPlanWithStatsDisabledIT
[INFO] Tests run: 2, Failures: 0, Errors: 0, Skipped: 0, Time elapsed: 23.8 s - in org.apache.phoenix.end2end.FlappingAlterTableIT
[INFO] Running org.apache.phoenix.end2end.FunkyNamesIT
[INFO] Tests run: 3, Failures: 0, Errors: 0, Skipped: 0, Time elapsed: 13.521 s - in org.apache.phoenix.end2end.FunkyNamesIT
[INFO] Running org.apache.phoenix.end2end.GetSetByteBitFunctionEnd2EndIT
[INFO] Tests run: 32, Failures: 0, Errors: 0, Skipped: 0, Time elapsed: 289.477 s - in org.apache.phoenix.end2end.DeleteIT
[INFO] Running org.apache.phoenix.end2end.FirstValueFunctionIT
[INFO] Tests run: 1, Failures: 0, Errors: 0, Skipped: 0, Time elapsed: 4.33 s - in org.apache.phoenix.end2end.GetSetByteBitFunctionEnd2EndIT
[INFO] Running org.apache.phoenix.end2end.ImmutableTablePropertiesIT
[INFO] Running org.apache.phoenix.end2end.FirstValuesFunctionIT
[INFO] Tests run: 56, Failures: 0, Errors: 0, Skipped: 0, Time elapsed: 420.267 s - in org.apache.phoenix.end2end.DateTimeIT
[INFO] Tests run: 1, Failures: 0, Errors: 0, Skipped: 0, Time elapsed: 4.389 s - in org.apache.phoenix.end2end.FirstValuesFunctionIT
[INFO] Running org.apache.phoenix.end2end.InQueryIT
[INFO] Tests run: 5, Failures: 0, Errors: 0, Skipped: 0, Time elapsed: 26.341 s - in org.apache.phoenix.end2end.ImmutableTablePropertiesIT
[INFO] Running org.apache.phoenix.end2end.InstrFunctionIT
[INFO] Tests run: 7, Failures: 0, Errors: 0, Skipped: 0, Time elapsed: 28.772 s - in org.apache.phoenix.end2end.FirstValueFunctionIT
[INFO] Running org.apache.phoenix.end2end.IntArithmeticIT
[INFO] Tests run: 13, Failures: 0, Errors: 0, Skipped: 0, Time elapsed: 77.009 s - in org.apache.phoenix.end2end.ExplainPlanWithStatsDisabledIT
[INFO] Running org.apache.phoenix.end2end.IsNullIT
[INFO] Running org.apache.phoenix.end2end.InListIT
[INFO] Running org.apache.phoenix.end2end.GroupByIT
[INFO] Tests run: 3, Failures: 0, Errors: 0, Skipped: 0, Time elapsed: 11.044 s - in org.apache.phoenix.end2end.IsNullIT
[INFO] Running org.apache.phoenix.end2end.LastValueFunctionIT
[INFO] Tests run: 8, Failures: 0, Errors: 0, Skipped: 0, Time elapsed: 34.874 s - in org.apache.phoenix.end2end.InstrFunctionIT
[INFO] Running org.apache.phoenix.end2end.LastValuesFunctionIT
[INFO] Tests run: 11, Failures: 0, Errors: 0, Skipped: 0, Time elapsed: 54.599 s - in org.apache.phoenix.end2end.LastValueFunctionIT
[INFO] Tests run: 18, Failures: 0, Errors: 0, Skipped: 0, Time elapsed: 92.601 s - in org.apache.phoenix.end2end.LastValuesFunctionIT
[INFO] Running org.apache.phoenix.end2end.LikeExpressionIT
[INFO] Running org.apache.phoenix.end2end.LnLogFunctionEnd2EndIT
[INFO] Tests run: 1, Failures: 0, Errors: 0, Skipped: 0, Time elapsed: 8.858 s - in org.apache.phoenix.end2end.LnLogFunctionEnd2EndIT
[INFO] Running org.apache.phoenix.end2end.MD5FunctionIT
[INFO] Tests run: 3, Failures: 0, Errors: 0, Skipped: 0, Time elapsed: 13.134 s - in org.apache.phoenix.end2end.MD5FunctionIT
[INFO] Running org.apache.phoenix.end2end.MapReduceIT
[INFO] Tests run: 9, Failures: 0, Errors: 0, Skipped: 0, Time elapsed: 84.381 s - in org.apache.phoenix.end2end.LikeExpressionIT
[INFO] Running org.apache.phoenix.end2end.MappingTableDataTypeIT
[INFO] Tests run: 1, Failures: 0, Errors: 0, Skipped: 0, Time elapsed: 12.532 s - in org.apache.phoenix.end2end.MappingTableDataTypeIT
[INFO] Running org.apache.phoenix.end2end.MetaDataEndPointIT
[INFO] Tests run: 3, Failures: 0, Errors: 0, Skipped: 0, Time elapsed: 31.439 s - in org.apache.phoenix.end2end.MapReduceIT
[INFO] Running org.apache.phoenix.end2end.MinMaxAggregateFunctionIT
[INFO] Tests run: 1, Failures: 0, Errors: 0, Skipped: 0, Time elapsed: 8.683 s - in org.apache.phoenix.end2end.MetaDataEndPointIT
[INFO] Running org.apache.phoenix.end2end.ModulusExpressionIT
[INFO] Tests run: 1, Failures: 0, Errors: 0, Skipped: 0, Time elapsed: 4.364 s - in org.apache.phoenix.end2end.MinMaxAggregateFunctionIT
[INFO] Running org.apache.phoenix.end2end.MutationStateIT
[INFO] Tests run: 2, Failures: 0, Errors: 0, Skipped: 0, Time elapsed: 18.515 s - in org.apache.phoenix.end2end.MutationStateIT
[INFO] Running org.apache.phoenix.end2end.NamespaceSchemaMappingIT
[INFO] Tests run: 1, Failures: 0, Errors: 0, Skipped: 0, Time elapsed: 15.124 s - in org.apache.phoenix.end2end.NamespaceSchemaMappingIT
[INFO] Running org.apache.phoenix.end2end.NativeHBaseTypesIT
[INFO] Tests run: 11, Failures: 0, Errors: 0, Skipped: 0, Time elapsed: 48.594 s - in org.apache.phoenix.end2end.ModulusExpressionIT
[INFO] Running org.apache.phoenix.end2end.NotQueryWithGlobalImmutableIndexesIT
[INFO] Tests run: 7, Failures: 0, Errors: 0, Skipped: 0, Time elapsed: 79.115 s - in org.apache.phoenix.end2end.NativeHBaseTypesIT
[INFO] Running org.apache.phoenix.end2end.NotQueryWithLocalImmutableIndexesIT
[INFO] Tests run: 63, Failures: 0, Errors: 0, Skipped: 0, Time elapsed: 604.044 s - in org.apache.phoenix.end2end.InQueryIT
[INFO] Running org.apache.phoenix.end2end.NthValueFunctionIT
[INFO] Tests run: 44, Failures: 0, Errors: 0, Skipped: 0, Time elapsed: 334.463 s - in org.apache.phoenix.end2end.NotQueryWithGlobalImmutableIndexesIT
[INFO] Tests run: 70, Failures: 0, Errors: 0, Skipped: 0, Time elapsed: 683.222 s - in org.apache.phoenix.end2end.IntArithmeticIT
[INFO] Tests run: 14, Failures: 0, Errors: 0, Skipped: 0, Time elapsed: 61.399 s - in org.apache.phoenix.end2end.NthValueFunctionIT
[INFO] Running org.apache.phoenix.end2end.OctetLengthFunctionEnd2EndIT
[INFO] Tests run: 1, Failures: 0, Errors: 0, Skipped: 0, Time elapsed: 2.589 s - in org.apache.phoenix.end2end.OctetLengthFunctionEnd2EndIT
[INFO] Running org.apache.phoenix.end2end.OnDuplicateKeyIT
[INFO] Running org.apache.phoenix.end2end.NullIT
[INFO] Running org.apache.phoenix.end2end.NumericArithmeticIT
[INFO] Tests run: 33, Failures: 0, Errors: 0, Skipped: 0, Time elapsed: 388.8 s - in org.apache.phoenix.end2end.NotQueryWithLocalImmutableIndexesIT
[INFO] Tests run: 21, Failures: 0, Errors: 0, Skipped: 0, Time elapsed: 101.94 s - in org.apache.phoenix.end2end.NumericArithmeticIT
[INFO] Running org.apache.phoenix.end2end.PartialScannerResultsDisabledIT
[INFO] Running org.apache.phoenix.end2end.OrderByIT
[INFO] Tests run: 48, Failures: 0, Errors: 0, Skipped: 0, Time elapsed: 441.329 s - in org.apache.phoenix.end2end.OnDuplicateKeyIT
[INFO] Running org.apache.phoenix.end2end.PercentileIT
[INFO] Tests run: 18, Failures: 0, Errors: 0, Skipped: 0, Time elapsed: 78.513 s - in org.apache.phoenix.end2end.PercentileIT
[INFO] Running org.apache.phoenix.end2end.PhoenixRuntimeIT
[INFO] Tests run: 56, Failures: 0, Errors: 0, Skipped: 0, Time elapsed: 544.394 s - in org.apache.phoenix.end2end.NullIT
[INFO] Tests run: 28, Failures: 0, Errors: 0, Skipped: 0, Time elapsed: 1,275.984 s - in org.apache.phoenix.end2end.InListIT
[ERROR] Tests run: 13, Failures: 0, Errors: 1, Skipped: 0, Time elapsed: 436.675 s <<<
FAILURE! - in org.apache.phoenix.end2end.OrderByIT
[ERROR] testOrderByReverseOptimizationWithNUllsLastBug3491(org.apache.phoenix.end2end.OrderByIT)
 Time elapsed: 304.656 s  <<< ERROR!
java.sql.SQLTimeoutException: Operation timed out.
	at org.apache.phoenix.end2end.OrderByIT.doTestOrderByReverseOptimizationWithNUllsLastBug3491(OrderByIT.java:1018)
	at org.apache.phoenix.end2end.OrderByIT.testOrderByReverseOptimizationWithNUllsLastBug3491(OrderByIT.java:970)

[INFO] Running org.apache.phoenix.end2end.PrimitiveTypeIT
[INFO] Tests run: 2, Failures: 0, Errors: 0, Skipped: 0, Time elapsed: 43.66 s - in org.apache.phoenix.end2end.PhoenixRuntimeIT
[INFO] Running org.apache.phoenix.end2end.PowerFunctionEnd2EndIT
[INFO] Running org.apache.phoenix.end2end.PointInTimeQueryIT
[INFO] Tests run: 1, Failures: 0, Errors: 0, Skipped: 0, Time elapsed: 8.962 s - in org.apache.phoenix.end2end.PowerFunctionEnd2EndIT
[INFO] Running org.apache.phoenix.end2end.QueryDatabaseMetaDataIT
[INFO] Tests run: 9, Failures: 0, Errors: 0, Skipped: 0, Time elapsed: 49.167 s - in org.apache.phoenix.end2end.PrimitiveTypeIT
[INFO] Running org.apache.phoenix.end2end.ProductMetricsIT
[INFO] Running org.apache.phoenix.end2end.QueryExecWithoutSCNIT
[INFO] Tests run: 1, Failures: 0, Errors: 0, Skipped: 0, Time elapsed: 4.364 s - in org.apache.phoenix.end2end.QueryExecWithoutSCNIT
[INFO] Running org.apache.phoenix.end2end.QueryIT
[INFO] Tests run: 18, Failures: 0, Errors: 0, Skipped: 0, Time elapsed: 168.029 s - in org.apache.phoenix.end2end.QueryDatabaseMetaDataIT
[INFO] Running org.apache.phoenix.end2end.QueryMoreIT
[INFO] Tests run: 55, Failures: 0, Errors: 0, Skipped: 0, Time elapsed: 243.171 s - in org.apache.phoenix.end2end.ProductMetricsIT
[INFO] Tests run: 9, Failures: 0, Errors: 0, Skipped: 0, Time elapsed: 85.502 s - in org.apache.phoenix.end2end.QueryMoreIT
[INFO] Running org.apache.phoenix.end2end.RTrimFunctionIT
[INFO] Running org.apache.phoenix.end2end.QueryWithOffsetIT
[INFO] Tests run: 2, Failures: 0, Errors: 0, Skipped: 0, Time elapsed: 8.74 s - in org.apache.phoenix.end2end.RTrimFunctionIT
[INFO] Running org.apache.phoenix.end2end.RangeScanIT
[INFO] Tests run: 8, Failures: 0, Errors: 0, Skipped: 0, Time elapsed: 37.799 s - in org.apache.phoenix.end2end.QueryWithOffsetIT
[INFO] Running org.apache.phoenix.end2end.ReadOnlyIT
[INFO] Tests run: 1, Failures: 0, Errors: 0, Skipped: 0, Time elapsed: 11.413 s - in org.apache.phoenix.end2end.ReadOnlyIT
[INFO] Running org.apache.phoenix.end2end.RegexpReplaceFunctionIT
[INFO] Tests run: 2, Failures: 0, Errors: 0, Skipped: 0, Time elapsed: 8.633 s - in org.apache.phoenix.end2end.RegexpReplaceFunctionIT
[INFO] Running org.apache.phoenix.end2end.RegexpSplitFunctionIT
[INFO] Tests run: 12, Failures: 0, Errors: 0, Skipped: 0, Time elapsed: 49.405 s - in org.apache.phoenix.end2end.RegexpSplitFunctionIT
[INFO] Running org.apache.phoenix.end2end.RegexpSubstrFunctionIT
[INFO] Tests run: 2, Failures: 0, Errors: 0, Skipped: 0, Time elapsed: 8.922 s - in org.apache.phoenix.end2end.RegexpSubstrFunctionIT
[INFO] Running org.apache.phoenix.end2end.ReverseFunctionIT
[INFO] Tests run: 5, Failures: 0, Errors: 0, Skipped: 0, Time elapsed: 21.705 s - in org.apache.phoenix.end2end.ReverseFunctionIT
[INFO] Running org.apache.phoenix.end2end.ReverseScanIT
[INFO] Tests run: 42, Failures: 0, Errors: 0, Skipped: 0, Time elapsed: 385.191 s - in org.apache.phoenix.end2end.QueryIT
[INFO] Tests run: 5, Failures: 0, Errors: 0, Skipped: 0, Time elapsed: 27.062 s - in org.apache.phoenix.end2end.ReverseScanIT
[INFO] Running org.apache.phoenix.end2end.RoundFloorCeilFuncIT
[INFO] Running org.apache.phoenix.end2end.RowTimestampIT
[INFO] Tests run: 16, Failures: 0, Errors: 0, Skipped: 0, Time elapsed: 87.414 s - in org.apache.phoenix.end2end.RowTimestampIT
[INFO] Running org.apache.phoenix.end2end.RowValueConstructorIT
[INFO] Tests run: 33, Failures: 0, Errors: 0, Skipped: 0, Time elapsed: 152.803 s - in org.apache.phoenix.end2end.RoundFloorCeilFuncIT
[INFO] Running org.apache.phoenix.end2end.SequenceBulkAllocationIT
[INFO] Tests run: 56, Failures: 0, Errors: 0, Skipped: 0, Time elapsed: 26.778 s - in org.apache.phoenix.end2end.SequenceBulkAllocationIT
[INFO] Running org.apache.phoenix.end2end.SequenceIT
[INFO] Tests run: 55, Failures: 0, Errors: 0, Skipped: 0, Time elapsed: 69.395 s - in org.apache.phoenix.end2end.SequenceIT
[INFO] Running org.apache.phoenix.end2end.SerialIteratorsIT
[INFO] Tests run: 1, Failures: 0, Errors: 0, Skipped: 0, Time elapsed: 4.447 s - in org.apache.phoenix.end2end.SerialIteratorsIT
[INFO] Running org.apache.phoenix.end2end.ServerExceptionIT
[INFO] Tests run: 1, Failures: 0, Errors: 0, Skipped: 0, Time elapsed: 4.37 s - in org.apache.phoenix.end2end.ServerExceptionIT
[INFO] Running org.apache.phoenix.end2end.SetPropertyOnEncodedTableIT
[INFO] Tests run: 32, Failures: 0, Errors: 0, Skipped: 0, Time elapsed: 282.446 s - in org.apache.phoenix.end2end.SetPropertyOnEncodedTableIT
[INFO] Running org.apache.phoenix.end2end.SetPropertyOnNonEncodedTableIT
[INFO] Tests run: 32, Failures: 0, Errors: 0, Skipped: 0, Time elapsed: 279.748 s - in org.apache.phoenix.end2end.SetPropertyOnNonEncodedTableIT
[INFO] Running org.apache.phoenix.end2end.SignFunctionEnd2EndIT
[INFO] Tests run: 2, Failures: 0, Errors: 0, Skipped: 0, Time elapsed: 18.65 s - in org.apache.phoenix.end2end.SignFunctionEnd2EndIT
[INFO] Running org.apache.phoenix.end2end.SkipScanAfterManualSplitIT
[INFO] Tests run: 3, Failures: 0, Errors: 0, Skipped: 0, Time elapsed: 40.941 s - in org.apache.phoenix.end2end.SkipScanAfterManualSplitIT
[INFO] Running org.apache.phoenix.end2end.SkipScanQueryIT
[INFO] Tests run: 13, Failures: 0, Errors: 0, Skipped: 0, Time elapsed: 59.107 s - in org.apache.phoenix.end2end.SkipScanQueryIT
[INFO] Running org.apache.phoenix.end2end.SortMergeJoinMoreIT
[INFO] Tests run: 6, Failures: 0, Errors: 0, Skipped: 0, Time elapsed: 81.799 s - in org.apache.phoenix.end2end.SortMergeJoinMoreIT
[INFO] Running org.apache.phoenix.end2end.SortOrderIT
[INFO] Tests run: 46, Failures: 0, Errors: 0, Skipped: 0, Time elapsed: 294.31 s - in org.apache.phoenix.end2end.SortOrderIT
[INFO] Running org.apache.phoenix.end2end.SpooledTmpFileDeleteIT
[INFO] Tests run: 1, Failures: 0, Errors: 0, Skipped: 0, Time elapsed: 4.656 s - in org.apache.phoenix.end2end.SpooledTmpFileDeleteIT
[INFO] Running org.apache.phoenix.end2end.SqrtFunctionEnd2EndIT
[INFO] Tests run: 2, Failures: 0, Errors: 0, Skipped: 0, Time elapsed: 16.031 s - in org.apache.phoenix.end2end.SqrtFunctionEnd2EndIT
[INFO] Running org.apache.phoenix.end2end.StatementHintsIT
[INFO] Tests run: 2, Failures: 0, Errors: 0, Skipped: 0, Time elapsed: 2.347 s - in org.apache.phoenix.end2end.StatementHintsIT
[INFO] Running org.apache.phoenix.end2end.StddevIT
[INFO] Tests run: 4, Failures: 0, Errors: 0, Skipped: 0, Time elapsed: 18.147 s - in org.apache.phoenix.end2end.StddevIT
[INFO] Running org.apache.phoenix.end2end.StoreNullsIT
Build timed out (after 200 minutes). Marking the build as failed.
Build was aborted
Archiving artifacts
ERROR: Failed to archive artifacts: **/surefire-reports/*,**/failsafe-reports/*.xml,**/*.txt,**/*.jar,**/bin/*.py,**/bin/*.xml,**/bin/*.properties
hudson.remoting.ProxyException: java.lang.Throwable
	at hudson.remoting.FastPipedOutputStream.<init>(FastPipedOutputStream.java:49)
	at hudson.remoting.Pipe.readObject(Pipe.java:191)
	at sun.reflect.GeneratedMethodAccessor708.invoke(Unknown Source)
	at sun.reflect.DelegatingMethodAccessorImpl.invoke(DelegatingMethodAccessorImpl.java:43)
	at java.lang.reflect.Method.invoke(Method.java:498)
	at java.io.ObjectStreamClass.invokeReadObject(ObjectStreamClass.java:1058)
	at java.io.ObjectInputStream.readSerialData(ObjectInputStream.java:2136)
	at java.io.ObjectInputStream.readOrdinaryObject(ObjectInputStream.java:2027)
	at java.io.ObjectInputStream.readObject0(ObjectInputStream.java:1535)
	at java.io.ObjectInputStream.defaultReadFields(ObjectInputStream.java:2245)
	at java.io.ObjectInputStream.readSerialData(ObjectInputStream.java:2169)
	at java.io.ObjectInputStream.readOrdinaryObject(ObjectInputStream.java:2027)
	at java.io.ObjectInputStream.readObject0(ObjectInputStream.java:1535)
	at java.io.ObjectInputStream.defaultReadFields(ObjectInputStream.java:2245)
	at java.io.ObjectInputStream.readSerialData(ObjectInputStream.java:2169)
	at java.io.ObjectInputStream.readOrdinaryObject(ObjectInputStream.java:2027)
	at java.io.ObjectInputStream.readObject0(ObjectInputStream.java:1535)
	at java.io.ObjectInputStream.readObject(ObjectInputStream.java:422)
	at hudson.remoting.UserRequest.deserialize(UserRequest.java:274)
	at hudson.remoting.UserRequest.perform(UserRequest.java:185)
	at hudson.remoting.UserRequest.perform(UserRequest.java:53)
	at hudson.remoting.Request$2.run(Request.java:358)
Caused: hudson.remoting.ProxyException: java.io.IOException: Reader side has already been
abandoned
	at hudson.remoting.FastPipedOutputStream.sink(FastPipedOutputStream.java:81)
	at hudson.remoting.FastPipedOutputStream.write(FastPipedOutputStream.java:151)
	at hudson.remoting.FastPipedOutputStream.write(FastPipedOutputStream.java:138)
	at hudson.remoting.ProxyOutputStream$Chunk$1.run(ProxyOutputStream.java:256)
	at hudson.remoting.PipeWriter$1.run(PipeWriter.java:158)
	at java.util.concurrent.Executors$RunnableAdapter.call(Executors.java:511)
	at java.util.concurrent.FutureTask.run(FutureTask.java:266)
	at hudson.remoting.SingleLaneExecutorService$1.run(SingleLaneExecutorService.java:112)
	at hudson.remoting.InterceptingExecutorService$1.call(InterceptingExecutorService.java:72)
	at java.util.concurrent.FutureTask.run(FutureTask.java:266)
	at java.util.concurrent.ThreadPoolExecutor.runWorker(ThreadPoolExecutor.java:1142)
	at java.util.concurrent.ThreadPoolExecutor$Worker.run(ThreadPoolExecutor.java:617)
	at java.lang.Thread.run(Thread.java:748)
Caused: java.io.IOException: Pipe is already closed
	at hudson.remoting.PipeWindow.checkDeath(PipeWindow.java:110)
	at hudson.remoting.PipeWindow$Real.get(PipeWindow.java:207)
	at hudson.remoting.ProxyOutputStream.write(ProxyOutputStream.java:125)
	at java.io.BufferedOutputStream.flushBuffer(BufferedOutputStream.java:82)
	at java.io.BufferedOutputStream.write(BufferedOutputStream.java:126)
	at java.util.zip.GZIPOutputStream.finish(GZIPOutputStream.java:168)
	at java.util.zip.DeflaterOutputStream.close(DeflaterOutputStream.java:238)
	at jsync.protocol.BaseWriter.close(BaseWriter.java:14)
	at jsync.protocol.BlockIterableWriter.close(BlockIterableWriter.java:26)
	at com.cloudbees.jenkins.plugins.jsync.archiver.JSyncArtifactManager.remoteSync(JSyncArtifactManager.java:151)
	at com.cloudbees.jenkins.plugins.jsync.archiver.JSyncArtifactManager.archive(JSyncArtifactManager.java:76)
	at hudson.tasks.ArtifactArchiver.perform(ArtifactArchiver.java:245)
	at hudson.tasks.BuildStepCompatibilityLayer.perform(BuildStepCompatibilityLayer.java:81)
	at hudson.tasks.BuildStepMonitor$1.perform(BuildStepMonitor.java:20)
	at hudson.model.AbstractBuild$AbstractBuildExecution.perform(AbstractBuild.java:744)
	at hudson.model.AbstractBuild$AbstractBuildExecution.performAllBuildSteps(AbstractBuild.java:690)
	at hudson.model.Build$BuildExecution.post2(Build.java:186)
	at hudson.model.AbstractBuild$AbstractBuildExecution.post(AbstractBuild.java:635)
	at hudson.model.Run.execute(Run.java:1749)
	at hudson.model.FreeStyleBuild.run(FreeStyleBuild.java:43)
	at hudson.model.ResourceController.execute(ResourceController.java:97)
	at hudson.model.Executor.run(Executor.java:429)
Recording test results
Not sending mail to unregistered user ankitsinghal59@gmail.com

Mime
View raw message