phoenix-commits mailing list archives

Site index · List index
Message view « Date » · « Thread »
Top « Date » · « Thread »
From Apache Jenkins Server <jenk...@builds.apache.org>
Subject Build failed in Jenkins: Phoenix | 4.x-HBase-0.98 #1894
Date Thu, 17 May 2018 07:36:09 GMT
See <https://builds.apache.org/job/Phoenix-4.x-HBase-0.98/1894/display/redirect?page=changes>

Changes:

[ankitsinghal59] PHOENIX-4685 Properly handle connection caching for Phoenix inside

[jtaylor] PHOENIX-4701 Write client-side metrics asynchronously to

------------------------------------------
[...truncated 106.61 KB...]
[INFO] Running org.apache.phoenix.end2end.join.HashJoinGlobalIndexIT
[WARNING] Tests run: 14, Failures: 0, Errors: 0, Skipped: 2, Time elapsed: 52.713 s - in org.apache.phoenix.end2end.index.ViewIndexIT
[INFO] Tests run: 8, Failures: 0, Errors: 0, Skipped: 0, Time elapsed: 40.757 s - in org.apache.phoenix.end2end.index.txn.RollbackIT
[INFO] Running org.apache.phoenix.end2end.join.HashJoinMoreIT
[INFO] Running org.apache.phoenix.end2end.join.HashJoinLocalIndexIT
[INFO] Tests run: 8, Failures: 0, Errors: 0, Skipped: 0, Time elapsed: 34.484 s - in org.apache.phoenix.end2end.join.HashJoinMoreIT
[INFO] Running org.apache.phoenix.end2end.join.HashJoinNoIndexIT
[INFO] Tests run: 40, Failures: 0, Errors: 0, Skipped: 0, Time elapsed: 304.089 s - in org.apache.phoenix.end2end.index.LocalMutableTxIndexIT
[INFO] Running org.apache.phoenix.end2end.join.SortMergeJoinGlobalIndexIT
[INFO] Tests run: 33, Failures: 0, Errors: 0, Skipped: 0, Time elapsed: 135.881 s - in org.apache.phoenix.end2end.join.HashJoinNoIndexIT
[INFO] Tests run: 33, Failures: 0, Errors: 0, Skipped: 0, Time elapsed: 205.129 s - in org.apache.phoenix.end2end.join.HashJoinGlobalIndexIT
[INFO] Running org.apache.phoenix.end2end.join.SortMergeJoinLocalIndexIT
[INFO] Running org.apache.phoenix.end2end.join.SortMergeJoinNoIndexIT
[INFO] Tests run: 34, Failures: 0, Errors: 0, Skipped: 0, Time elapsed: 226.561 s - in org.apache.phoenix.end2end.join.SortMergeJoinGlobalIndexIT
[INFO] Tests run: 34, Failures: 0, Errors: 0, Skipped: 0, Time elapsed: 119.956 s - in org.apache.phoenix.end2end.join.SortMergeJoinNoIndexIT
[INFO] Tests run: 80, Failures: 0, Errors: 0, Skipped: 0, Time elapsed: 553.073 s - in org.apache.phoenix.end2end.index.MutableIndexIT
[INFO] Running org.apache.phoenix.end2end.join.SubqueryIT
[INFO] Running org.apache.phoenix.end2end.join.SubqueryUsingSortMergeJoinIT
[INFO] Running org.apache.phoenix.end2end.salted.SaltedTableIT
[INFO] Tests run: 8, Failures: 0, Errors: 0, Skipped: 0, Time elapsed: 9.655 s - in org.apache.phoenix.end2end.salted.SaltedTableIT
[INFO] Running org.apache.phoenix.end2end.salted.SaltedTableUpsertSelectIT
[INFO] Tests run: 6, Failures: 0, Errors: 0, Skipped: 0, Time elapsed: 20.304 s - in org.apache.phoenix.end2end.salted.SaltedTableUpsertSelectIT
[INFO] Running org.apache.phoenix.end2end.salted.SaltedTableVarLengthRowKeyIT
[INFO] Tests run: 1, Failures: 0, Errors: 0, Skipped: 0, Time elapsed: 1.364 s - in org.apache.phoenix.end2end.salted.SaltedTableVarLengthRowKeyIT
[INFO] Running org.apache.phoenix.iterate.PhoenixQueryTimeoutIT
[INFO] Tests run: 2, Failures: 0, Errors: 0, Skipped: 0, Time elapsed: 3.048 s - in org.apache.phoenix.iterate.PhoenixQueryTimeoutIT
[INFO] Running org.apache.phoenix.iterate.RoundRobinResultIteratorIT
[INFO] Tests run: 9, Failures: 0, Errors: 0, Skipped: 0, Time elapsed: 49.61 s - in org.apache.phoenix.iterate.RoundRobinResultIteratorIT
[INFO] Running org.apache.phoenix.rpc.UpdateCacheIT
[INFO] Tests run: 15, Failures: 0, Errors: 0, Skipped: 0, Time elapsed: 122.491 s - in org.apache.phoenix.end2end.join.SubqueryUsingSortMergeJoinIT
[INFO] Tests run: 34, Failures: 0, Errors: 0, Skipped: 0, Time elapsed: 471.944 s - in org.apache.phoenix.end2end.join.HashJoinLocalIndexIT
[INFO] Tests run: 7, Failures: 0, Errors: 0, Skipped: 0, Time elapsed: 18 s - in org.apache.phoenix.rpc.UpdateCacheIT
[INFO] Running org.apache.phoenix.trace.PhoenixTracingEndToEndIT
[INFO] Running org.apache.phoenix.trace.PhoenixTableMetricsWriterIT
[INFO] Tests run: 2, Failures: 0, Errors: 0, Skipped: 0, Time elapsed: 2.874 s - in org.apache.phoenix.trace.PhoenixTableMetricsWriterIT
[INFO] Running org.apache.phoenix.tx.FlappingTransactionIT
[INFO] Running org.apache.phoenix.trace.PhoenixTraceReaderIT
[INFO] Tests run: 4, Failures: 0, Errors: 0, Skipped: 0, Time elapsed: 6.772 s - in org.apache.phoenix.tx.FlappingTransactionIT
[INFO] Running org.apache.phoenix.tx.ParameterizedTransactionIT
[INFO] Tests run: 2, Failures: 0, Errors: 0, Skipped: 0, Time elapsed: 2.718 s - in org.apache.phoenix.trace.PhoenixTraceReaderIT
[INFO] Running org.apache.phoenix.tx.TransactionIT
[INFO] Tests run: 24, Failures: 0, Errors: 0, Skipped: 0, Time elapsed: 174.757 s - in org.apache.phoenix.end2end.join.SubqueryIT
[INFO] Running org.apache.phoenix.tx.TxCheckpointIT
[INFO] Tests run: 8, Failures: 0, Errors: 0, Skipped: 0, Time elapsed: 39.785 s - in org.apache.phoenix.tx.TransactionIT
[INFO] Running org.apache.phoenix.util.IndexScrutinyIT
[INFO] Tests run: 3, Failures: 0, Errors: 0, Skipped: 0, Time elapsed: 11.978 s - in org.apache.phoenix.util.IndexScrutinyIT
[INFO] Tests run: 6, Failures: 0, Errors: 0, Skipped: 0, Time elapsed: 87.673 s - in org.apache.phoenix.trace.PhoenixTracingEndToEndIT
[INFO] Tests run: 34, Failures: 0, Errors: 0, Skipped: 0, Time elapsed: 474.058 s - in org.apache.phoenix.end2end.join.SortMergeJoinLocalIndexIT
[ERROR] Tests run: 52, Failures: 4, Errors: 0, Skipped: 0, Time elapsed: 194.793 s <<<
FAILURE! - in org.apache.phoenix.tx.ParameterizedTransactionIT
[ERROR] testNonTxToTxTableFailure[TransactionIT_mutable=false,columnEncoded=false](org.apache.phoenix.tx.ParameterizedTransactionIT)
 Time elapsed: 6.719 s  <<< FAILURE!
java.lang.AssertionError
	at org.apache.phoenix.tx.ParameterizedTransactionIT.testNonTxToTxTableFailure(ParameterizedTransactionIT.java:350)

[ERROR] testNonTxToTxTableFailure[TransactionIT_mutable=false,columnEncoded=true](org.apache.phoenix.tx.ParameterizedTransactionIT)
 Time elapsed: 7.089 s  <<< FAILURE!
java.lang.AssertionError
	at org.apache.phoenix.tx.ParameterizedTransactionIT.testNonTxToTxTableFailure(ParameterizedTransactionIT.java:350)

[ERROR] testNonTxToTxTableFailure[TransactionIT_mutable=true,columnEncoded=false](org.apache.phoenix.tx.ParameterizedTransactionIT)
 Time elapsed: 6.704 s  <<< FAILURE!
java.lang.AssertionError
	at org.apache.phoenix.tx.ParameterizedTransactionIT.testNonTxToTxTableFailure(ParameterizedTransactionIT.java:350)

[ERROR] testNonTxToTxTableFailure[TransactionIT_mutable=true,columnEncoded=true](org.apache.phoenix.tx.ParameterizedTransactionIT)
 Time elapsed: 6.392 s  <<< FAILURE!
java.lang.AssertionError
	at org.apache.phoenix.tx.ParameterizedTransactionIT.testNonTxToTxTableFailure(ParameterizedTransactionIT.java:350)

[INFO] Tests run: 40, Failures: 0, Errors: 0, Skipped: 0, Time elapsed: 226.944 s - in org.apache.phoenix.tx.TxCheckpointIT
[INFO] 
[INFO] Results:
[INFO] 
[ERROR] Failures: 
[ERROR]   ParameterizedTransactionIT.testNonTxToTxTableFailure:350
[ERROR]   ParameterizedTransactionIT.testNonTxToTxTableFailure:350
[ERROR]   ParameterizedTransactionIT.testNonTxToTxTableFailure:350
[ERROR]   ParameterizedTransactionIT.testNonTxToTxTableFailure:350
[INFO] 
[ERROR] Tests run: 3438, Failures: 4, Errors: 0, Skipped: 3
[INFO] 
[INFO] 
[INFO] --- maven-failsafe-plugin:2.20:integration-test (HBaseManagedTimeTests) @ phoenix-core
---
[INFO] 
[INFO] -------------------------------------------------------
[INFO]  T E S T S
[INFO] -------------------------------------------------------
[INFO] 
[INFO] Results:
[INFO] 
[INFO] Tests run: 0, Failures: 0, Errors: 0, Skipped: 0
[INFO] 
[INFO] 
[INFO] --- maven-failsafe-plugin:2.20:integration-test (NeedTheirOwnClusterTests) @ phoenix-core
---
[INFO] 
[INFO] -------------------------------------------------------
[INFO]  T E S T S
[INFO] -------------------------------------------------------
[INFO] Running org.apache.hadoop.hbase.regionserver.wal.WALReplayWithIndexWritesAndCompressedWALIT
[INFO] Tests run: 1, Failures: 0, Errors: 0, Skipped: 0, Time elapsed: 20.045 s - in org.apache.hadoop.hbase.regionserver.wal.WALReplayWithIndexWritesAndCompressedWALIT
[INFO] Running org.apache.hadoop.hbase.regionserver.wal.WALRecoveryRegionPostOpenIT
[INFO] Tests run: 1, Failures: 0, Errors: 0, Skipped: 0, Time elapsed: 4.125 s - in org.apache.hadoop.hbase.regionserver.wal.WALRecoveryRegionPostOpenIT
[INFO] Running org.apache.phoenix.end2end.ColumnEncodedImmutableNonTxStatsCollectorIT
[INFO] Running org.apache.phoenix.end2end.ColumnEncodedMutableNonTxStatsCollectorIT
[INFO] Running org.apache.phoenix.end2end.ColumnEncodedImmutableTxStatsCollectorIT
[INFO] Running org.apache.phoenix.end2end.ConnectionUtilIT
[INFO] Running org.apache.phoenix.end2end.ColumnEncodedMutableTxStatsCollectorIT
[INFO] Tests run: 1, Failures: 0, Errors: 0, Skipped: 0, Time elapsed: 17.946 s - in org.apache.phoenix.end2end.ConnectionUtilIT
[INFO] Running org.apache.phoenix.end2end.ContextClassloaderIT
[WARNING] Tests run: 26, Failures: 0, Errors: 0, Skipped: 4, Time elapsed: 87.795 s - in org.apache.phoenix.end2end.ColumnEncodedImmutableNonTxStatsCollectorIT
[INFO] Tests run: 3, Failures: 0, Errors: 0, Skipped: 0, Time elapsed: 1.93 s - in org.apache.phoenix.end2end.ContextClassloaderIT
[WARNING] Tests run: 26, Failures: 0, Errors: 0, Skipped: 4, Time elapsed: 89.099 s - in org.apache.phoenix.end2end.ColumnEncodedMutableNonTxStatsCollectorIT
[WARNING] Tests run: 26, Failures: 0, Errors: 0, Skipped: 4, Time elapsed: 92.708 s - in org.apache.phoenix.end2end.ColumnEncodedImmutableTxStatsCollectorIT
[WARNING] Tests run: 26, Failures: 0, Errors: 0, Skipped: 4, Time elapsed: 90.606 s - in org.apache.phoenix.end2end.ColumnEncodedMutableTxStatsCollectorIT
[INFO] Running org.apache.phoenix.end2end.CsvBulkLoadToolIT
[INFO] Running org.apache.phoenix.end2end.CountDistinctCompressionIT
[INFO] Running org.apache.phoenix.end2end.CostBasedDecisionIT
[INFO] Tests run: 1, Failures: 0, Errors: 0, Skipped: 0, Time elapsed: 2.937 s - in org.apache.phoenix.end2end.CountDistinctCompressionIT
[INFO] Running org.apache.phoenix.end2end.DropSchemaIT
[INFO] Tests run: 2, Failures: 0, Errors: 0, Skipped: 0, Time elapsed: 9.383 s - in org.apache.phoenix.end2end.DropSchemaIT
[INFO] Running org.apache.phoenix.end2end.FlappingLocalIndexIT
[INFO] Running org.apache.phoenix.end2end.IndexExtendedIT
[INFO] Running org.apache.phoenix.end2end.IndexScrutinyToolIT
[INFO] Tests run: 12, Failures: 0, Errors: 0, Skipped: 0, Time elapsed: 78.522 s - in org.apache.phoenix.end2end.CsvBulkLoadToolIT
[INFO] Running org.apache.phoenix.end2end.IndexToolForPartialBuildIT
[INFO] Tests run: 32, Failures: 0, Errors: 0, Skipped: 0, Time elapsed: 80.076 s - in org.apache.phoenix.end2end.IndexExtendedIT
[INFO] Tests run: 12, Failures: 0, Errors: 0, Skipped: 0, Time elapsed: 124.276 s - in org.apache.phoenix.end2end.FlappingLocalIndexIT
[INFO] Running org.apache.phoenix.end2end.IndexToolForPartialBuildWithNamespaceEnabledIT
[INFO] Running org.apache.phoenix.end2end.IndexToolIT
[INFO] Tests run: 20, Failures: 0, Errors: 0, Skipped: 0, Time elapsed: 325.551 s - in org.apache.phoenix.end2end.CostBasedDecisionIT
[INFO] Tests run: 33, Failures: 0, Errors: 0, Skipped: 0, Time elapsed: 311.437 s - in org.apache.phoenix.end2end.IndexScrutinyToolIT
[INFO] Running org.apache.phoenix.end2end.LocalIndexSplitMergeIT
[INFO] Running org.apache.phoenix.end2end.MigrateSystemTablesToSystemNamespaceIT
[INFO] Tests run: 3, Failures: 0, Errors: 0, Skipped: 0, Time elapsed: 76.667 s - in org.apache.phoenix.end2end.LocalIndexSplitMergeIT
[INFO] Running org.apache.phoenix.end2end.NonColumnEncodedImmutableNonTxStatsCollectorIT
[INFO] Tests run: 32, Failures: 0, Errors: 0, Skipped: 0, Time elapsed: 367.745 s - in org.apache.phoenix.end2end.IndexToolIT
[WARNING] Tests run: 26, Failures: 0, Errors: 0, Skipped: 4, Time elapsed: 86.748 s - in org.apache.phoenix.end2end.NonColumnEncodedImmutableNonTxStatsCollectorIT
[INFO] Running org.apache.phoenix.end2end.NonColumnEncodedImmutableTxStatsCollectorIT
[INFO] Running org.apache.phoenix.end2end.PhoenixDriverIT
[INFO] Tests run: 4, Failures: 0, Errors: 0, Skipped: 0, Time elapsed: 238.61 s - in org.apache.phoenix.end2end.MigrateSystemTablesToSystemNamespaceIT
[INFO] Tests run: 4, Failures: 0, Errors: 0, Skipped: 0, Time elapsed: 51.172 s - in org.apache.phoenix.end2end.PhoenixDriverIT
[INFO] Running org.apache.phoenix.end2end.QueryLoggerIT
[INFO] Tests run: 2, Failures: 0, Errors: 0, Skipped: 0, Time elapsed: 574.454 s - in org.apache.phoenix.end2end.IndexToolForPartialBuildIT
[WARNING] Tests run: 26, Failures: 0, Errors: 0, Skipped: 4, Time elapsed: 92.991 s - in org.apache.phoenix.end2end.NonColumnEncodedImmutableTxStatsCollectorIT
[INFO] Running org.apache.phoenix.end2end.QueryTimeoutIT
[INFO] Tests run: 7, Failures: 0, Errors: 0, Skipped: 0, Time elapsed: 46.578 s - in org.apache.phoenix.end2end.QueryLoggerIT
[INFO] Tests run: 2, Failures: 0, Errors: 0, Skipped: 0, Time elapsed: 8.856 s - in org.apache.phoenix.end2end.QueryTimeoutIT
[INFO] Running org.apache.phoenix.end2end.QueryWithLimitIT
[INFO] Tests run: 2, Failures: 0, Errors: 0, Skipped: 0, Time elapsed: 3.89 s - in org.apache.phoenix.end2end.QueryWithLimitIT
[INFO] Tests run: 2, Failures: 0, Errors: 0, Skipped: 0, Time elapsed: 572.621 s - in org.apache.phoenix.end2end.IndexToolForPartialBuildWithNamespaceEnabledIT
[INFO] Running org.apache.phoenix.end2end.RebuildIndexConnectionPropsIT
[INFO] Tests run: 1, Failures: 0, Errors: 0, Skipped: 0, Time elapsed: 1.013 s - in org.apache.phoenix.end2end.RebuildIndexConnectionPropsIT
[INFO] Running org.apache.phoenix.end2end.SystemCatalogCreationOnConnectionIT
[INFO] Running org.apache.phoenix.end2end.RegexBulkLoadToolIT
[INFO] Running org.apache.phoenix.end2end.RenewLeaseIT
[INFO] Running org.apache.phoenix.end2end.SpillableGroupByIT
[INFO] Running org.apache.phoenix.end2end.SysTableNamespaceMappedStatsCollectorIT
[INFO] Tests run: 1, Failures: 0, Errors: 0, Skipped: 0, Time elapsed: 25.737 s - in org.apache.phoenix.end2end.RenewLeaseIT
[INFO] Tests run: 3, Failures: 0, Errors: 0, Skipped: 0, Time elapsed: 9.923 s - in org.apache.phoenix.end2end.SpillableGroupByIT
[INFO] Running org.apache.phoenix.end2end.SystemTablePermissionsIT
[INFO] Tests run: 10, Failures: 0, Errors: 0, Skipped: 0, Time elapsed: 65.283 s - in org.apache.phoenix.end2end.RegexBulkLoadToolIT
[INFO] Running org.apache.phoenix.end2end.TableSnapshotReadsMapReduceIT
[INFO] Tests run: 3, Failures: 0, Errors: 0, Skipped: 0, Time elapsed: 23.98 s - in org.apache.phoenix.end2end.TableSnapshotReadsMapReduceIT
[INFO] Running org.apache.phoenix.end2end.UpdateCacheAcrossDifferentClientsIT
[WARNING] Tests run: 26, Failures: 0, Errors: 0, Skipped: 4, Time elapsed: 97.408 s - in org.apache.phoenix.end2end.SysTableNamespaceMappedStatsCollectorIT
[INFO] Tests run: 2, Failures: 0, Errors: 0, Skipped: 0, Time elapsed: 93.936 s - in org.apache.phoenix.end2end.SystemTablePermissionsIT
[INFO] Tests run: 6, Failures: 0, Errors: 0, Skipped: 0, Time elapsed: 21.228 s - in org.apache.phoenix.end2end.UpdateCacheAcrossDifferentClientsIT
[INFO] Running org.apache.phoenix.end2end.UserDefinedFunctionsIT
[INFO] Running org.apache.phoenix.end2end.index.ImmutableIndexIT
[INFO] Running org.apache.phoenix.end2end.index.MutableIndexFailureIT
[INFO] Running org.apache.phoenix.end2end.index.LocalIndexIT
[INFO] Tests run: 16, Failures: 0, Errors: 0, Skipped: 0, Time elapsed: 96.962 s - in org.apache.phoenix.end2end.UserDefinedFunctionsIT
[INFO] Running org.apache.phoenix.end2end.index.MutableIndexRebuilderIT
[INFO] Tests run: 1, Failures: 0, Errors: 0, Skipped: 0, Time elapsed: 42.72 s - in org.apache.phoenix.end2end.index.MutableIndexRebuilderIT
[INFO] Running org.apache.phoenix.end2end.index.MutableIndexReplicationIT
[INFO] Tests run: 1, Failures: 0, Errors: 0, Skipped: 0, Time elapsed: 16.967 s - in org.apache.phoenix.end2end.index.MutableIndexReplicationIT
[INFO] Running org.apache.phoenix.end2end.index.PartialIndexRebuilderIT
[INFO] Tests run: 21, Failures: 0, Errors: 0, Skipped: 0, Time elapsed: 241.188 s - in org.apache.phoenix.end2end.index.MutableIndexFailureIT
[WARNING] Tests run: 40, Failures: 0, Errors: 0, Skipped: 16, Time elapsed: 310.228 s - in
org.apache.phoenix.end2end.index.ImmutableIndexIT
[INFO] Running org.apache.phoenix.end2end.index.txn.TxWriteFailureIT
[INFO] Tests run: 36, Failures: 0, Errors: 0, Skipped: 0, Time elapsed: 313.368 s - in org.apache.phoenix.end2end.index.LocalIndexIT
[INFO] Tests run: 8, Failures: 0, Errors: 0, Skipped: 0, Time elapsed: 51.935 s - in org.apache.phoenix.end2end.index.txn.TxWriteFailureIT
[INFO] Running org.apache.phoenix.execute.UpsertSelectOverlappingBatchesIT
[INFO] Running org.apache.phoenix.hbase.index.FailForUnsupportedHBaseVersionsIT
[INFO] Running org.apache.phoenix.execute.PartialCommitIT
[INFO] Tests run: 12, Failures: 0, Errors: 0, Skipped: 0, Time elapsed: 0.923 s - in org.apache.phoenix.execute.PartialCommitIT
[INFO] Tests run: 2, Failures: 0, Errors: 0, Skipped: 0, Time elapsed: 23.667 s - in org.apache.phoenix.hbase.index.FailForUnsupportedHBaseVersionsIT
[INFO] Running org.apache.phoenix.iterate.RoundRobinResultIteratorWithStatsIT
[INFO] Tests run: 14, Failures: 0, Errors: 0, Skipped: 0, Time elapsed: 617.243 s - in org.apache.phoenix.end2end.SystemCatalogCreationOnConnectionIT
[INFO] Running org.apache.phoenix.iterate.ScannerLeaseRenewalIT
[INFO] Tests run: 1, Failures: 0, Errors: 0, Skipped: 0, Time elapsed: 5.458 s - in org.apache.phoenix.iterate.RoundRobinResultIteratorWithStatsIT
[INFO] Tests run: 25, Failures: 0, Errors: 0, Skipped: 0, Time elapsed: 222.743 s - in org.apache.phoenix.end2end.index.PartialIndexRebuilderIT
[INFO] Running org.apache.phoenix.monitoring.PhoenixMetricsIT
[INFO] Running org.apache.phoenix.rpc.PhoenixClientRpcIT
[INFO] Tests run: 2, Failures: 0, Errors: 0, Skipped: 0, Time elapsed: 2.471 s - in org.apache.phoenix.rpc.PhoenixClientRpcIT
[INFO] Running org.apache.phoenix.rpc.PhoenixServerRpcIT
[INFO] Tests run: 2, Failures: 0, Errors: 0, Skipped: 0, Time elapsed: 11.264 s - in org.apache.phoenix.rpc.PhoenixServerRpcIT
[INFO] Tests run: 22, Failures: 0, Errors: 0, Skipped: 0, Time elapsed: 67.08 s - in org.apache.phoenix.monitoring.PhoenixMetricsIT
[INFO] Tests run: 3, Failures: 0, Errors: 0, Skipped: 0, Time elapsed: 168.873 s - in org.apache.phoenix.execute.UpsertSelectOverlappingBatchesIT
[INFO] Tests run: 2, Failures: 0, Errors: 0, Skipped: 0, Time elapsed: 162.126 s - in org.apache.phoenix.iterate.ScannerLeaseRenewalIT
[INFO] 
[INFO] Results:
[INFO] 
[WARNING] Tests run: 592, Failures: 0, Errors: 0, Skipped: 44
[INFO] 
[INFO] 
[INFO] --- maven-failsafe-plugin:2.20:verify (ParallelStatsEnabledTest) @ phoenix-core ---
[INFO] ------------------------------------------------------------------------
[INFO] Reactor Summary:
[INFO] 
[INFO] Apache Phoenix ..................................... SUCCESS [  1.920 s]
[INFO] Phoenix Core ....................................... FAILURE [  01:34 h]
[INFO] Phoenix - Flume .................................... SKIPPED
[INFO] Phoenix - Kafka .................................... SKIPPED
[INFO] Phoenix - Pig ...................................... SKIPPED
[INFO] Phoenix Query Server Client ........................ SKIPPED
[INFO] Phoenix Query Server ............................... SKIPPED
[INFO] Phoenix - Pherf .................................... SKIPPED
[INFO] Phoenix - Spark .................................... SKIPPED
[INFO] Phoenix - Hive ..................................... SKIPPED
[INFO] Phoenix Client ..................................... SKIPPED
[INFO] Phoenix Server ..................................... SKIPPED
[INFO] Phoenix Assembly ................................... SKIPPED
[INFO] Phoenix - Tracing Web Application .................. SKIPPED
[INFO] Phoenix Load Balancer .............................. SKIPPED
[INFO] ------------------------------------------------------------------------
[INFO] BUILD FAILURE
[INFO] ------------------------------------------------------------------------
[INFO] Total time: 01:34 h
[INFO] Finished at: 2018-05-17T07:28:20Z
[INFO] Final Memory: 60M/737M
[INFO] ------------------------------------------------------------------------
[ERROR] Failed to execute goal org.apache.maven.plugins:maven-failsafe-plugin:2.20:verify
(ParallelStatsEnabledTest) on project phoenix-core: There are test failures.
[ERROR] 
[ERROR] Please refer to <https://builds.apache.org/job/Phoenix-4.x-HBase-0.98/ws/phoenix-core/target/failsafe-reports>
for the individual test results.
[ERROR] Please refer to dump files (if any exist) [date]-jvmRun[N].dump, [date].dumpstream
and [date]-jvmRun[N].dumpstream.
[ERROR] -> [Help 1]
[ERROR] 
[ERROR] To see the full stack trace of the errors, re-run Maven with the -e switch.
[ERROR] Re-run Maven using the -X switch to enable full debug logging.
[ERROR] 
[ERROR] For more information about the errors and possible solutions, please read the following
articles:
[ERROR] [Help 1] http://cwiki.apache.org/confluence/display/MAVEN/MojoFailureException
[ERROR] 
[ERROR] After correcting the problems, you can resume the build with the command
[ERROR]   mvn <goals> -rf :phoenix-core
Build step 'Invoke top-level Maven targets' marked build as failure
Archiving artifacts
[Fast Archiver] Compressed 1.68 GB of artifacts by 24.7% relative to #1879
[JIRA] Updating issue PHOENIX-4685
[JIRA] Updating issue PHOENIX-4701
Recording test results
Not sending mail to unregistered user ankitsinghal59@gmail.com

Mime
View raw message