phoenix-commits mailing list archives

Site index · List index
Message view « Date » · « Thread »
Top « Date » · « Thread »
From Apache Jenkins Server <jenk...@builds.apache.org>
Subject Build failed in Jenkins: Phoenix-4.x-HBase-1.2 #308
Date Wed, 04 Apr 2018 18:29:51 GMT
See <https://builds.apache.org/job/Phoenix-4.x-HBase-1.2/308/display/redirect?page=changes>

Changes:

[vincentpoon] PHOENIX-4682 UngroupedAggregateRegionObserver preCompactScannerOpen hook

------------------------------------------
[...truncated 1.49 KB...]

[EnvInject] - Variables injected successfully.
[Phoenix-4.x-HBase-1.2] $ /bin/bash -xe /tmp/jenkins6382883571221090762.sh
+ echo 'DELETING ~/.m2/repository/org/apache/htrace. See https://issues.apache.org/jira/browse/PHOENIX-1802'
DELETING ~/.m2/repository/org/apache/htrace. See https://issues.apache.org/jira/browse/PHOENIX-1802
+ echo 'CURRENT CONTENT:'
CURRENT CONTENT:
+ ls /home/jenkins/.m2/repository/org/apache/htrace
htrace
htrace-core
htrace-core4
htrace-zipkin
[Phoenix-4.x-HBase-1.2] $ /home/jenkins/tools/maven/latest3/bin/mvn -U clean install -Dcheckstyle.skip=true
[INFO] Scanning for projects...
[WARNING] 
[WARNING] Some problems were encountered while building the effective model for org.apache.phoenix:phoenix-core:jar:4.14.0-HBase-1.2-SNAPSHOT
[WARNING] Reporting configuration should be done in <reporting> section, not in maven-site-plugin <configuration> as reportPlugins parameter. @ org.apache.phoenix:phoenix-core:[unknown-version], <https://builds.apache.org/job/Phoenix-4.x-HBase-1.2/ws/phoenix-core/pom.xml,> line 65, column 23
[WARNING] 
[WARNING] Some problems were encountered while building the effective model for org.apache.phoenix:phoenix-flume:jar:4.14.0-HBase-1.2-SNAPSHOT
[WARNING] Reporting configuration should be done in <reporting> section, not in maven-site-plugin <configuration> as reportPlugins parameter.
[WARNING] 
[WARNING] Some problems were encountered while building the effective model for org.apache.phoenix:phoenix-kafka:jar:4.14.0-HBase-1.2-SNAPSHOT
[WARNING] Reporting configuration should be done in <reporting> section, not in maven-site-plugin <configuration> as reportPlugins parameter. @ org.apache.phoenix:phoenix-kafka:[unknown-version], <https://builds.apache.org/job/Phoenix-4.x-HBase-1.2/ws/phoenix-kafka/pom.xml,> line 353, column 20
[WARNING] 
[WARNING] Some problems were encountered while building the effective model for org.apache.phoenix:phoenix-pig:jar:4.14.0-HBase-1.2-SNAPSHOT
[WARNING] Reporting configuration should be done in <reporting> section, not in maven-site-plugin <configuration> as reportPlugins parameter.
[WARNING] 
[WARNING] Some problems were encountered while building the effective model for org.apache.phoenix:phoenix-queryserver-client:jar:4.14.0-HBase-1.2-SNAPSHOT
[WARNING] Reporting configuration should be done in <reporting> section, not in maven-site-plugin <configuration> as reportPlugins parameter.
[WARNING] 
[WARNING] Some problems were encountered while building the effective model for org.apache.phoenix:phoenix-queryserver:jar:4.14.0-HBase-1.2-SNAPSHOT
[WARNING] Reporting configuration should be done in <reporting> section, not in maven-site-plugin <configuration> as reportPlugins parameter.
[WARNING] 
[WARNING] Some problems were encountered while building the effective model for org.apache.phoenix:phoenix-pherf:jar:4.14.0-HBase-1.2-SNAPSHOT
[WARNING] Reporting configuration should be done in <reporting> section, not in maven-site-plugin <configuration> as reportPlugins parameter.
[WARNING] 
[WARNING] Some problems were encountered while building the effective model for org.apache.phoenix:phoenix-spark:jar:4.14.0-HBase-1.2-SNAPSHOT
[WARNING] Reporting configuration should be done in <reporting> section, not in maven-site-plugin <configuration> as reportPlugins parameter.
[WARNING] 
[WARNING] Some problems were encountered while building the effective model for org.apache.phoenix:phoenix-hive:jar:4.14.0-HBase-1.2-SNAPSHOT
[WARNING] Reporting configuration should be done in <reporting> section, not in maven-site-plugin <configuration> as reportPlugins parameter.
[WARNING] 
[WARNING] Some problems were encountered while building the effective model for org.apache.phoenix:phoenix-client:jar:4.14.0-HBase-1.2-SNAPSHOT
[WARNING] Reporting configuration should be done in <reporting> section, not in maven-site-plugin <configuration> as reportPlugins parameter. @ org.apache.phoenix:phoenix-client:[unknown-version], <https://builds.apache.org/job/Phoenix-4.x-HBase-1.2/ws/phoenix-client/pom.xml,> line 52, column 24
[WARNING] 
[WARNING] Some problems were encountered while building the effective model for org.apache.phoenix:phoenix-server:jar:4.14.0-HBase-1.2-SNAPSHOT
[WARNING] Reporting configuration should be done in <reporting> section, not in maven-site-plugin <configuration> as reportPlugins parameter. @ org.apache.phoenix:phoenix-server:[unknown-version], <https://builds.apache.org/job/Phoenix-4.x-HBase-1.2/ws/phoenix-server/pom.xml,> line 50, column 24
[WARNING] 
[WARNING] Some problems were encountered while building the effective model for org.apache.phoenix:phoenix-assembly:pom:4.14.0-HBase-1.2-SNAPSHOT
[WARNING] Reporting configuration should be done in <reporting> section, not in maven-site-plugin <configuration> as reportPlugins parameter.
[WARNING] 
[WARNING] Some problems were encountered while building the effective model for org.apache.phoenix:phoenix-tracing-webapp:jar:4.14.0-HBase-1.2-SNAPSHOT
[WARNING] Reporting configuration should be done in <reporting> section, not in maven-site-plugin <configuration> as reportPlugins parameter.
[WARNING] 
[WARNING] Some problems were encountered while building the effective model for org.apache.phoenix:phoenix-load-balancer:jar:4.14.0-HBase-1.2-SNAPSHOT
[WARNING] Reporting configuration should be done in <reporting> section, not in maven-site-plugin <configuration> as reportPlugins parameter.
[WARNING] 
[WARNING] Some problems were encountered while building the effective model for org.apache.phoenix:phoenix:pom:4.14.0-HBase-1.2-SNAPSHOT
[WARNING] Reporting configuration should be done in <reporting> section, not in maven-site-plugin <configuration> as reportPlugins parameter. @ line 445, column 24
[WARNING] 
[WARNING] It is highly recommended to fix these problems because they threaten the stability of your build.
[WARNING] 
[WARNING] For this reason, future Maven versions might no longer support building such malformed projects.
[WARNING] 
[INFO] ------------------------------------------------------------------------
[INFO] Reactor Build Order:
[INFO] 
[INFO] Apache Phoenix
[INFO] Phoenix Core
[INFO] Phoenix - Flume
[INFO] Phoenix - Kafka
[INFO] Phoenix - Pig
[INFO] Phoenix Query Server Client
[INFO] Phoenix Query Server
[INFO] Phoenix - Pherf
[INFO] Phoenix - Spark
[INFO] Phoenix - Hive
[INFO] Phoenix Client
[INFO] Phoenix Server
[INFO] Phoenix Assembly
[INFO] Phoenix - Tracing Web Application
[INFO] Phoenix Load Balancer
[INFO] 
[INFO] ------------------------------------------------------------------------
[INFO] Building Apache Phoenix 4.14.0-HBase-1.2-SNAPSHOT
[INFO] ------------------------------------------------------------------------
[INFO] 
[INFO] --- maven-clean-plugin:2.5:clean (default-clean) @ phoenix ---
[INFO] Deleting <https://builds.apache.org/job/Phoenix-4.x-HBase-1.2/ws/target>
[INFO] 
[INFO] --- maven-checkstyle-plugin:2.13:check (validate) @ phoenix ---
[INFO] 
[INFO] --- maven-remote-resources-plugin:1.5:process (default) @ phoenix ---
[INFO] 
[INFO] --- maven-source-plugin:2.2.1:jar-no-fork (attach-sources) @ phoenix ---
[INFO] 
[INFO] --- maven-jar-plugin:2.4:test-jar (default) @ phoenix ---
[WARNING] JAR will be empty - no content was marked for inclusion!
[INFO] Building jar: <https://builds.apache.org/job/Phoenix-4.x-HBase-1.2/308/artifact/target/phoenix-4.14.0-HBase-1.2-SNAPSHOT-tests.jar>
[INFO] 
[INFO] --- maven-site-plugin:3.2:attach-descriptor (attach-descriptor) @ phoenix ---
[INFO] 
[INFO] --- maven-install-plugin:2.5.2:install (default-install) @ phoenix ---
[INFO] Installing <https://builds.apache.org/job/Phoenix-4.x-HBase-1.2/ws/pom.xml> to /home/jenkins/.m2/repository/org/apache/phoenix/phoenix/4.14.0-HBase-1.2-SNAPSHOT/phoenix-4.14.0-HBase-1.2-SNAPSHOT.pom
[INFO] Installing <https://builds.apache.org/job/Phoenix-4.x-HBase-1.2/308/artifact/target/phoenix-4.14.0-HBase-1.2-SNAPSHOT-tests.jar> to /home/jenkins/.m2/repository/org/apache/phoenix/phoenix/4.14.0-HBase-1.2-SNAPSHOT/phoenix-4.14.0-HBase-1.2-SNAPSHOT-tests.jar
[INFO] 
[INFO] ------------------------------------------------------------------------
[INFO] Building Phoenix Core 4.14.0-HBase-1.2-SNAPSHOT
[INFO] ------------------------------------------------------------------------
[INFO] 
[INFO] --- maven-clean-plugin:2.5:clean (default-clean) @ phoenix-core ---
[INFO] Deleting <https://builds.apache.org/job/Phoenix-4.x-HBase-1.2/ws/phoenix-core/target>
[INFO] 
[INFO] --- maven-checkstyle-plugin:2.13:check (validate) @ phoenix-core ---
[INFO] 
[INFO] --- build-helper-maven-plugin:1.9.1:add-test-source (add-test-source) @ phoenix-core ---
[INFO] Test Source directory: <https://builds.apache.org/job/Phoenix-4.x-HBase-1.2/ws/phoenix-core/src/it/java> added.
[INFO] 
[INFO] --- build-helper-maven-plugin:1.9.1:add-test-resource (add-test-resource) @ phoenix-core ---
[INFO] 
[INFO] --- build-helper-maven-plugin:1.9.1:add-source (add-source) @ phoenix-core ---
[INFO] Source directory: <https://builds.apache.org/job/Phoenix-4.x-HBase-1.2/ws/phoenix-core/target/generated-sources/antlr3> added.
[INFO] Source directory: <https://builds.apache.org/job/Phoenix-4.x-HBase-1.2/ws/phoenix-core/src/main/antlr3> added.
[INFO] 
[INFO] --- antlr3-maven-plugin:3.5.2:antlr (default) @ phoenix-core ---
[INFO] ANTLR: Processing source directory <https://builds.apache.org/job/Phoenix-4.x-HBase-1.2/ws/phoenix-core/src/main/antlr3>
ANTLR Parser Generator  Version 3.5.2
Output file <https://builds.apache.org/job/Phoenix-4.x-HBase-1.2/ws/phoenix-core/target/generated-sources/antlr3/org/apache/phoenix/parse/PhoenixSQLParser.java> does not exist: must build <https://builds.apache.org/job/Phoenix-4.x-HBase-1.2/ws/phoenix-core/src/main/antlr3/PhoenixSQL.g>
PhoenixSQL.g
[INFO] 
[INFO] --- maven-dependency-plugin:2.1:build-classpath (create-phoenix-generated-classpath) @ phoenix-core ---
[INFO] Wrote classpath file '<https://builds.apache.org/job/Phoenix-4.x-HBase-1.2/ws/phoenix-core/target/cached_classpath.txt'.>
[INFO] 
[INFO] --- maven-remote-resources-plugin:1.5:process (default) @ phoenix-core ---
[INFO] 
[INFO] --- maven-resources-plugin:2.6:resources (default-resources) @ phoenix-core ---
[INFO] Using 'UTF-8' encoding to copy filtered resources.
[INFO] Copying 1 resource to META-INF/services
[INFO] Copying 3 resources
[INFO] 
[INFO] --- maven-compiler-plugin:3.0:compile (default-compile) @ phoenix-core ---
[INFO] Changes detected - recompiling the module!
[INFO] Compiling 1061 source files to <https://builds.apache.org/job/Phoenix-4.x-HBase-1.2/ws/phoenix-core/target/classes>
[WARNING] <https://builds.apache.org/job/Phoenix-4.x-HBase-1.2/ws/phoenix-core/src/main/java/org/apache/phoenix/execute/DescVarLengthFastByteComparisons.java>:[25,16] sun.misc.Unsafe is internal proprietary API and may be removed in a future release
[WARNING] <https://builds.apache.org/job/Phoenix-4.x-HBase-1.2/ws/phoenix-core/src/main/java/org/apache/phoenix/execute/DescVarLengthFastByteComparisons.java>:[116,26] sun.misc.Unsafe is internal proprietary API and may be removed in a future release
[WARNING] <https://builds.apache.org/job/Phoenix-4.x-HBase-1.2/ws/phoenix-core/src/main/java/org/apache/phoenix/execute/DescVarLengthFastByteComparisons.java>:[122,30] sun.misc.Unsafe is internal proprietary API and may be removed in a future release
[WARNING] <https://builds.apache.org/job/Phoenix-4.x-HBase-1.2/ws/phoenix-core/src/main/java/org/apache/phoenix/execute/DescVarLengthFastByteComparisons.java>:[126,39] sun.misc.Unsafe is internal proprietary API and may be removed in a future release
[WARNING] <https://builds.apache.org/job/Phoenix-4.x-HBase-1.2/ws/phoenix-core/src/main/java/org/apache/phoenix/compile/FromCompiler.java>: Some input files use or override a deprecated API.
[WARNING] <https://builds.apache.org/job/Phoenix-4.x-HBase-1.2/ws/phoenix-core/src/main/java/org/apache/phoenix/compile/FromCompiler.java>: Recompile with -Xlint:deprecation for details.
[WARNING] <https://builds.apache.org/job/Phoenix-4.x-HBase-1.2/ws/phoenix-core/src/main/java/org/apache/phoenix/parse/FunctionParseNode.java>: Some input files use unchecked or unsafe operations.
[WARNING] <https://builds.apache.org/job/Phoenix-4.x-HBase-1.2/ws/phoenix-core/src/main/java/org/apache/phoenix/parse/FunctionParseNode.java>: Recompile with -Xlint:unchecked for details.
[INFO] 
[INFO] --- maven-dependency-plugin:2.1:build-classpath (create-mrapp-generated-classpath) @ phoenix-core ---
[INFO] Wrote classpath file '<https://builds.apache.org/job/Phoenix-4.x-HBase-1.2/ws/phoenix-core/target/classes/mrapp-generated-classpath'.>
[INFO] 
[INFO] --- maven-resources-plugin:2.6:testResources (default-testResources) @ phoenix-core ---
[INFO] Using 'UTF-8' encoding to copy filtered resources.
[INFO] Copying 3 resources
[INFO] Copying 2 resources
[INFO] Copying 3 resources
[INFO] 
[INFO] --- maven-compiler-plugin:3.0:testCompile (default-testCompile) @ phoenix-core ---
[INFO] Changes detected - recompiling the module!
[INFO] Compiling 512 source files to <https://builds.apache.org/job/Phoenix-4.x-HBase-1.2/ws/phoenix-core/target/test-classes>
[INFO] -------------------------------------------------------------
[WARNING] COMPILATION WARNING : 
[INFO] -------------------------------------------------------------
[WARNING] <https://builds.apache.org/job/Phoenix-4.x-HBase-1.2/ws/phoenix-core/src/test/java/org/apache/phoenix/util/TestUtil.java>: Some input files use or override a deprecated API.
[WARNING] <https://builds.apache.org/job/Phoenix-4.x-HBase-1.2/ws/phoenix-core/src/test/java/org/apache/phoenix/util/TestUtil.java>: Recompile with -Xlint:deprecation for details.
[WARNING] <https://builds.apache.org/job/Phoenix-4.x-HBase-1.2/ws/phoenix-core/src/test/java/org/apache/phoenix/query/BaseTest.java>: Some input files use unchecked or unsafe operations.
[WARNING] <https://builds.apache.org/job/Phoenix-4.x-HBase-1.2/ws/phoenix-core/src/test/java/org/apache/phoenix/query/BaseTest.java>: Recompile with -Xlint:unchecked for details.
[INFO] 4 warnings 
[INFO] -------------------------------------------------------------
[INFO] -------------------------------------------------------------
[ERROR] COMPILATION ERROR : 
[INFO] -------------------------------------------------------------
[ERROR] <https://builds.apache.org/job/Phoenix-4.x-HBase-1.2/ws/phoenix-core/src/it/java/org/apache/phoenix/end2end/index/MutableIndexIT.java>:[740,21] cannot find symbol
  symbol:   variable ByteUtil
  location: class org.apache.phoenix.end2end.index.MutableIndexIT
[ERROR] <https://builds.apache.org/job/Phoenix-4.x-HBase-1.2/ws/phoenix-core/src/it/java/org/apache/phoenix/end2end/index/MutableIndexIT.java>:[742,55] cannot find symbol
  symbol:   variable ByteUtil
  location: class org.apache.phoenix.end2end.index.MutableIndexIT
[INFO] 2 errors 
[INFO] -------------------------------------------------------------
[INFO] ------------------------------------------------------------------------
[INFO] Reactor Summary:
[INFO] 
[INFO] Apache Phoenix ..................................... SUCCESS [  1.900 s]
[INFO] Phoenix Core ....................................... FAILURE [ 39.563 s]
[INFO] Phoenix - Flume .................................... SKIPPED
[INFO] Phoenix - Kafka .................................... SKIPPED
[INFO] Phoenix - Pig ...................................... SKIPPED
[INFO] Phoenix Query Server Client ........................ SKIPPED
[INFO] Phoenix Query Server ............................... SKIPPED
[INFO] Phoenix - Pherf .................................... SKIPPED
[INFO] Phoenix - Spark .................................... SKIPPED
[INFO] Phoenix - Hive ..................................... SKIPPED
[INFO] Phoenix Client ..................................... SKIPPED
[INFO] Phoenix Server ..................................... SKIPPED
[INFO] Phoenix Assembly ................................... SKIPPED
[INFO] Phoenix - Tracing Web Application .................. SKIPPED
[INFO] Phoenix Load Balancer .............................. SKIPPED
[INFO] ------------------------------------------------------------------------
[INFO] BUILD FAILURE
[INFO] ------------------------------------------------------------------------
[INFO] Total time: 43.092 s
[INFO] Finished at: 2018-04-04T18:22:00Z
[INFO] Final Memory: 78M/1667M
[INFO] ------------------------------------------------------------------------
[ERROR] Failed to execute goal org.apache.maven.plugins:maven-compiler-plugin:3.0:testCompile (default-testCompile) on project phoenix-core: Compilation failure: Compilation failure: 
[ERROR] <https://builds.apache.org/job/Phoenix-4.x-HBase-1.2/ws/phoenix-core/src/it/java/org/apache/phoenix/end2end/index/MutableIndexIT.java>:[740,21] cannot find symbol
[ERROR]   symbol:   variable ByteUtil
[ERROR]   location: class org.apache.phoenix.end2end.index.MutableIndexIT
[ERROR] <https://builds.apache.org/job/Phoenix-4.x-HBase-1.2/ws/phoenix-core/src/it/java/org/apache/phoenix/end2end/index/MutableIndexIT.java>:[742,55] cannot find symbol
[ERROR]   symbol:   variable ByteUtil
[ERROR]   location: class org.apache.phoenix.end2end.index.MutableIndexIT
[ERROR] -> [Help 1]
[ERROR] 
[ERROR] To see the full stack trace of the errors, re-run Maven with the -e switch.
[ERROR] Re-run Maven using the -X switch to enable full debug logging.
[ERROR] 
[ERROR] For more information about the errors and possible solutions, please read the following articles:
[ERROR] [Help 1] http://cwiki.apache.org/confluence/display/MAVEN/MojoFailureException
[ERROR] 
[ERROR] After correcting the problems, you can resume the build with the command
[ERROR]   mvn <goals> -rf :phoenix-core
Build step 'Invoke top-level Maven targets' marked build as failure
Archiving artifacts
ERROR: Failed to archive {phoenix-queryserver/target/failsafe-reports/org.apache.phoenix.end2end.HttpParamImpersonationQueryServerIT-output.txt=phoenix-queryserver/target/failsafe-reports/org.apache.phoenix.end2end.HttpParamImpersonationQueryServerIT-output.txt, phoenix-pig/target/failsafe-reports/TEST-org.apache.phoenix.pig.PhoenixHBaseLoaderIT.xml=phoenix-pig/target/failsafe-reports/TEST-org.apache.phoenix.pig.PhoenixHBaseLoaderIT.xml, phoenix-hive/target/dependency/xz-1.0.jar=phoenix-hive/target/dependency/xz-1.0.jar, phoenix-hive/target/dependency/hbase-hadoop2-compat-1.2.5-tests.jar=phoenix-hive/target/dependency/hbase-hadoop2-compat-1.2.5-tests.jar, phoenix-queryserver/target/surefire-reports/org.apache.phoenix.queryserver.server.PhoenixRemoteUserExtractorTest-output.txt=phoenix-queryserver/target/surefire-reports/org.apache.phoenix.queryserver.server.PhoenixRemoteUserExtractorTest-output.txt, phoenix-hive/target/surefire-reports/org.apache.phoenix.hive.query.PhoenixQueryBuilderTest.txt=phoenix-hive/target/surefire-reports/org.apache.phoenix.hive.query.PhoenixQueryBuilderTest.txt, phoenix-queryserver/target/surefire-reports/org.apache.phoenix.queryserver.server.PhoenixRemoteUserExtractorTest.txt=phoenix-queryserver/target/surefire-reports/org.apache.phoenix.queryserver.server.PhoenixRemoteUserExtractorTest.txt, phoenix-pherf/target/failsafe-reports/null-output.txt=phoenix-pherf/target/failsafe-reports/null-output.txt, phoenix-hive/target/dependency/janino-2.7.6.jar=phoenix-hive/target/dependency/janino-2.7.6.jar, phoenix-server/target/phoenix-4.14.0-HBase-1.2-SNAPSHOT-server.jar=phoenix-server/target/phoenix-4.14.0-HBase-1.2-SNAPSHOT-server.jar, phoenix-pig/target/failsafe-reports/org.apache.phoenix.pig.PhoenixHBaseLoaderIT.txt=phoenix-pig/target/failsafe-reports/org.apache.phoenix.pig.PhoenixHBaseLoaderIT.txt, phoenix-queryserver/target/failsafe-reports/org.apache.phoenix.end2end.SecureQueryServerIT.txt=phoenix-queryserver/target/failsafe-reports/org.apache.phoenix.end2end.SecureQueryServerIT.txt, phoenix-flume/target/failsafe-reports/null-output.txt=phoenix-flume/target/failsafe-reports/null-output.txt, phoenix-tracing-webapp/target/phoenix-tracing-webapp-4.14.0-HBase-1.2-SNAPSHOT-sources.jar=phoenix-tracing-webapp/target/phoenix-tracing-webapp-4.14.0-HBase-1.2-SNAPSHOT-sources.jar, phoenix-hive/target/dependency/hadoop-mapreduce-client-core-2.7.1.jar=phoenix-hive/target/dependency/hadoop-mapreduce-client-core-2.7.1.jar, phoenix-hive/target/dependency/jsp-2.1-6.1.14.jar=phoenix-hive/target/dependency/jsp-2.1-6.1.14.jar, phoenix-hive/target/dependency/tephra-core-0.13.0-incubating.jar=phoenix-hive/target/dependency/tephra-core-0.13.0-incubating.jar, phoenix-hive/target/dependency/commons-math3-3.1.1.jar=phoenix-hive/target/dependency/commons-math3-3.1.1.jar, phoenix-hive/target/phoenix-hive-4.14.0-HBase-1.2-SNAPSHOT.jar=phoenix-hive/target/phoenix-hive-4.14.0-HBase-1.2-SNAPSHOT.jar, phoenix-flume/target/failsafe-reports/org.apache.phoenix.flume.CsvEventSerializerIT-output.txt=phoenix-flume/target/failsafe-reports/org.apache.phoenix.flume.CsvEventSerializerIT-output.txt, phoenix-hive/target/dependency/curator-framework-2.6.0.jar=phoenix-hive/target/dependency/curator-framework-2.6.0.jar, phoenix-pig/target/phoenix-pig-4.14.0-HBase-1.2-SNAPSHOT-tests.jar=phoenix-pig/target/phoenix-pig-4.14.0-HBase-1.2-SNAPSHOT-tests.jar, phoenix-hive/target/dependency/hive-service-1.2.1.jar=phoenix-hive/target/dependency/hive-service-1.2.1.jar, phoenix-hive/target/dependency/twill-common-0.8.0.jar=phoenix-hive/target/dependency/twill-common-0.8.0.jar, phoenix-flume/target/failsafe-reports/org.apache.phoenix.flume.PhoenixSinkIT-output.txt=phoenix-flume/target/failsafe-reports/org.apache.phoenix.flume.PhoenixSinkIT-output.txt, phoenix-spark/target/surefire-reports/TEST-org.apache.phoenix.spark.AbstractPhoenixSparkIT.xml=phoenix-spark/target/surefire-reports/TEST-org.apache.phoenix.spark.AbstractPhoenixSparkIT.xml, phoenix-flume/target/failsafe-reports/org.apache.phoenix.flume.PhoenixSinkIT.txt=phoenix-flume/target/failsafe-reports/org.apache.phoenix.flume.PhoenixSinkIT.txt, phoenix-hive/target/dependency/hadoop-common-2.7.1.jar=phoenix-hive/target/dependency/hadoop-common-2.7.1.jar, phoenix-hive/target/dependency/twill-discovery-api-0.8.0.jar=phoenix-hive/target/dependency/twill-discovery-api-0.8.0.jar, phoenix-hive/target/dependency/commons-beanutils-1.7.0.jar=phoenix-hive/target/dependency/commons-beanutils-1.7.0.jar, phoenix-hive/target/dependency/jsch-0.1.42.jar=phoenix-hive/target/dependency/jsch-0.1.42.jar, phoenix-pherf/target/phoenix-pherf-4.14.0-HBase-1.2-SNAPSHOT-sources.jar=phoenix-pherf/target/phoenix-pherf-4.14.0-HBase-1.2-SNAPSHOT-sources.jar, phoenix-pig/target/surefire-reports/TEST-org.apache.phoenix.pig.util.SqlQueryToColumnInfoFunctionTest.xml=phoenix-pig/target/surefire-reports/TEST-org.apache.phoenix.pig.util.SqlQueryToColumnInfoFunctionTest.xml, phoenix-hive/target/dependency/hadoop-mapreduce-client-hs-2.7.1.jar=phoenix-hive/target/dependency/hadoop-mapreduce-client-hs-2.7.1.jar, phoenix-hive/target/test-data/f6bbdd3e-e550-4433-a887-cd4e83cf9480/metastore_dbtest/README_DO_NOT_TOUCH_FILES.txt=phoenix-hive/target/test-data/f6bbdd3e-e550-4433-a887-cd4e83cf9480/metastore_dbtest/README_DO_NOT_TOUCH_FILES.txt, phoenix-pig/target/failsafe-reports/org.apache.phoenix.pig.udf.ReserveNSequenceTestIT-output.txt=phoenix-pig/target/failsafe-reports/org.apache.phoenix.pig.udf.ReserveNSequenceTestIT-output.txt, phoenix-hive/target/failsafe-reports/org.apache.phoenix.hive.HiveMapReduceIT-output.txt=phoenix-hive/target/failsafe-reports/org.apache.phoenix.hive.HiveMapReduceIT-output.txt, phoenix-hive/target/dependency/hbase-server-1.2.5.jar=phoenix-hive/target/dependency/hbase-server-1.2.5.jar, phoenix-hive/target/dependency/hbase-prefix-tree-1.2.5.jar=phoenix-hive/target/dependency/hbase-prefix-tree-1.2.5.jar, phoenix-kafka/target/failsafe-reports/TEST-org.apache.phoenix.kafka.PhoenixConsumerIT.xml=phoenix-kafka/target/failsafe-reports/TEST-org.apache.phoenix.kafka.PhoenixConsumerIT.xml, phoenix-hive/target/dependency/netty-3.6.2.Final.jar=phoenix-hive/target/dependency/netty-3.6.2.Final.jar, phoenix-hive/target/dependency/jackson-jaxrs-1.9.2.jar=phoenix-hive/target/dependency/jackson-jaxrs-1.9.2.jar, phoenix-pig/target/failsafe-reports/null-output.txt=phoenix-pig/target/failsafe-reports/null-output.txt, phoenix-queryserver/target/surefire-reports/TEST-org.apache.phoenix.queryserver.server.PhoenixDoAsCallbackTest.xml=phoenix-queryserver/target/surefire-reports/TEST-org.apache.phoenix.queryserver.server.PhoenixDoAsCallbackTest.xml, phoenix-hive/target/dependency/jersey-client-1.9.jar=phoenix-hive/target/dependency/jersey-client-1.9.jar, phoenix-hive/target/dependency/avro-1.7.4.jar=phoenix-hive/target/dependency/avro-1.7.4.jar, phoenix-hive/target/dependency/hadoop-yarn-server-web-proxy-2.6.0.jar=phoenix-hive/target/dependency/hadoop-yarn-server-web-proxy-2.6.0.jar, phoenix-hive/target/dependency/json-20090211.jar=phoenix-hive/target/dependency/json-20090211.jar, phoenix-pherf/target/surefire-reports/org.apache.phoenix.pherf.TestHBaseProps.txt=phoenix-pherf/target/surefire-reports/org.apache.phoenix.pherf.TestHBaseProps.txt, phoenix-hive/target/dependency/tez-mapreduce-0.8.4.jar=phoenix-hive/target/dependency/tez-mapreduce-0.8.4.jar, phoenix-hive/target/dependency/hadoop-hdfs-2.7.1-tests.jar=phoenix-hive/target/dependency/hadoop-hdfs-2.7.1-tests.jar, phoenix-hive/target/dependency/commons-io-2.4.jar=phoenix-hive/target/dependency/commons-io-2.4.jar, phoenix-hive/target/dependency/hbase-common-1.2.5-tests.jar=phoenix-hive/target/dependency/hbase-common-1.2.5-tests.jar, phoenix-pherf/target/surefire-reports/TEST-org.apache.phoenix.pherf.util.ResourceListTest.xml=phoenix-pherf/target/surefire-reports/TEST-org.apache.phoenix.pherf.util.ResourceListTest.xml, phoenix-queryserver-client/target/phoenix-queryserver-client-4.14.0-HBase-1.2-SNAPSHOT.jar=phoenix-queryserver-client/target/phoenix-queryserver-client-4.14.0-HBase-1.2-SNAPSHOT.jar, phoenix-hive/target/dependency/antlr-runtime-3.5.2.jar=phoenix-hive/target/dependency/antlr-runtime-3.5.2.jar, phoenix-pig/target/surefire-reports/org.apache.phoenix.pig.util.SqlQueryToColumnInfoFunctionTest.txt=phoenix-pig/target/surefire-reports/org.apache.phoenix.pig.util.SqlQueryToColumnInfoFunctionTest.txt, phoenix-hive/target/dependency/hamcrest-core-1.3.jar=phoenix-hive/target/dependency/hamcrest-core-1.3.jar, phoenix-pig/target/surefire-reports/TEST-org.apache.phoenix.pig.util.TypeUtilTest.xml=phoenix-pig/target/surefire-reports/TEST-org.apache.phoenix.pig.util.TypeUtilTest.xml, phoenix-hive/target/dependency/jaxb-api-2.2.2.jar=phoenix-hive/target/dependency/jaxb-api-2.2.2.jar, phoenix-pig/target/surefire-reports/org.apache.phoenix.pig.util.TypeUtilTest.txt=phoenix-pig/target/surefire-reports/org.apache.phoenix.pig.util.TypeUtilTest.txt, phoenix-hive/target/dependency/i18n-util-1.0.4.jar=phoenix-hive/target/dependency/i18n-util-1.0.4.jar, phoenix-kafka/target/phoenix-kafka-4.14.0-HBase-1.2-SNAPSHOT.jar=phoenix-kafka/target/phoenix-kafka-4.14.0-HBase-1.2-SNAPSHOT.jar, phoenix-hive/target/dependency/httpclient-4.0.1.jar=phoenix-hive/target/dependency/httpclient-4.0.1.jar, bin/readme.txt=bin/readme.txt, phoenix-flume/target/failsafe-reports/TEST-org.apache.phoenix.flume.RegexEventSerializerIT.xml=phoenix-flume/target/failsafe-reports/TEST-org.apache.phoenix.flume.RegexEventSerializerIT.xml, bin/sandbox-log4j.properties=bin/sandbox-log4j.properties, phoenix-hive/target/phoenix-4.14.0-HBase-1.2-SNAPSHOT-hive.jar=phoenix-hive/target/phoenix-4.14.0-HBase-1.2-SNAPSHOT-hive.jar, phoenix-queryserver/target/failsafe-reports/failsafe-summary.xml=phoenix-queryserver/target/failsafe-reports/failsafe-summary.xml, bin/hadoop-metrics2-hbase.properties=bin/hadoop-metrics2-hbase.properties, phoenix-queryserver/target/surefire-reports/TEST-org.apache.phoenix.DriverCohabitationTest.xml=phoenix-queryserver/target/surefire-reports/TEST-org.apache.phoenix.DriverCohabitationTest.xml, phoenix-hive/target/dependency/datanucleus-rdbms-3.2.9.jar=phoenix-hive/target/dependency/datanucleus-rdbms-3.2.9.jar, phoenix-hive/target/dependency/jcip-annotations-1.0-1.jar=phoenix-hive/target/dependency/jcip-annotations-1.0-1.jar, phoenix-hive/target/dependency/hive-serde-1.2.1.jar=phoenix-hive/target/dependency/hive-serde-1.2.1.jar, phoenix-hive/target/dependency/slf4j-log4j12-1.7.5.jar=phoenix-hive/target/dependency/slf4j-log4j12-1.7.5.jar, phoenix-queryserver/target/failsafe-reports/org.apache.phoenix.end2end.QueryServerBasicsIT-output.txt=phoenix-queryserver/target/failsafe-reports/org.apache.phoenix.end2end.QueryServerBasicsIT-output.txt, phoenix-pherf/target/surefire-reports/org.apache.phoenix.pherf.PherfTest.txt=phoenix-pherf/target/surefire-reports/org.apache.phoenix.pherf.PherfTest.txt, phoenix-hive/target/dependency/hadoop-auth-2.7.1.jar=phoenix-hive/target/dependency/hadoop-auth-2.7.1.jar, phoenix-hive/target/dependency/geronimo-jta_1.1_spec-1.1.1.jar=phoenix-hive/target/dependency/geronimo-jta_1.1_spec-1.1.1.jar, phoenix-hive/target/dependency/commons-dbcp-1.4.jar=phoenix-hive/target/dependency/commons-dbcp-1.4.jar, phoenix-hive/target/dependency/hive-shims-1.2.1.jar=phoenix-hive/target/dependency/hive-shims-1.2.1.jar, phoenix-hive/target/dependency/findbugs-annotations-1.3.9-1.jar=phoenix-hive/target/dependency/findbugs-annotations-1.3.9-1.jar, phoenix-kafka/target/phoenix-kafka-4.14.0-HBase-1.2-SNAPSHOT-minimal.jar=phoenix-kafka/target/phoenix-kafka-4.14.0-HBase-1.2-SNAPSHOT-minimal.jar, phoenix-hive/target/failsafe-reports/null-output.txt=phoenix-hive/target/failsafe-reports/null-output.txt, bin/hbase-site.xml=bin/hbase-site.xml, phoenix-hive/target/dependency/jersey-core-1.9.jar=phoenix-hive/target/dependency/jersey-core-1.9.jar, phoenix-hive/target/dependency/apacheds-kerberos-codec-2.0.0-M15.jar=phoenix-hive/target/dependency/apacheds-kerberos-codec-2.0.0-M15.jar, phoenix-hive/target/dependency/disruptor-3.3.0.jar=phoenix-hive/target/dependency/disruptor-3.3.0.jar, phoenix-hive/target/dependency/hadoop-hdfs-2.7.1.jar=phoenix-hive/target/dependency/hadoop-hdfs-2.7.1.jar, phoenix-kafka/target/failsafe-reports/org.apache.phoenix.kafka.PhoenixConsumerIT.txt=phoenix-kafka/target/failsafe-reports/org.apache.phoenix.kafka.PhoenixConsumerIT.txt, phoenix-pherf/target/surefire-reports/TEST-org.apache.phoenix.pherf.ResultTest.xml=phoenix-pherf/target/surefire-reports/TEST-org.apache.phoenix.pherf.ResultTest.xml, phoenix-queryserver/target/failsafe-reports/null-output.txt=phoenix-queryserver/target/failsafe-reports/null-output.txt, phoenix-hive/target/dependency/hbase-client-1.2.5.jar=phoenix-hive/target/dependency/hbase-client-1.2.5.jar, phoenix-hive/target/dependency/commons-daemon-1.0.13.jar=phoenix-hive/target/dependency/commons-daemon-1.0.13.jar, phoenix-pherf/target/failsafe-reports/TEST-org.apache.phoenix.pherf.DataIngestIT.xml=phoenix-pherf/target/failsafe-reports/TEST-org.apache.phoenix.pherf.DataIngestIT.xml, phoenix-pig/target/failsafe-reports/TEST-org.apache.phoenix.pig.PhoenixHBaseStorerIT.xml=phoenix-pig/target/failsafe-reports/TEST-org.apache.phoenix.pig.PhoenixHBaseStorerIT.xml, phoenix-pig/target/phoenix-pig-4.14.0-HBase-1.2-SNAPSHOT.jar=phoenix-pig/target/phoenix-pig-4.14.0-HBase-1.2-SNAPSHOT.jar, phoenix-kafka/target/phoenix-kafka-4.14.0-HBase-1.2-SNAPSHOT-sources.jar=phoenix-kafka/target/phoenix-kafka-4.14.0-HBase-1.2-SNAPSHOT-sources.jar, phoenix-hive/target/dependency/commons-httpclient-3.0.1.jar=phoenix-hive/target/dependency/commons-httpclient-3.0.1.jar, phoenix-pig/target/surefire-reports/org.apache.phoenix.pig.util.QuerySchemaParserFunctionTest.txt=phoenix-pig/target/surefire-reports/org.apache.phoenix.pig.util.QuerySchemaParserFunctionTest.txt, phoenix-hive/target/dependency/activation-1.1.jar=phoenix-hive/target/dependency/activation-1.1.jar, phoenix-tracing-webapp/src/main/config/checkstyle/header.txt=phoenix-tracing-webapp/src/main/config/checkstyle/header.txt, phoenix-flume/target/phoenix-flume-4.14.0-HBase-1.2-SNAPSHOT-sources.jar=phoenix-flume/target/phoenix-flume-4.14.0-HBase-1.2-SNAPSHOT-sources.jar, phoenix-hive/target/dependency/ant-launcher-1.9.1.jar=phoenix-hive/target/dependency/ant-launcher-1.9.1.jar, phoenix-hive/target/dependency/xmlenc-0.52.jar=phoenix-hive/target/dependency/xmlenc-0.52.jar, phoenix-kafka/target/failsafe-reports/failsafe-summary.xml=phoenix-kafka/target/failsafe-reports/failsafe-summary.xml, phoenix-hive/target/dependency/commons-compiler-2.7.6.jar=phoenix-hive/target/dependency/commons-compiler-2.7.6.jar, phoenix-queryserver/target/surefire-reports/org.apache.phoenix.queryserver.server.RemoteUserExtractorFactoryTest.txt=phoenix-queryserver/target/surefire-reports/org.apache.phoenix.queryserver.server.RemoteUserExtractorFactoryTest.txt, phoenix-pherf/target/surefire-reports/org.apache.phoenix.pherf.ResourceTest.txt=phoenix-pherf/target/surefire-reports/org.apache.phoenix.pherf.ResourceTest.txt, phoenix-hive/target/dependency/twill-discovery-core-0.8.0.jar=phoenix-hive/target/dependency/twill-discovery-core-0.8.0.jar, phoenix-pherf/target/surefire-reports/org.apache.phoenix.pherf.RowCalculatorTest.txt=phoenix-pherf/target/surefire-reports/org.apache.phoenix.pherf.RowCalculatorTest.txt, phoenix-hive/target/failsafe-reports/org.apache.phoenix.hive.HiveTezIT-output.txt=phoenix-hive/target/failsafe-reports/org.apache.phoenix.hive.HiveTezIT-output.txt, phoenix-hive/target/dependency/guice-3.0.jar=phoenix-hive/target/dependency/guice-3.0.jar, phoenix-hive/target/dependency/jdo-api-3.0.1.jar=phoenix-hive/target/dependency/jdo-api-3.0.1.jar, phoenix-hive/target/dependency/jsr305-2.0.1.jar=phoenix-hive/target/dependency/jsr305-2.0.1.jar, src/main/config/checkstyle/header.txt=src/main/config/checkstyle/header.txt, phoenix-hive/target/dependency/servlet-api-2.5-6.1.14.jar=phoenix-hive/target/dependency/servlet-api-2.5-6.1.14.jar, phoenix-pherf/target/failsafe-reports/org.apache.phoenix.pherf.DataIngestIT-output.txt=phoenix-pherf/target/failsafe-reports/org.apache.phoenix.pherf.DataIngestIT-output.txt, phoenix-queryserver/target/failsafe-reports/TEST-org.apache.phoenix.end2end.SecureQueryServerIT.xml=phoenix-queryserver/target/failsafe-reports/TEST-org.apache.phoenix.end2end.SecureQueryServerIT.xml, phoenix-hive/target/dependency/apache-log4j-extras-1.2.17.jar=phoenix-hive/target/dependency/apache-log4j-extras-1.2.17.jar, phoenix-hive/target/dependency/ivy-2.4.0.jar=phoenix-hive/target/dependency/ivy-2.4.0.jar, phoenix-pherf/target/surefire-reports/TEST-org.apache.phoenix.pherf.ConfigurationParserTest.xml=phoenix-pherf/target/surefire-reports/TEST-org.apache.phoenix.pherf.ConfigurationParserTest.xml, phoenix-flume/target/failsafe-reports/org.apache.phoenix.flume.RegexEventSerializerIT.txt=phoenix-flume/target/failsafe-reports/org.apache.phoenix.flume.RegexEventSerializerIT.txt, phoenix-hive/target/dependency/hbase-hadoop-compat-1.2.5.jar=phoenix-hive/target/dependency/hbase-hadoop-compat-1.2.5.jar, phoenix-pherf/target/failsafe-reports/org.apache.phoenix.pherf.PherfMainIT-output.txt=phoenix-pherf/target/failsafe-reports/org.apache.phoenix.pherf.PherfMainIT-output.txt, phoenix-hive/target/dependency/twill-zookeeper-0.8.0.jar=phoenix-hive/target/dependency/twill-zookeeper-0.8.0.jar, phoenix-hive/target/dependency/commons-el-1.0.jar=phoenix-hive/target/dependency/commons-el-1.0.jar, phoenix-hive/target/dependency/eigenbase-properties-1.1.5.jar=phoenix-hive/target/dependency/eigenbase-properties-1.1.5.jar, phoenix-hive/target/dependency/jaxb-impl-2.2.3-1.jar=phoenix-hive/target/dependency/jaxb-impl-2.2.3-1.jar, phoenix-pherf/target/surefire-reports/TEST-org.apache.phoenix.pherf.ColumnTest.xml=phoenix-pherf/target/surefire-reports/TEST-org.apache.phoenix.pherf.ColumnTest.xml, bin/tephra-env.sh=bin/tephra-env.sh, phoenix-load-balancer/target/phoenix-load-balancer-4.14.0-HBase-1.2-SNAPSHOT-test-sources.jar=phoenix-load-balancer/target/phoenix-load-balancer-4.14.0-HBase-1.2-SNAPSHOT-test-sources.jar, phoenix-pig/target/surefire-reports/org.apache.phoenix.pig.util.PhoenixPigSchemaUtilTest.txt=phoenix-pig/target/surefire-reports/org.apache.phoenix.pig.util.PhoenixPigSchemaUtilTest.txt, phoenix-hive/target/dependency/mail-1.4.1.jar=phoenix-hive/target/dependency/mail-1.4.1.jar, phoenix-hive/target/dependency/metrics-core-3.1.0.jar=phoenix-hive/target/dependency/metrics-core-3.1.0.jar, phoenix-pig/target/failsafe-reports/failsafe-summary.xml=phoenix-pig/target/failsafe-reports/failsafe-summary.xml, phoenix-hive/target/dependency/xml-apis-1.3.04.jar=phoenix-hive/target/dependency/xml-apis-1.3.04.jar, phoenix-hive/target/dependency/paranamer-2.3.jar=phoenix-hive/target/dependency/paranamer-2.3.jar, phoenix-hive/target/dependency/tez-runtime-library-0.8.4.jar=phoenix-hive/target/dependency/tez-runtime-library-0.8.4.jar, phoenix-hive/target/surefire-reports/org.apache.phoenix.hive.query.PhoenixQueryBuilderTest-output.txt=phoenix-hive/target/surefire-reports/org.apache.phoenix.hive.query.PhoenixQueryBuilderTest-output.txt, phoenix-pherf/target/surefire-reports/org.apache.phoenix.pherf.util.ResourceListTest.txt=phoenix-pherf/target/surefire-reports/org.apache.phoenix.pherf.util.ResourceListTest.txt, phoenix-pherf/target/surefire-reports/TEST-org.apache.phoenix.pherf.ResourceTest.xml=phoenix-pherf/target/surefire-reports/TEST-org.apache.phoenix.pherf.ResourceTest.xml, bin/hadoop-metrics2-phoenix.properties=bin/hadoop-metrics2-phoenix.properties, phoenix-hive/target/dependency/hadoop-minicluster-2.7.1.jar=phoenix-hive/target/dependency/hadoop-minicluster-2.7.1.jar, phoenix-pig/target/phoenix-pig-4.14.0-HBase-1.2-SNAPSHOT-sources.jar=phoenix-pig/target/phoenix-pig-4.14.0-HBase-1.2-SNAPSHOT-sources.jar, phoenix-pig/target/failsafe-reports/TEST-org.apache.phoenix.pig.udf.ReserveNSequenceTestIT.xml=phoenix-pig/target/failsafe-reports/TEST-org.apache.phoenix.pig.udf.ReserveNSequenceTestIT.xml, phoenix-hive/target/surefire-reports/TEST-org.apache.phoenix.hive.PrimaryKeyDataTest.xml=phoenix-hive/target/surefire-reports/TEST-org.apache.phoenix.hive.PrimaryKeyDataTest.xml, phoenix-load-balancer/target/phoenix-load-balancer-4.14.0-HBase-1.2-SNAPSHOT.jar=phoenix-load-balancer/target/phoenix-load-balancer-4.14.0-HBase-1.2-SNAPSHOT.jar, phoenix-hive/target/dependency/hbase-it-1.2.5-tests.jar=phoenix-hive/target/dependency/hbase-it-1.2.5-tests.jar, phoenix-pherf/target/surefire-reports/org.apache.phoenix.pherf.RuleGeneratorTest.txt=phoenix-pherf/target/surefire-reports/org.apache.phoenix.pherf.RuleGeneratorTest.txt, phoenix-flume/target/phoenix-flume-4.14.0-HBase-1.2-SNAPSHOT.jar=phoenix-flume/target/phoenix-flume-4.14.0-HBase-1.2-SNAPSHOT.jar, phoenix-hive/target/test-data/97ce1fd6-967f-4352-be52-b4a035ab0b9b/metastore_dbtest/log/README_DO_NOT_TOUCH_FILES.txt=phoenix-hive/target/test-data/97ce1fd6-967f-4352-be52-b4a035ab0b9b/metastore_dbtest/log/README_DO_NOT_TOUCH_FILES.txt, phoenix-pig/target/failsafe-reports/org.apache.phoenix.pig.PhoenixHBaseStorerIT-output.txt=phoenix-pig/target/failsafe-reports/org.apache.phoenix.pig.PhoenixHBaseStorerIT-output.txt, phoenix-queryserver/target/surefire-reports/org.apache.phoenix.queryserver.server.PhoenixDoAsCallbackTest-output.txt=phoenix-queryserver/target/surefire-reports/org.apache.phoenix.queryserver.server.PhoenixDoAsCallbackTest-output.txt, phoenix-hive/target/dependency/hbase-testing-util-1.2.5.jar=phoenix-hive/target/dependency/hbase-testing-util-1.2.5.jar, phoenix-hive/target/test-data/f6bbdd3e-e550-4433-a887-cd4e83cf9480/metastore_dbtest/seg0/README_DO_NOT_TOUCH_FILES.txt=phoenix-hive/target/test-data/f6bbdd3e-e550-4433-a887-cd4e83cf9480/metastore_dbtest/seg0/README_DO_NOT_TOUCH_FILES.txt, phoenix-hive/target/dependency/hive-shims-0.20S-1.2.1.jar=phoenix-hive/target/dependency/hive-shims-0.20S-1.2.1.jar, phoenix-hive/target/dependency/commons-math-2.2.jar=phoenix-hive/target/dependency/commons-math-2.2.jar, phoenix-hive/target/dependency/commons-cli-1.2.jar=phoenix-hive/target/dependency/commons-cli-1.2.jar, phoenix-hive/target/dependency/hadoop-yarn-server-nodemanager-2.7.1.jar=phoenix-hive/target/dependency/hadoop-yarn-server-nodemanager-2.7.1.jar, phoenix-queryserver/target/failsafe-reports/org.apache.phoenix.end2end.HttpParamImpersonationQueryServerIT.txt=phoenix-queryserver/target/failsafe-reports/org.apache.phoenix.end2end.HttpParamImpersonationQueryServerIT.txt, phoenix-hive/target/dependency/commons-digester-1.8.jar=phoenix-hive/target/dependency/commons-digester-1.8.jar, phoenix-hive/target/dependency/jamon-runtime-2.4.1.jar=phoenix-hive/target/dependency/jamon-runtime-2.4.1.jar, phoenix-hive/target/dependency/datanucleus-core-3.2.10.jar=phoenix-hive/target/dependency/datanucleus-core-3.2.10.jar, phoenix-hive/target/dependency/tools.jar=phoenix-hive/target/dependency/tools.jar, phoenix-hive/target/dependency/phoenix-core-4.14.0-HBase-1.2-SNAPSHOT.jar=phoenix-hive/target/dependency/phoenix-core-4.14.0-HBase-1.2-SNAPSHOT.jar, phoenix-pherf/target/surefire-reports/org.apache.phoenix.pherf.RuleGeneratorTest-output.txt=phoenix-pherf/target/surefire-reports/org.apache.phoenix.pherf.RuleGeneratorTest-output.txt, phoenix-hive/target/dependency/asm-commons-3.1.jar=phoenix-hive/target/dependency/asm-commons-3.1.jar, phoenix-hive/target/dependency/commons-collections-3.2.2.jar=phoenix-hive/target/dependency/commons-collections-3.2.2.jar, phoenix-spark/target/surefire-reports/TEST-org.scalatest.tools.DiscoverySuite-46548bee-b0bb-4d36-a707-65790ae22c83.xml=phoenix-spark/target/surefire-reports/TEST-org.scalatest.tools.DiscoverySuite-46548bee-b0bb-4d36-a707-65790ae22c83.xml, phoenix-hive/target/dependency/tez-examples-0.8.4.jar=phoenix-hive/target/dependency/tez-examples-0.8.4.jar, phoenix-queryserver/target/failsafe-reports/TEST-org.apache.phoenix.end2end.HttpParamImpersonationQueryServerIT.xml=phoenix-queryserver/target/failsafe-reports/TEST-org.apache.phoenix.end2end.HttpParamImpersonationQueryServerIT.xml, phoenix-hive/target/dependency/curator-client-2.12.0.jar=phoenix-hive/target/dependency/curator-client-2.12.0.jar, phoenix-hive/target/dependency/snappy-0.3.jar=phoenix-hive/target/dependency/snappy-0.3.jar, phoenix-hive/target/dependency/tez-runtime-internals-0.8.4.jar=phoenix-hive/target/dependency/tez-runtime-internals-0.8.4.jar, phoenix-hive/target/dependency/libfb303-0.9.2.jar=phoenix-hive/target/dependency/libfb303-0.9.2.jar, phoenix-hive/target/dependency/datanucleus-api-jdo-3.2.6.jar=phoenix-hive/target/dependency/datanucleus-api-jdo-3.2.6.jar, phoenix-pherf/target/surefire-reports/TEST-org.apache.phoenix.pherf.XMLConfigParserTest.xml=phoenix-pherf/target/surefire-reports/TEST-org.apache.phoenix.pherf.XMLConfigParserTest.xml, phoenix-hive/target/dependency/jta-1.1.jar=phoenix-hive/target/dependency/jta-1.1.jar, phoenix-hive/target/dependency/groovy-all-2.1.6.jar=phoenix-hive/target/dependency/groovy-all-2.1.6.jar, phoenix-hive/target/dependency/mockito-all-1.8.5.jar=phoenix-hive/target/dependency/mockito-all-1.8.5.jar, phoenix-tracing-webapp/target/phoenix-tracing-webapp-4.14.0-HBase-1.2-SNAPSHOT.jar=phoenix-tracing-webapp/target/phoenix-tracing-webapp-4.14.0-HBase-1.2-SNAPSHOT.jar, phoenix-flume/target/failsafe-reports/failsafe-summary.xml=phoenix-flume/target/failsafe-reports/failsafe-summary.xml, phoenix-hive/target/dependency/xercesImpl-2.9.1.jar=phoenix-hive/target/dependency/xercesImpl-2.9.1.jar, phoenix-flume/target/failsafe-reports/org.apache.phoenix.flume.JsonEventSerializerIT-output.txt=phoenix-flume/target/failsafe-reports/org.apache.phoenix.flume.JsonEventSerializerIT-output.txt, phoenix-hive/target/dependency/RoaringBitmap-0.4.9.jar=phoenix-hive/target/dependency/RoaringBitmap-0.4.9.jar, phoenix-hive/target/dependency/tephra-hbase-compat-1.1-0.13.0-incubating.jar=phoenix-hive/target/dependency/tephra-hbase-compat-1.1-0.13.0-incubating.jar, phoenix-queryserver/target/surefire-reports/org.apache.phoenix.DriverCohabitationTest-output.txt=phoenix-queryserver/target/surefire-reports/org.apache.phoenix.DriverCohabitationTest-output.txt, phoenix-flume/target/failsafe-reports/TEST-org.apache.phoenix.flume.CsvEventSerializerIT.xml=phoenix-flume/target/failsafe-reports/TEST-org.apache.phoenix.flume.CsvEventSerializerIT.xml, phoenix-load-balancer/target/phoenix-load-balancer-4.14.0-HBase-1.2-SNAPSHOT-tests.jar=phoenix-load-balancer/target/phoenix-load-balancer-4.14.0-HBase-1.2-SNAPSHOT-tests.jar, bin/log4j.properties=bin/log4j.properties, phoenix-load-balancer/target/phoenix-load-balancer-4.14.0-HBase-1.2-SNAPSHOT-sources.jar=phoenix-load-balancer/target/phoenix-load-balancer-4.14.0-HBase-1.2-SNAPSHOT-sources.jar, phoenix-pherf/target/phoenix-pherf-4.14.0-HBase-1.2-SNAPSHOT-tests.jar=phoenix-pherf/target/phoenix-pherf-4.14.0-HBase-1.2-SNAPSHOT-tests.jar, phoenix-spark/target/phoenix-spark-4.14.0-HBase-1.2-SNAPSHOT.jar=phoenix-spark/target/phoenix-spark-4.14.0-HBase-1.2-SNAPSHOT.jar, phoenix-hive/target/dependency/jasper-compiler-5.5.23.jar=phoenix-hive/target/dependency/jasper-compiler-5.5.23.jar, phoenix-hive/target/dependency/hadoop-yarn-common-2.7.1.jar=phoenix-hive/target/dependency/hadoop-yarn-common-2.7.1.jar, phoenix-pherf/target/failsafe-reports/TEST-org.apache.phoenix.pherf.PherfMainIT.xml=phoenix-pherf/target/failsafe-reports/TEST-org.apache.phoenix.pherf.PherfMainIT.xml, python/requirements.txt=python/requirements.txt, phoenix-hive/target/dependency/hbase-hadoop2-compat-1.2.5.jar=phoenix-hive/target/dependency/hbase-hadoop2-compat-1.2.5.jar, phoenix-hive/target/dependency/hadoop-yarn-server-common-2.7.1.jar=phoenix-hive/target/dependency/hadoop-yarn-server-common-2.7.1.jar, phoenix-hive/target/dependency/commons-lang-2.6.jar=phoenix-hive/target/dependency/commons-lang-2.6.jar, phoenix-hive/target/dependency/guava-13.0.1.jar=phoenix-hive/target/dependency/guava-13.0.1.jar, phoenix-hive/target/dependency/phoenix-core-4.14.0-HBase-1.2-SNAPSHOT-tests.jar=phoenix-hive/target/dependency/phoenix-core-4.14.0-HBase-1.2-SNAPSHOT-tests.jar, phoenix-hive/target/dependency/curator-recipes-2.7.1.jar=phoenix-hive/target/dependency/curator-recipes-2.7.1.jar, phoenix-pig/target/surefire-reports/org.apache.phoenix.pig.util.SqlQueryToColumnInfoFunctionTest-output.txt=phoenix-pig/target/surefire-reports/org.apache.phoenix.pig.util.SqlQueryToColumnInfoFunctionTest-output.txt, phoenix-pherf/target/surefire-reports/org.apache.phoenix.pherf.ResultTest.txt=phoenix-pherf/target/surefire-reports/org.apache.phoenix.pherf.ResultTest.txt, phoenix-pig/target/failsafe-reports/org.apache.phoenix.pig.PhoenixHBaseLoaderIT-output.txt=phoenix-pig/target/failsafe-reports/org.apache.phoenix.pig.PhoenixHBaseLoaderIT-output.txt, phoenix-hive/target/dependency/tez-tests-0.8.4-tests.jar=phoenix-hive/target/dependency/tez-tests-0.8.4-tests.jar, phoenix-queryserver-client/target/phoenix-4.14.0-HBase-1.2-SNAPSHOT-thin-client.jar=phoenix-queryserver-client/target/phoenix-4.14.0-HBase-1.2-SNAPSHOT-thin-client.jar, phoenix-hive/target/dependency/jettison-1.3.4.jar=phoenix-hive/target/dependency/jettison-1.3.4.jar, phoenix-hive/target/dependency/stax-api-1.0.1.jar=phoenix-hive/target/dependency/stax-api-1.0.1.jar, phoenix-pherf/target/surefire-reports/TEST-org.apache.phoenix.pherf.TestHBaseProps.xml=phoenix-pherf/target/surefire-reports/TEST-org.apache.phoenix.pherf.TestHBaseProps.xml, phoenix-hive/target/dependency/async-http-client-1.8.16.jar=phoenix-hive/target/dependency/async-http-client-1.8.16.jar, phoenix-pig/target/phoenix-4.14.0-HBase-1.2-SNAPSHOT-pig.jar=phoenix-pig/target/phoenix-4.14.0-HBase-1.2-SNAPSHOT-pig.jar, phoenix-hive/target/dependency/guice-assistedinject-3.0.jar=phoenix-hive/target/dependency/guice-assistedinject-3.0.jar, phoenix-hive/target/dependency/slf4j-api-1.6.4.jar=phoenix-hive/target/dependency/slf4j-api-1.6.4.jar, phoenix-hive/target/dependency/metrics-core-2.2.0.jar=phoenix-hive/target/dependency/metrics-core-2.2.0.jar, phoenix-hive/target/surefire-reports/org.apache.phoenix.hive.PrimaryKeyDataTest.txt=phoenix-hive/target/surefire-reports/org.apache.phoenix.hive.PrimaryKeyDataTest.txt, phoenix-hive/target/dependency/jasper-runtime-5.5.23.jar=phoenix-hive/target/dependency/jasper-runtime-5.5.23.jar, phoenix-hive/target/dependency/log4j-1.2.17.jar=phoenix-hive/target/dependency/log4j-1.2.17.jar, phoenix-hive/target/phoenix-hive-4.14.0-HBase-1.2-SNAPSHOT-sources.jar=phoenix-hive/target/phoenix-hive-4.14.0-HBase-1.2-SNAPSHOT-sources.jar, phoenix-pig/target/surefire-reports/TEST-org.apache.phoenix.pig.util.QuerySchemaParserFunctionTest.xml=phoenix-pig/target/surefire-reports/TEST-org.apache.phoenix.pig.util.QuerySchemaParserFunctionTest.xml, phoenix-pig/target/surefire-reports/org.apache.phoenix.pig.util.TableSchemaParserFunctionTest.txt=phoenix-pig/target/surefire-reports/org.apache.phoenix.pig.util.TableSchemaParserFunctionTest.txt, phoenix-pherf/target/phoenix-pherf-4.14.0-HBase-1.2-SNAPSHOT.jar=phoenix-pherf/target/phoenix-pherf-4.14.0-HBase-1.2-SNAPSHOT.jar, phoenix-hive/target/dependency/hadoop-yarn-server-tests-2.7.1-tests.jar=phoenix-hive/target/dependency/hadoop-yarn-server-tests-2.7.1-tests.jar, phoenix-pherf/target/failsafe-reports/TEST-org.apache.phoenix.pherf.SchemaReaderIT.xml=phoenix-pherf/target/failsafe-reports/TEST-org.apache.phoenix.pherf.SchemaReaderIT.xml, phoenix-hive/target/dependency/commons-pool-1.5.4.jar=phoenix-hive/target/dependency/commons-pool-1.5.4.jar, phoenix-pherf/target/surefire-reports/org.apache.phoenix.pherf.XMLConfigParserTest.txt=phoenix-pherf/target/surefire-reports/org.apache.phoenix.pherf.XMLConfigParserTest.txt, phoenix-hive/target/dependency/pentaho-aggdesigner-algorithm-5.1.5-jhyde.jar=phoenix-hive/target/dependency/pentaho-aggdesigner-algorithm-5.1.5-jhyde.jar, phoenix-hive/target/dependency/hbase-annotations-1.2.5.jar=phoenix-hive/target/dependency/hbase-annotations-1.2.5.jar, phoenix-spark/target/surefire-reports/TEST-org.apache.phoenix.spark.PhoenixSparkIT.xml=phoenix-spark/target/surefire-reports/TEST-org.apache.phoenix.spark.PhoenixSparkIT.xml, phoenix-pherf/target/surefire-reports/org.apache.phoenix.pherf.ColumnTest.txt=phoenix-pherf/target/surefire-reports/org.apache.phoenix.pherf.ColumnTest.txt, phoenix-queryserver/target/failsafe-reports/org.apache.phoenix.end2end.SecureQueryServerIT-output.txt=phoenix-queryserver/target/failsafe-reports/org.apache.phoenix.end2end.SecureQueryServerIT-output.txt, phoenix-hive/target/dependency/geronimo-jaspic_1.0_spec-1.0.jar=phoenix-hive/target/dependency/geronimo-jaspic_1.0_spec-1.0.jar, phoenix-flume/target/failsafe-reports/TEST-org.apache.phoenix.flume.JsonEventSerializerIT.xml=phoenix-flume/target/failsafe-reports/TEST-org.apache.phoenix.flume.JsonEventSerializerIT.xml, phoenix-hive/target/dependency/javax.inject-1.jar=phoenix-hive/target/dependency/javax.inject-1.jar, phoenix-hive/target/dependency/calcite-linq4j-1.2.0-incubating.jar=phoenix-hive/target/dependency/calcite-linq4j-1.2.0-incubating.jar, phoenix-hive/target/dependency/jersey-server-1.9.jar=phoenix-hive/target/dependency/jersey-server-1.9.jar, phoenix-hive/target/dependency/stax-api-1.0-2.jar=phoenix-hive/target/dependency/stax-api-1.0-2.jar, phoenix-hive/target/dependency/hive-metastore-1.2.1.jar=phoenix-hive/target/dependency/hive-metastore-1.2.1.jar, phoenix-queryserver/target/phoenix-queryserver-4.14.0-HBase-1.2-SNAPSHOT-sources.jar=phoenix-queryserver/target/phoenix-queryserver-4.14.0-HBase-1.2-SNAPSHOT-sources.jar, phoenix-hive/target/dependency/hbase-shell-1.2.5.jar=phoenix-hive/target/dependency/hbase-shell-1.2.5.jar, phoenix-hive/target/dependency/oro-2.0.8.jar=phoenix-hive/target/dependency/oro-2.0.8.jar, phoenix-queryserver/target/surefire-reports/TEST-org.apache.phoenix.queryserver.server.PhoenixRemoteUserExtractorTest.xml=phoenix-queryserver/target/surefire-reports/TEST-org.apache.phoenix.queryserver.server.PhoenixRemoteUserExtractorTest.xml, phoenix-client/target/phoenix-4.14.0-HBase-1.2-SNAPSHOT-client.jar=phoenix-client/target/phoenix-4.14.0-HBase-1.2-SNAPSHOT-client.jar, phoenix-hive/target/dependency/jersey-guice-1.9.jar=phoenix-hive/target/dependency/jersey-guice-1.9.jar, phoenix-hive/target/dependency/api-asn1-api-1.0.0-M20.jar=phoenix-hive/target/dependency/api-asn1-api-1.0.0-M20.jar, phoenix-hive/target/dependency/jpam-1.1.jar=phoenix-hive/target/dependency/jpam-1.1.jar, phoenix-hive/target/dependency/aopalliance-1.0.jar=phoenix-hive/target/dependency/aopalliance-1.0.jar, phoenix-hive/target/dependency/jline-2.11.jar=phoenix-hive/target/dependency/jline-2.11.jar, phoenix-pherf/target/surefire-reports/TEST-org.apache.phoenix.pherf.RuleGeneratorTest.xml=phoenix-pherf/target/surefire-reports/TEST-org.apache.phoenix.pherf.RuleGeneratorTest.xml, phoenix-hive/target/dependency/hbase-protocol-1.2.5.jar=phoenix-hive/target/dependency/hbase-protocol-1.2.5.jar, phoenix-queryserver/target/phoenix-queryserver-4.14.0-HBase-1.2-SNAPSHOT-tests.jar=phoenix-queryserver/target/phoenix-queryserver-4.14.0-HBase-1.2-SNAPSHOT-tests.jar, phoenix-pherf/target/surefire-reports/org.apache.phoenix.pherf.result.impl.XMLResultHandlerTest.txt=phoenix-pherf/target/surefire-reports/org.apache.phoenix.pherf.result.impl.XMLResultHandlerTest.txt, build.txt=build.txt, phoenix-hive/target/dependency/joni-2.1.2.jar=phoenix-hive/target/dependency/joni-2.1.2.jar, phoenix-flume/target/failsafe-reports/org.apache.phoenix.flume.CsvEventSerializerIT.txt=phoenix-flume/target/failsafe-reports/org.apache.phoenix.flume.CsvEventSerializerIT.txt, phoenix-hive/target/dependency/zookeeper-3.4.6-tests.jar=phoenix-hive/target/dependency/zookeeper-3.4.6-tests.jar, phoenix-hive/target/dependency/icu4j-60.2.jar=phoenix-hive/target/dependency/icu4j-60.2.jar, phoenix-hive/target/dependency/hadoop-shim-0.8.4.jar=phoenix-hive/target/dependency/hadoop-shim-0.8.4.jar, phoenix-hive/target/dependency/twill-core-0.8.0.jar=phoenix-hive/target/dependency/twill-core-0.8.0.jar, phoenix-hive/target/dependency/hbase-server-1.2.5-tests.jar=phoenix-hive/target/dependency/hbase-server-1.2.5-tests.jar, phoenix-hive/target/dependency/commons-net-3.1.jar=phoenix-hive/target/dependency/commons-net-3.1.jar, phoenix-pherf/target/surefire-reports/org.apache.phoenix.pherf.ResultTest-output.txt=phoenix-pherf/target/surefire-reports/org.apache.phoenix.pherf.ResultTest-output.txt, phoenix-hive/target/dependency/jetty-sslengine-6.1.26.jar=phoenix-hive/target/dependency/jetty-sslengine-6.1.26.jar, phoenix-hive/target/dependency/apacheds-i18n-2.0.0-M15.jar=phoenix-hive/target/dependency/apacheds-i18n-2.0.0-M15.jar, phoenix-hive/target/dependency/fastutil-6.5.6.jar=phoenix-hive/target/dependency/fastutil-6.5.6.jar, phoenix-hive/target/dependency/commons-logging-1.2.jar=phoenix-hive/target/dependency/commons-logging-1.2.jar, phoenix-pherf/target/failsafe-reports/org.apache.phoenix.pherf.SchemaReaderIT-output.txt=phoenix-pherf/target/failsafe-reports/org.apache.phoenix.pherf.SchemaReaderIT-output.txt, phoenix-hive/target/dependency/hbase-procedure-1.2.5.jar=phoenix-hive/target/dependency/hbase-procedure-1.2.5.jar, phoenix-hive/target/dependency/jetty-6.1.26.jar=phoenix-hive/target/dependency/jetty-6.1.26.jar, phoenix-flume/target/failsafe-reports/TEST-org.apache.phoenix.flume.PhoenixSinkIT.xml=phoenix-flume/target/failsafe-reports/TEST-org.apache.phoenix.flume.PhoenixSinkIT.xml, phoenix-hive/target/dependency/leveldbjni-all-1.8.jar=phoenix-hive/target/dependency/leveldbjni-all-1.8.jar, phoenix-hive/target/dependency/jcodings-1.0.8.jar=phoenix-hive/target/dependency/jcodings-1.0.8.jar, phoenix-pig/target/surefire-reports/org.apache.phoenix.pig.util.QuerySchemaParserFunctionTest-output.txt=phoenix-pig/target/surefire-reports/org.apache.phoenix.pig.util.QuerySchemaParserFunctionTest-output.txt, phoenix-hive/target/dependency/hive-exec-1.2.1.jar=phoenix-hive/target/dependency/hive-exec-1.2.1.jar, phoenix-hive/target/dependency/servlet-api-2.5.jar=phoenix-hive/target/dependency/servlet-api-2.5.jar, phoenix-hive/target/dependency/asm-all-5.0.2.jar=phoenix-hive/target/dependency/asm-all-5.0.2.jar, phoenix-hive/target/dependency/jackson-mapper-asl-1.9.2.jar=phoenix-hive/target/dependency/jackson-mapper-asl-1.9.2.jar, phoenix-queryserver-client/target/phoenix-queryserver-client-4.14.0-HBase-1.2-SNAPSHOT-tests.jar=phoenix-queryserver-client/target/phoenix-queryserver-client-4.14.0-HBase-1.2-SNAPSHOT-tests.jar, phoenix-hive/target/dependency/hadoop-annotations-2.7.1.jar=phoenix-hive/target/dependency/hadoop-annotations-2.7.1.jar, phoenix-hive/target/dependency/hbase-common-1.2.5.jar=phoenix-hive/target/dependency/hbase-common-1.2.5.jar, phoenix-hive/target/dependency/hadoop-mapreduce-client-common-2.7.1.jar=phoenix-hive/target/dependency/hadoop-mapreduce-client-common-2.7.1.jar, phoenix-hive/target/dependency/jackson-xc-1.9.2.jar=phoenix-hive/target/dependency/jackson-xc-1.9.2.jar, phoenix-hive/target/dependency/hadoop-mapreduce-client-shuffle-2.7.1.jar=phoenix-hive/target/dependency/hadoop-mapreduce-client-shuffle-2.7.1.jar, phoenix-tracing-webapp/target/phoenix-tracing-webapp-4.14.0-HBase-1.2-SNAPSHOT-tests.jar=phoenix-tracing-webapp/target/phoenix-tracing-webapp-4.14.0-HBase-1.2-SNAPSHOT-tests.jar, phoenix-hive/target/dependency/opencsv-2.3.jar=phoenix-hive/target/dependency/opencsv-2.3.jar, phoenix-pig/target/failsafe-reports/org.apache.phoenix.pig.PhoenixHBaseStorerIT.txt=phoenix-pig/target/failsafe-reports/org.apache.phoenix.pig.PhoenixHBaseStorerIT.txt, phoenix-core/target/cached_classpath.txt=phoenix-core/target/cached_classpath.txt, phoenix-hive/target/phoenix-hive-4.14.0-HBase-1.2-SNAPSHOT-tests.jar=phoenix-hive/target/phoenix-hive-4.14.0-HBase-1.2-SNAPSHOT-tests.jar, phoenix-hive/target/dependency/gson-2.2.4.jar=phoenix-hive/target/dependency/gson-2.2.4.jar, phoenix-hive/target/dependency/httpcore-4.0.1.jar=phoenix-hive/target/dependency/httpcore-4.0.1.jar, phoenix-pherf/target/failsafe-reports/org.apache.phoenix.pherf.DataIngestIT.txt=phoenix-pherf/target/failsafe-reports/org.apache.phoenix.pherf.DataIngestIT.txt, phoenix-hive/target/dependency/joda-time-1.6.jar=phoenix-hive/target/dependency/joda-time-1.6.jar, phoenix-hive/target/dependency/calcite-avatica-1.2.0-incubating.jar=phoenix-hive/target/dependency/calcite-avatica-1.2.0-incubating.jar, phoenix-hive/target/dependency/hadoop-mapreduce-client-app-2.7.1.jar=phoenix-hive/target/dependency/hadoop-mapreduce-client-app-2.7.1.jar, phoenix-hive/target/dependency/geronimo-annotation_1.0_spec-1.1.1.jar=phoenix-hive/target/dependency/geronimo-annotation_1.0_spec-1.1.1.jar, phoenix-spark/target/surefire-reports/TestSuite.txt=phoenix-spark/target/surefire-reports/TestSuite.txt, phoenix-hive/target/dependency/commons-compress-1.4.1.jar=phoenix-hive/target/dependency/commons-compress-1.4.1.jar, phoenix-hive/target/dependency/jets3t-0.9.0.jar=phoenix-hive/target/dependency/jets3t-0.9.0.jar, phoenix-hive/target/dependency/hadoop-mapreduce-client-jobclient-2.7.1.jar=phoenix-hive/target/dependency/hadoop-mapreduce-client-jobclient-2.7.1.jar, phoenix-pherf/target/surefire-reports/TEST-org.apache.phoenix.pherf.RowCalculatorTest.xml=phoenix-pherf/target/surefire-reports/TEST-org.apache.phoenix.pherf.RowCalculatorTest.xml, phoenix-hive/target/dependency/hadoop-yarn-server-resourcemanager-2.7.1.jar=phoenix-hive/target/dependency/hadoop-yarn-server-resourcemanager-2.7.1.jar, phoenix-hive/target/dependency/hive-shims-common-1.2.1.jar=phoenix-hive/target/dependency/hive-shims-common-1.2.1.jar, phoenix-pherf/target/surefire-reports/TEST-org.apache.phoenix.pherf.result.impl.XMLResultHandlerTest.xml=phoenix-pherf/target/surefire-reports/TEST-org.apache.phoenix.pherf.result.impl.XMLResultHandlerTest.xml, phoenix-hive/target/dependency/velocity-1.5.jar=phoenix-hive/target/dependency/velocity-1.5.jar, phoenix-queryserver/target/phoenix-queryserver-4.14.0-HBase-1.2-SNAPSHOT.jar=phoenix-queryserver/target/phoenix-queryserver-4.14.0-HBase-1.2-SNAPSHOT.jar, phoenix-hive/target/dependency/commons-configuration-1.6.jar=phoenix-hive/target/dependency/commons-configuration-1.6.jar, phoenix-hive/target/dependency/hadoop-client-2.7.1.jar=phoenix-hive/target/dependency/hadoop-client-2.7.1.jar, phoenix-hive/target/surefire-reports/TEST-org.apache.phoenix.hive.query.PhoenixQueryBuilderTest.xml=phoenix-hive/target/surefire-reports/TEST-org.apache.phoenix.hive.query.PhoenixQueryBuilderTest.xml, phoenix-pherf/target/surefire-reports/org.apache.phoenix.pherf.XMLConfigParserTest-output.txt=phoenix-pherf/target/surefire-reports/org.apache.phoenix.pherf.XMLConfigParserTest-output.txt, phoenix-queryserver/target/surefire-reports/org.apache.phoenix.DriverCohabitationTest.txt=phoenix-queryserver/target/surefire-reports/org.apache.phoenix.DriverCohabitationTest.txt, phoenix-hive/target/dependency/stream-2.9.5.jar=phoenix-hive/target/dependency/stream-2.9.5.jar, phoenix-spark/target/phoenix-spark-4.14.0-HBase-1.2-SNAPSHOT-sources.jar=phoenix-spark/target/phoenix-spark-4.14.0-HBase-1.2-SNAPSHOT-sources.jar, phoenix-pherf/target/failsafe-reports/failsafe-summary.xml=phoenix-pherf/target/failsafe-reports/failsafe-summary.xml, phoenix-pherf/target/surefire-reports/org.apache.phoenix.pherf.ConfigurationParserTest.txt=phoenix-pherf/target/surefire-reports/org.apache.phoenix.pherf.ConfigurationParserTest.txt, phoenix-spark/target/phoenix-spark-4.14.0-HBase-1.2-SNAPSHOT-javadoc.jar=phoenix-spark/target/phoenix-spark-4.14.0-HBase-1.2-SNAPSHOT-javadoc.jar, phoenix-hive/target/dependency/java-xmlbuilder-0.4.jar=phoenix-hive/target/dependency/java-xmlbuilder-0.4.jar, phoenix-hive/target/dependency/asm-3.1.jar=phoenix-hive/target/dependency/asm-3.1.jar, phoenix-hive/target/dependency/netty-all-4.0.23.Final.jar=phoenix-hive/target/dependency/netty-all-4.0.23.Final.jar, phoenix-hive/target/dependency/guice-servlet-3.0.jar=phoenix-hive/target/dependency/guice-servlet-3.0.jar, phoenix-hive/target/dependency/hive-shims-scheduler-1.2.1.jar=phoenix-hive/target/dependency/hive-shims-scheduler-1.2.1.jar, phoenix-hive/target/dependency/icu4j-charset-60.2.jar=phoenix-hive/target/dependency/icu4j-charset-60.2.jar, phoenix-flume/target/failsafe-reports/org.apache.phoenix.flume.RegexEventSerializerIT-output.txt=phoenix-flume/target/failsafe-reports/org.apache.phoenix.flume.RegexEventSerializerIT-output.txt, phoenix-hive/target/dependency/tephra-api-0.13.0-incubating.jar=phoenix-hive/target/dependency/tephra-api-0.13.0-incubating.jar, phoenix-hive/target/dependency/parquet-hadoop-bundle-1.6.0.jar=phoenix-hive/target/dependency/parquet-hadoop-bundle-1.6.0.jar, phoenix-hive/target/failsafe-reports/failsafe-summary.xml=phoenix-hive/target/failsafe-reports/failsafe-summary.xml, phoenix-hive/target/dependency/hive-common-1.2.1.jar=phoenix-hive/target/dependency/hive-common-1.2.1.jar, phoenix-hive/target/dependency/twill-api-0.8.0.jar=phoenix-hive/target/dependency/twill-api-0.8.0.jar, phoenix-queryserver/target/failsafe-reports/org.apache.phoenix.end2end.QueryServerBasicsIT.txt=phoenix-queryserver/target/failsafe-reports/org.apache.phoenix.end2end.QueryServerBasicsIT.txt, phoenix-hive/target/dependency/ant-1.9.1.jar=phoenix-hive/target/dependency/ant-1.9.1.jar, phoenix-hive/target/dependency/jetty-util-6.1.26.jar=phoenix-hive/target/dependency/jetty-util-6.1.26.jar, phoenix-queryserver/target/surefire-reports/org.apache.phoenix.queryserver.server.PhoenixDoAsCallbackTest.txt=phoenix-queryserver/target/surefire-reports/org.apache.phoenix.queryserver.server.PhoenixDoAsCallbackTest.txt, phoenix-kafka/target/failsafe-reports/org.apache.phoenix.kafka.PhoenixConsumerIT-output.txt=phoenix-kafka/target/failsafe-reports/org.apache.phoenix.kafka.PhoenixConsumerIT-output.txt, phoenix-queryserver/target/phoenix-4.14.0-HBase-1.2-SNAPSHOT-queryserver.jar=phoenix-queryserver/target/phoenix-4.14.0-HBase-1.2-SNAPSHOT-queryserver.jar, phoenix-hive/target/dependency/hadoop-yarn-client-2.7.1.jar=phoenix-hive/target/dependency/hadoop-yarn-client-2.7.1.jar, phoenix-queryserver-client/target/phoenix-queryserver-client-4.14.0-HBase-1.2-SNAPSHOT-sources.jar=phoenix-queryserver-client/target/phoenix-queryserver-client-4.14.0-HBase-1.2-SNAPSHOT-sources.jar, phoenix-hive/target/dependency/protobuf-java-2.5.0.jar=phoenix-hive/target/dependency/protobuf-java-2.5.0.jar, phoenix-hive/target/dependency/api-util-1.0.0-M20.jar=phoenix-hive/target/dependency/api-util-1.0.0-M20.jar, phoenix-hive/target/test-data/97ce1fd6-967f-4352-be52-b4a035ab0b9b/metastore_dbtest/README_DO_NOT_TOUCH_FILES.txt=phoenix-hive/target/test-data/97ce1fd6-967f-4352-be52-b4a035ab0b9b/metastore_dbtest/README_DO_NOT_TOUCH_FILES.txt, phoenix-pherf/target/surefire-reports/org.apache.phoenix.pherf.PherfTest-output.txt=phoenix-pherf/target/surefire-reports/org.apache.phoenix.pherf.PherfTest-output.txt, phoenix-hive/target/test-data/f6bbdd3e-e550-4433-a887-cd4e83cf9480/metastore_dbtest/log/README_DO_NOT_TOUCH_FILES.txt=phoenix-hive/target/test-data/f6bbdd3e-e550-4433-a887-cd4e83cf9480/metastore_dbtest/log/README_DO_NOT_TOUCH_FILES.txt, phoenix-kafka/target/phoenix-kafka-4.14.0-HBase-1.2-SNAPSHOT-tests.jar=phoenix-kafka/target/phoenix-kafka-4.14.0-HBase-1.2-SNAPSHOT-tests.jar, phoenix-pig/target/failsafe-reports/org.apache.phoenix.pig.udf.ReserveNSequenceTestIT.txt=phoenix-pig/target/failsafe-reports/org.apache.phoenix.pig.udf.ReserveNSequenceTestIT.txt, phoenix-pig/target/surefire-reports/TEST-org.apache.phoenix.pig.util.PhoenixPigSchemaUtilTest.xml=phoenix-pig/target/surefire-reports/TEST-org.apache.phoenix.pig.util.PhoenixPigSchemaUtilTest.xml, phoenix-pig/target/surefire-reports/TEST-org.apache.phoenix.pig.util.TableSchemaParserFunctionTest.xml=phoenix-pig/target/surefire-reports/TEST-org.apache.phoenix.pig.util.TableSchemaParserFunctionTest.xml, phoenix-kafka/target/failsafe-reports/null-output.txt=phoenix-kafka/target/failsafe-reports/null-output.txt, phoenix-hive/target/dependency/hadoop-yarn-api-2.7.1.jar=phoenix-hive/target/dependency/hadoop-yarn-api-2.7.1.jar, phoenix-hive/target/dependency/commons-csv-1.0.jar=phoenix-hive/target/dependency/commons-csv-1.0.jar, phoenix-hive/target/dependency/hive-cli-1.2.1.jar=phoenix-hive/target/dependency/hive-cli-1.2.1.jar, phoenix-hive/target/failsafe-reports/org.apache.phoenix.hive.HivePhoenixStoreIT.txt=phoenix-hive/target/failsafe-reports/org.apache.phoenix.hive.HivePhoenixStoreIT.txt, phoenix-hive/target/dependency/junit-4.12.jar=phoenix-hive/target/dependency/junit-4.12.jar, phoenix-hive/target/dependency/asm-tree-3.1.jar=phoenix-hive/target/dependency/asm-tree-3.1.jar, phoenix-hive/target/dependency/sqlline-1.2.0.jar=phoenix-hive/target/dependency/sqlline-1.2.0.jar, phoenix-hive/target/dependency/hadoop-common-2.7.1-tests.jar=phoenix-hive/target/dependency/hadoop-common-2.7.1-tests.jar, phoenix-hive/target/dependency/icu4j-localespi-60.2.jar=phoenix-hive/target/dependency/icu4j-localespi-60.2.jar, phoenix-hive/target/dependency/jsp-api-2.1-6.1.14.jar=phoenix-hive/target/dependency/jsp-api-2.1-6.1.14.jar, phoenix-flume/target/failsafe-reports/org.apache.phoenix.flume.JsonEventSerializerIT.txt=phoenix-flume/target/failsafe-reports/org.apache.phoenix.flume.JsonEventSerializerIT.txt, phoenix-spark/target/phoenix-spark-4.14.0-HBase-1.2-SNAPSHOT-tests.jar=phoenix-spark/target/phoenix-spark-4.14.0-HBase-1.2-SNAPSHOT-tests.jar, phoenix-hive/target/dependency/tez-common-0.8.4.jar=phoenix-hive/target/dependency/tez-common-0.8.4.jar, phoenix-hive/target/dependency/hbase-hadoop-compat-1.2.5-tests.jar=phoenix-hive/target/dependency/hbase-hadoop-compat-1.2.5-tests.jar, target/phoenix-4.14.0-HBase-1.2-SNAPSHOT-tests.jar=target/phoenix-4.14.0-HBase-1.2-SNAPSHOT-tests.jar, phoenix-hive/target/test-data/97ce1fd6-967f-4352-be52-b4a035ab0b9b/metastore_dbtest/seg0/README_DO_NOT_TOUCH_FILES.txt=phoenix-hive/target/test-data/97ce1fd6-967f-4352-be52-b4a035ab0b9b/metastore_dbtest/seg0/README_DO_NOT_TOUCH_FILES.txt, phoenix-queryserver/target/surefire-reports/TEST-org.apache.phoenix.queryserver.server.RemoteUserExtractorFactoryTest.xml=phoenix-queryserver/target/surefire-reports/TEST-org.apache.phoenix.queryserver.server.RemoteUserExtractorFactoryTest.xml, phoenix-hive/target/dependency/derby-10.10.2.0.jar=phoenix-hive/target/dependency/derby-10.10.2.0.jar, phoenix-hive/target/dependency/hive-ant-1.2.1.jar=phoenix-hive/target/dependency/hive-ant-1.2.1.jar, phoenix-hive/target/dependency/ST4-4.0.4.jar=phoenix-hive/target/dependency/ST4-4.0.4.jar, phoenix-hive/target/dependency/jackson-core-asl-1.9.2.jar=phoenix-hive/target/dependency/jackson-core-asl-1.9.2.jar, phoenix-pherf/target/surefire-reports/TEST-org.apache.phoenix.pherf.PherfTest.xml=phoenix-pherf/target/surefire-reports/TEST-org.apache.phoenix.pherf.PherfTest.xml, phoenix-tracing-webapp/target/phoenix-tracing-webapp-4.14.0-HBase-1.2-SNAPSHOT-runnable.jar=phoenix-tracing-webapp/target/phoenix-tracing-webapp-4.14.0-HBase-1.2-SNAPSHOT-runnable.jar, phoenix-hive/target/dependency/jsp-api-2.1.jar=phoenix-hive/target/dependency/jsp-api-2.1.jar, phoenix-hive/target/dependency/jetty-all-7.6.0.v20120127.jar=phoenix-hive/target/dependency/jetty-all-7.6.0.v20120127.jar, phoenix-queryserver/target/failsafe-reports/TEST-org.apache.phoenix.end2end.QueryServerBasicsIT.xml=phoenix-queryserver/target/failsafe-reports/TEST-org.apache.phoenix.end2end.QueryServerBasicsIT.xml, phoenix-flume/target/phoenix-flume-4.14.0-HBase-1.2-SNAPSHOT-tests.jar=phoenix-flume/target/phoenix-flume-4.14.0-HBase-1.2-SNAPSHOT-tests.jar, phoenix-hive/target/dependency/htrace-core-3.1.0-incubating.jar=phoenix-hive/target/dependency/htrace-core-3.1.0-incubating.jar, phoenix-hive/target/dependency/bonecp-0.8.0.RELEASE.jar=phoenix-hive/target/dependency/bonecp-0.8.0.RELEASE.jar, phoenix-hive/target/dependency/zookeeper-3.4.6.jar=phoenix-hive/target/dependency/zookeeper-3.4.6.jar, phoenix-hive/target/dependency/commons-collections4-4.1.jar=phoenix-hive/target/dependency/commons-collections4-4.1.jar, phoenix-hive/target/dependency/hadoop-mapreduce-client-jobclient-2.7.1-tests.jar=phoenix-hive/target/dependency/hadoop-mapreduce-client-jobclient-2.7.1-tests.jar, phoenix-hive/target/dependency/jersey-json-1.9.jar=phoenix-hive/target/dependency/jersey-json-1.9.jar, phoenix-pherf/target/failsafe-reports/org.apache.phoenix.pherf.SchemaReaderIT.txt=phoenix-pherf/target/failsafe-reports/org.apache.phoenix.pherf.SchemaReaderIT.txt, phoenix-hive/target/dependency/commons-codec-1.7.jar=phoenix-hive/target/dependency/commons-codec-1.7.jar, phoenix-hive/target/dependency/libthrift-0.9.2.jar=phoenix-hive/target/dependency/libthrift-0.9.2.jar, phoenix-protocol/README.txt=phoenix-protocol/README.txt, phoenix-hive/target/dependency/tez-dag-0.8.4.jar=phoenix-hive/target/dependency/tez-dag-0.8.4.jar, phoenix-hive/target/dependency/tez-api-0.8.4.jar=phoenix-hive/target/dependency/tez-api-0.8.4.jar, phoenix-pherf/target/failsafe-reports/org.apache.phoenix.pherf.PherfMainIT.txt=phoenix-pherf/target/failsafe-reports/org.apache.phoenix.pherf.PherfMainIT.txt, phoenix-hive/target/dependency/commons-beanutils-core-1.8.0.jar=phoenix-hive/target/dependency/commons-beanutils-core-1.8.0.jar, phoenix-pherf/target/surefire-reports/org.apache.phoenix.pherf.ConfigurationParserTest-output.txt=phoenix-pherf/target/surefire-reports/org.apache.phoenix.pherf.ConfigurationParserTest-output.txt, phoenix-hive/target/dependency/calcite-core-1.2.0-incubating.jar=phoenix-hive/target/dependency/calcite-core-1.2.0-incubating.jar, phoenix-hive/target/dependency/hbase-annotations-1.2.5-tests.jar=phoenix-hive/target/dependency/hbase-annotations-1.2.5-tests.jar, phoenix-hive/target/dependency/hadoop-yarn-server-applicationhistoryservice-2.7.1.jar=phoenix-hive/target/dependency/hadoop-yarn-server-applicationhistoryservice-2.7.1.jar, phoenix-pherf/target/phoenix-pherf-4.14.0-HBase-1.2-SNAPSHOT-minimal.jar=phoenix-pherf/target/phoenix-pherf-4.14.0-HBase-1.2-SNAPSHOT-minimal.jar, phoenix-hive/target/dependency/hive-shims-0.23-1.2.1.jar=phoenix-hive/target/dependency/hive-shims-0.23-1.2.1.jar, phoenix-hive/target/failsafe-reports/TEST-org.apache.phoenix.hive.HivePhoenixStoreIT.xml=phoenix-hive/target/failsafe-reports/TEST-org.apache.phoenix.hive.HivePhoenixStoreIT.xml, phoenix-spark/target/surefire-reports/TEST-org.apache.phoenix.spark.PhoenixSparkITTenantSpecific.xml=phoenix-spark/target/surefire-reports/TEST-org.apache.phoenix.spark.PhoenixSparkITTenantSpecific.xml} due to internal error; falling back to full archiving
java.lang.IllegalStateException: checksum mismatch after transfer (937717255 vs. 1428319751); /x1/jenkins/jenkins-home/jobs/Phoenix-4.x-HBase-1.2/builds/308/archive/phoenix-pig/target/phoenix-4.14.0-HBase-1.2-SNAPSHOT-pig.jar may be corrupted
	at jsync.protocol.FileSequenceReader.read(FileSequenceReader.java:45)
	at com.cloudbees.jenkins.plugins.jsync.archiver.JSyncArtifactManager.remoteSync(JSyncArtifactManager.java:158)
	at com.cloudbees.jenkins.plugins.jsync.archiver.JSyncArtifactManager.archive(JSyncArtifactManager.java:76)
	at hudson.tasks.ArtifactArchiver.perform(ArtifactArchiver.java:245)
	at hudson.tasks.BuildStepCompatibilityLayer.perform(BuildStepCompatibilityLayer.java:81)
	at hudson.tasks.BuildStepMonitor$1.perform(BuildStepMonitor.java:20)
	at hudson.model.AbstractBuild$AbstractBuildExecution.perform(AbstractBuild.java:744)
	at hudson.model.AbstractBuild$AbstractBuildExecution.performAllBuildSteps(AbstractBuild.java:690)
	at hudson.model.Build$BuildExecution.post2(Build.java:186)
	at hudson.model.AbstractBuild$AbstractBuildExecution.post(AbstractBuild.java:635)
	at hudson.model.Run.execute(Run.java:1749)
	at hudson.model.FreeStyleBuild.run(FreeStyleBuild.java:43)
	at hudson.model.ResourceController.execute(ResourceController.java:97)
	at hudson.model.Executor.run(Executor.java:429)
Recording test results
ERROR: Step ?Publish JUnit test result report? failed: Test reports were found but none of them are new. Did leafNodes run? 
For example, <https://builds.apache.org/job/Phoenix-4.x-HBase-1.2/308/artifact/phoenix-flume/target/failsafe-reports/TEST-org.apache.phoenix.flume.CsvEventSerializerIT.xml> is 20 days old



Mime
View raw message