phoenix-commits mailing list archives

Site index · List index
Message view « Date » · « Thread »
Top « Date » · « Thread »
From Apache Jenkins Server <jenk...@builds.apache.org>
Subject Build failed in Jenkins: Phoenix Compile Compatibility with HBase #617
Date Wed, 25 Apr 2018 09:26:51 GMT
See <https://builds.apache.org/job/Phoenix_Compile_Compat_wHBase/617/display/redirect>

------------------------------------------
[...truncated 37.15 KB...]
  symbol:   class HBaseRpcController
  location: class org.apache.hadoop.hbase.ipc.controller.ClientRpcControllerFactory
[ERROR] <https://builds.apache.org/job/Phoenix_Compile_Compat_wHBase/ws/phoenix/phoenix/phoenix-core/src/main/java/org/apache/hadoop/hbase/ipc/controller/ClientRpcControllerFactory.java>:[52,9]
cannot find symbol
  symbol:   class HBaseRpcController
  location: class org.apache.hadoop.hbase.ipc.controller.ClientRpcControllerFactory
[ERROR] <https://builds.apache.org/job/Phoenix_Compile_Compat_wHBase/ws/phoenix/phoenix/phoenix-core/src/main/java/org/apache/phoenix/iterate/SnapshotScanner.java>:[180,14]
cannot find symbol
  symbol: class MetricRegistry
[ERROR] <https://builds.apache.org/job/Phoenix_Compile_Compat_wHBase/ws/phoenix/phoenix/phoenix-core/src/main/java/org/apache/phoenix/iterate/SnapshotScanner.java>:[179,7]
method does not override or implement a method from a supertype
[ERROR] <https://builds.apache.org/job/Phoenix_Compile_Compat_wHBase/ws/phoenix/phoenix/phoenix-core/src/main/java/org/apache/phoenix/coprocessor/PhoenixAccessController.java>:[454,78]
cannot find symbol
  symbol: class HBaseRpcController
[ERROR] <https://builds.apache.org/job/Phoenix_Compile_Compat_wHBase/ws/phoenix/phoenix/phoenix-core/src/main/java/org/apache/phoenix/coprocessor/PhoenixAccessController.java>:[432,17]
cannot find symbol
  symbol: class HBaseRpcController
[ERROR] Failed to execute goal org.apache.maven.plugins:maven-compiler-plugin:3.0:compile
(default-compile) on project phoenix-core: Compilation failure: Compilation failure: 
[ERROR] <https://builds.apache.org/job/Phoenix_Compile_Compat_wHBase/ws/phoenix/phoenix/phoenix-core/src/main/java/org/apache/phoenix/coprocessor/PhoenixMetaDataCoprocessorHost.java>:[34,39]
cannot find symbol
[ERROR]   symbol:   class MetricRegistry
[ERROR]   location: package org.apache.hadoop.hbase.metrics
[ERROR] <https://builds.apache.org/job/Phoenix_Compile_Compat_wHBase/ws/phoenix/phoenix/phoenix-core/src/main/java/org/apache/phoenix/coprocessor/PhoenixMetaDataCoprocessorHost.java>:[144,16]
cannot find symbol
[ERROR]   symbol:   class MetricRegistry
[ERROR]   location: class org.apache.phoenix.coprocessor.PhoenixMetaDataCoprocessorHost.PhoenixMetaDataControllerEnvironment
[ERROR] <https://builds.apache.org/job/Phoenix_Compile_Compat_wHBase/ws/phoenix/phoenix/phoenix-core/src/main/java/org/apache/hadoop/hbase/ipc/controller/MetadataRpcController.java>:[24,35]
cannot find symbol
[ERROR]   symbol:   class DelegatingHBaseRpcController
[ERROR]   location: package org.apache.hadoop.hbase.ipc
[ERROR] <https://builds.apache.org/job/Phoenix_Compile_Compat_wHBase/ws/phoenix/phoenix/phoenix-core/src/main/java/org/apache/hadoop/hbase/ipc/controller/MetadataRpcController.java>:[25,35]
cannot find symbol
[ERROR]   symbol:   class HBaseRpcController
[ERROR]   location: package org.apache.hadoop.hbase.ipc
[ERROR] <https://builds.apache.org/job/Phoenix_Compile_Compat_wHBase/ws/phoenix/phoenix/phoenix-core/src/main/java/org/apache/hadoop/hbase/ipc/controller/MetadataRpcController.java>:[37,37]
cannot find symbol
[ERROR]   symbol: class DelegatingHBaseRpcController
[ERROR] <https://builds.apache.org/job/Phoenix_Compile_Compat_wHBase/ws/phoenix/phoenix/phoenix-core/src/main/java/org/apache/hadoop/hbase/ipc/controller/MetadataRpcController.java>:[56,38]
cannot find symbol
[ERROR]   symbol:   class HBaseRpcController
[ERROR]   location: class org.apache.hadoop.hbase.ipc.controller.MetadataRpcController
[ERROR] <https://builds.apache.org/job/Phoenix_Compile_Compat_wHBase/ws/phoenix/phoenix/phoenix-core/src/main/java/org/apache/hadoop/hbase/ipc/controller/InterRegionServerMetadataRpcControllerFactory.java>:[26,35]
cannot find symbol
[ERROR]   symbol:   class HBaseRpcController
[ERROR]   location: package org.apache.hadoop.hbase.ipc
[ERROR] <https://builds.apache.org/job/Phoenix_Compile_Compat_wHBase/ws/phoenix/phoenix/phoenix-core/src/main/java/org/apache/hadoop/hbase/ipc/controller/InterRegionServerMetadataRpcControllerFactory.java>:[40,12]
cannot find symbol
[ERROR]   symbol:   class HBaseRpcController
[ERROR]   location: class org.apache.hadoop.hbase.ipc.controller.InterRegionServerMetadataRpcControllerFactory
[ERROR] <https://builds.apache.org/job/Phoenix_Compile_Compat_wHBase/ws/phoenix/phoenix/phoenix-core/src/main/java/org/apache/hadoop/hbase/ipc/controller/InterRegionServerMetadataRpcControllerFactory.java>:[46,12]
cannot find symbol
[ERROR]   symbol:   class HBaseRpcController
[ERROR]   location: class org.apache.hadoop.hbase.ipc.controller.InterRegionServerMetadataRpcControllerFactory
[ERROR] <https://builds.apache.org/job/Phoenix_Compile_Compat_wHBase/ws/phoenix/phoenix/phoenix-core/src/main/java/org/apache/hadoop/hbase/ipc/controller/InterRegionServerMetadataRpcControllerFactory.java>:[52,12]
cannot find symbol
[ERROR]   symbol:   class HBaseRpcController
[ERROR]   location: class org.apache.hadoop.hbase.ipc.controller.InterRegionServerMetadataRpcControllerFactory
[ERROR] <https://builds.apache.org/job/Phoenix_Compile_Compat_wHBase/ws/phoenix/phoenix/phoenix-core/src/main/java/org/apache/hadoop/hbase/ipc/controller/InterRegionServerMetadataRpcControllerFactory.java>:[57,46]
cannot find symbol
[ERROR]   symbol:   class HBaseRpcController
[ERROR]   location: class org.apache.hadoop.hbase.ipc.controller.InterRegionServerMetadataRpcControllerFactory
[ERROR] <https://builds.apache.org/job/Phoenix_Compile_Compat_wHBase/ws/phoenix/phoenix/phoenix-core/src/main/java/org/apache/hadoop/hbase/ipc/controller/InterRegionServerMetadataRpcControllerFactory.java>:[57,13]
cannot find symbol
[ERROR]   symbol:   class HBaseRpcController
[ERROR]   location: class org.apache.hadoop.hbase.ipc.controller.InterRegionServerMetadataRpcControllerFactory
[ERROR] <https://builds.apache.org/job/Phoenix_Compile_Compat_wHBase/ws/phoenix/phoenix/phoenix-core/src/main/java/org/apache/hadoop/hbase/ipc/controller/InterRegionServerIndexRpcControllerFactory.java>:[26,35]
cannot find symbol
[ERROR]   symbol:   class HBaseRpcController
[ERROR]   location: package org.apache.hadoop.hbase.ipc
[ERROR] <https://builds.apache.org/job/Phoenix_Compile_Compat_wHBase/ws/phoenix/phoenix/phoenix-core/src/main/java/org/apache/hadoop/hbase/ipc/controller/InterRegionServerIndexRpcControllerFactory.java>:[42,12]
cannot find symbol
[ERROR]   symbol:   class HBaseRpcController
[ERROR]   location: class org.apache.hadoop.hbase.ipc.controller.InterRegionServerIndexRpcControllerFactory
[ERROR] <https://builds.apache.org/job/Phoenix_Compile_Compat_wHBase/ws/phoenix/phoenix/phoenix-core/src/main/java/org/apache/hadoop/hbase/ipc/controller/InterRegionServerIndexRpcControllerFactory.java>:[48,12]
cannot find symbol
[ERROR]   symbol:   class HBaseRpcController
[ERROR]   location: class org.apache.hadoop.hbase.ipc.controller.InterRegionServerIndexRpcControllerFactory
[ERROR] <https://builds.apache.org/job/Phoenix_Compile_Compat_wHBase/ws/phoenix/phoenix/phoenix-core/src/main/java/org/apache/hadoop/hbase/ipc/controller/InterRegionServerIndexRpcControllerFactory.java>:[54,12]
cannot find symbol
[ERROR]   symbol:   class HBaseRpcController
[ERROR]   location: class org.apache.hadoop.hbase.ipc.controller.InterRegionServerIndexRpcControllerFactory
[ERROR] <https://builds.apache.org/job/Phoenix_Compile_Compat_wHBase/ws/phoenix/phoenix/phoenix-core/src/main/java/org/apache/hadoop/hbase/ipc/controller/InterRegionServerIndexRpcControllerFactory.java>:[59,46]
cannot find symbol
[ERROR]   symbol:   class HBaseRpcController
[ERROR]   location: class org.apache.hadoop.hbase.ipc.controller.InterRegionServerIndexRpcControllerFactory
[ERROR] <https://builds.apache.org/job/Phoenix_Compile_Compat_wHBase/ws/phoenix/phoenix/phoenix-core/src/main/java/org/apache/hadoop/hbase/ipc/controller/InterRegionServerIndexRpcControllerFactory.java>:[59,13]
cannot find symbol
[ERROR]   symbol:   class HBaseRpcController
[ERROR]   location: class org.apache.hadoop.hbase.ipc.controller.InterRegionServerIndexRpcControllerFactory
[ERROR] <https://builds.apache.org/job/Phoenix_Compile_Compat_wHBase/ws/phoenix/phoenix/phoenix-core/src/main/java/org/apache/hadoop/hbase/ipc/controller/IndexRpcController.java>:[22,35]
cannot find symbol
[ERROR]   symbol:   class DelegatingHBaseRpcController
[ERROR]   location: package org.apache.hadoop.hbase.ipc
[ERROR] <https://builds.apache.org/job/Phoenix_Compile_Compat_wHBase/ws/phoenix/phoenix/phoenix-core/src/main/java/org/apache/hadoop/hbase/ipc/controller/IndexRpcController.java>:[23,35]
cannot find symbol
[ERROR]   symbol:   class HBaseRpcController
[ERROR]   location: package org.apache.hadoop.hbase.ipc
[ERROR] <https://builds.apache.org/job/Phoenix_Compile_Compat_wHBase/ws/phoenix/phoenix/phoenix-core/src/main/java/org/apache/hadoop/hbase/ipc/controller/IndexRpcController.java>:[34,34]
cannot find symbol
[ERROR]   symbol: class DelegatingHBaseRpcController
[ERROR] <https://builds.apache.org/job/Phoenix_Compile_Compat_wHBase/ws/phoenix/phoenix/phoenix-core/src/main/java/org/apache/hadoop/hbase/ipc/controller/IndexRpcController.java>:[39,31]
cannot find symbol
[ERROR]   symbol:   class HBaseRpcController
[ERROR]   location: class org.apache.hadoop.hbase.ipc.controller.IndexRpcController
[ERROR] <https://builds.apache.org/job/Phoenix_Compile_Compat_wHBase/ws/phoenix/phoenix/phoenix-core/src/main/java/org/apache/phoenix/coprocessor/DelegateRegionCoprocessorEnvironment.java>:[30,39]
cannot find symbol
[ERROR]   symbol:   class MetricRegistry
[ERROR]   location: package org.apache.hadoop.hbase.metrics
[ERROR] <https://builds.apache.org/job/Phoenix_Compile_Compat_wHBase/ws/phoenix/phoenix/phoenix-core/src/main/java/org/apache/phoenix/coprocessor/DelegateRegionCoprocessorEnvironment.java>:[121,12]
cannot find symbol
[ERROR]   symbol:   class MetricRegistry
[ERROR]   location: class org.apache.phoenix.coprocessor.DelegateRegionCoprocessorEnvironment
[ERROR] <https://builds.apache.org/job/Phoenix_Compile_Compat_wHBase/ws/phoenix/phoenix/phoenix-core/src/main/java/org/apache/hadoop/hbase/ipc/controller/ClientRpcControllerFactory.java>:[25,35]
cannot find symbol
[ERROR]   symbol:   class HBaseRpcController
[ERROR]   location: package org.apache.hadoop.hbase.ipc
[ERROR] <https://builds.apache.org/job/Phoenix_Compile_Compat_wHBase/ws/phoenix/phoenix/phoenix-core/src/main/java/org/apache/hadoop/hbase/ipc/controller/ClientRpcControllerFactory.java>:[39,12]
cannot find symbol
[ERROR]   symbol:   class HBaseRpcController
[ERROR]   location: class org.apache.hadoop.hbase.ipc.controller.ClientRpcControllerFactory
[ERROR] <https://builds.apache.org/job/Phoenix_Compile_Compat_wHBase/ws/phoenix/phoenix/phoenix-core/src/main/java/org/apache/hadoop/hbase/ipc/controller/ClientRpcControllerFactory.java>:[45,12]
cannot find symbol
[ERROR]   symbol:   class HBaseRpcController
[ERROR]   location: class org.apache.hadoop.hbase.ipc.controller.ClientRpcControllerFactory
[ERROR] <https://builds.apache.org/job/Phoenix_Compile_Compat_wHBase/ws/phoenix/phoenix/phoenix-core/src/main/java/org/apache/hadoop/hbase/ipc/controller/ClientRpcControllerFactory.java>:[51,12]
cannot find symbol
[ERROR]   symbol:   class HBaseRpcController
[ERROR]   location: class org.apache.hadoop.hbase.ipc.controller.ClientRpcControllerFactory
[ERROR] <https://builds.apache.org/job/Phoenix_Compile_Compat_wHBase/ws/phoenix/phoenix/phoenix-core/src/main/java/org/apache/hadoop/hbase/ipc/controller/ClientRpcControllerFactory.java>:[56,46]
cannot find symbol
[ERROR]   symbol:   class HBaseRpcController
[ERROR]   location: class org.apache.hadoop.hbase.ipc.controller.ClientRpcControllerFactory
[ERROR] <https://builds.apache.org/job/Phoenix_Compile_Compat_wHBase/ws/phoenix/phoenix/phoenix-core/src/main/java/org/apache/hadoop/hbase/ipc/controller/ClientRpcControllerFactory.java>:[56,13]
cannot find symbol
[ERROR]   symbol:   class HBaseRpcController
[ERROR]   location: class org.apache.hadoop.hbase.ipc.controller.ClientRpcControllerFactory
[ERROR] <https://builds.apache.org/job/Phoenix_Compile_Compat_wHBase/ws/phoenix/phoenix/phoenix-core/src/main/java/org/apache/phoenix/iterate/SnapshotScanner.java>:[31,39]
cannot find symbol
[ERROR]   symbol:   class MetricRegistry
[ERROR]   location: package org.apache.hadoop.hbase.metrics
[ERROR] <https://builds.apache.org/job/Phoenix_Compile_Compat_wHBase/ws/phoenix/phoenix/phoenix-core/src/main/java/org/apache/phoenix/coprocessor/PhoenixAccessController.java>:[46,35]
cannot find symbol
[ERROR]   symbol:   class HBaseRpcController
[ERROR]   location: package org.apache.hadoop.hbase.ipc
[ERROR] <https://builds.apache.org/job/Phoenix_Compile_Compat_wHBase/ws/phoenix/phoenix/phoenix-core/src/main/java/org/apache/phoenix/execute/DelegateHTable.java>:[322,20]
cannot find symbol
[ERROR]   symbol:   method getReadRpcTimeout()
[ERROR]   location: variable delegate of type org.apache.hadoop.hbase.client.HTableInterface
[ERROR] <https://builds.apache.org/job/Phoenix_Compile_Compat_wHBase/ws/phoenix/phoenix/phoenix-core/src/main/java/org/apache/phoenix/execute/DelegateHTable.java>:[320,3]
method does not override or implement a method from a supertype
[ERROR] <https://builds.apache.org/job/Phoenix_Compile_Compat_wHBase/ws/phoenix/phoenix/phoenix-core/src/main/java/org/apache/phoenix/execute/DelegateHTable.java>:[327,13]
cannot find symbol
[ERROR]   symbol:   method setReadRpcTimeout(int)
[ERROR]   location: variable delegate of type org.apache.hadoop.hbase.client.HTableInterface
[ERROR] <https://builds.apache.org/job/Phoenix_Compile_Compat_wHBase/ws/phoenix/phoenix/phoenix-core/src/main/java/org/apache/phoenix/execute/DelegateHTable.java>:[325,3]
method does not override or implement a method from a supertype
[ERROR] <https://builds.apache.org/job/Phoenix_Compile_Compat_wHBase/ws/phoenix/phoenix/phoenix-core/src/main/java/org/apache/phoenix/execute/DelegateHTable.java>:[332,20]
cannot find symbol
[ERROR]   symbol:   method getWriteRpcTimeout()
[ERROR]   location: variable delegate of type org.apache.hadoop.hbase.client.HTableInterface
[ERROR] <https://builds.apache.org/job/Phoenix_Compile_Compat_wHBase/ws/phoenix/phoenix/phoenix-core/src/main/java/org/apache/phoenix/execute/DelegateHTable.java>:[330,3]
method does not override or implement a method from a supertype
[ERROR] <https://builds.apache.org/job/Phoenix_Compile_Compat_wHBase/ws/phoenix/phoenix/phoenix-core/src/main/java/org/apache/phoenix/execute/DelegateHTable.java>:[337,13]
cannot find symbol
[ERROR]   symbol:   method setWriteRpcTimeout(int)
[ERROR]   location: variable delegate of type org.apache.hadoop.hbase.client.HTableInterface
[ERROR] <https://builds.apache.org/job/Phoenix_Compile_Compat_wHBase/ws/phoenix/phoenix/phoenix-core/src/main/java/org/apache/phoenix/execute/DelegateHTable.java>:[335,3]
method does not override or implement a method from a supertype
[ERROR] <https://builds.apache.org/job/Phoenix_Compile_Compat_wHBase/ws/phoenix/phoenix/phoenix-core/src/main/java/org/apache/hadoop/hbase/regionserver/LocalIndexStoreFileScanner.java>:[43,9]
constructor StoreFileScanner in class org.apache.hadoop.hbase.regionserver.StoreFileScanner
cannot be applied to given types;
[ERROR]   required: org.apache.hadoop.hbase.regionserver.StoreFile.Reader,org.apache.hadoop.hbase.io.hfile.HFileScanner,boolean,boolean,long
[ERROR]   found: org.apache.hadoop.hbase.regionserver.StoreFile.Reader,org.apache.hadoop.hbase.io.hfile.HFileScanner,boolean,boolean,long,long,boolean
[ERROR]   reason: actual and formal argument lists differ in length
[ERROR] <https://builds.apache.org/job/Phoenix_Compile_Compat_wHBase/ws/phoenix/phoenix/phoenix-core/src/main/java/org/apache/phoenix/coprocessor/PhoenixMetaDataCoprocessorHost.java>:[145,23]
cannot find symbol
[ERROR]   symbol:   method getMetricRegistryForRegionServer()
[ERROR]   location: variable env of type org.apache.hadoop.hbase.coprocessor.RegionCoprocessorEnvironment
[ERROR] <https://builds.apache.org/job/Phoenix_Compile_Compat_wHBase/ws/phoenix/phoenix/phoenix-core/src/main/java/org/apache/phoenix/coprocessor/PhoenixMetaDataCoprocessorHost.java>:[143,9]
method does not override or implement a method from a supertype
[ERROR] <https://builds.apache.org/job/Phoenix_Compile_Compat_wHBase/ws/phoenix/phoenix/phoenix-core/src/main/java/org/apache/hadoop/hbase/ipc/controller/MetadataRpcController.java>:[65,25]
method setPriority in class org.apache.hadoop.hbase.ipc.controller.MetadataRpcController cannot
be applied to given types;
[ERROR]   required: org.apache.hadoop.hbase.TableName
[ERROR]   found: int
[ERROR]   reason: actual argument int cannot be converted to org.apache.hadoop.hbase.TableName
by method invocation conversion
[ERROR] <https://builds.apache.org/job/Phoenix_Compile_Compat_wHBase/ws/phoenix/phoenix/phoenix-core/src/main/java/org/apache/hadoop/hbase/ipc/controller/MetadataRpcController.java>:[67,25]
cannot find symbol
[ERROR]   symbol:   variable super
[ERROR]   location: class org.apache.hadoop.hbase.ipc.controller.MetadataRpcController
[ERROR] <https://builds.apache.org/job/Phoenix_Compile_Compat_wHBase/ws/phoenix/phoenix/phoenix-core/src/main/java/org/apache/hadoop/hbase/ipc/controller/MetadataRpcController.java>:[62,9]
method does not override or implement a method from a supertype
[ERROR] <https://builds.apache.org/job/Phoenix_Compile_Compat_wHBase/ws/phoenix/phoenix/phoenix-core/src/main/java/org/apache/hadoop/hbase/ipc/controller/InterRegionServerMetadataRpcControllerFactory.java>:[41,9]
cannot find symbol
[ERROR]   symbol:   class HBaseRpcController
[ERROR]   location: class org.apache.hadoop.hbase.ipc.controller.InterRegionServerMetadataRpcControllerFactory
[ERROR] <https://builds.apache.org/job/Phoenix_Compile_Compat_wHBase/ws/phoenix/phoenix/phoenix-core/src/main/java/org/apache/hadoop/hbase/ipc/controller/InterRegionServerMetadataRpcControllerFactory.java>:[47,9]
cannot find symbol
[ERROR]   symbol:   class HBaseRpcController
[ERROR]   location: class org.apache.hadoop.hbase.ipc.controller.InterRegionServerMetadataRpcControllerFactory
[ERROR] <https://builds.apache.org/job/Phoenix_Compile_Compat_wHBase/ws/phoenix/phoenix/phoenix-core/src/main/java/org/apache/hadoop/hbase/ipc/controller/InterRegionServerMetadataRpcControllerFactory.java>:[53,9]
cannot find symbol
[ERROR]   symbol:   class HBaseRpcController
[ERROR]   location: class org.apache.hadoop.hbase.ipc.controller.InterRegionServerMetadataRpcControllerFactory
[ERROR] <https://builds.apache.org/job/Phoenix_Compile_Compat_wHBase/ws/phoenix/phoenix/phoenix-core/src/main/java/org/apache/hadoop/hbase/ipc/controller/InterRegionServerIndexRpcControllerFactory.java>:[43,9]
cannot find symbol
[ERROR]   symbol:   class HBaseRpcController
[ERROR]   location: class org.apache.hadoop.hbase.ipc.controller.InterRegionServerIndexRpcControllerFactory
[ERROR] <https://builds.apache.org/job/Phoenix_Compile_Compat_wHBase/ws/phoenix/phoenix/phoenix-core/src/main/java/org/apache/hadoop/hbase/ipc/controller/InterRegionServerIndexRpcControllerFactory.java>:[49,9]
cannot find symbol
[ERROR]   symbol:   class HBaseRpcController
[ERROR]   location: class org.apache.hadoop.hbase.ipc.controller.InterRegionServerIndexRpcControllerFactory
[ERROR] <https://builds.apache.org/job/Phoenix_Compile_Compat_wHBase/ws/phoenix/phoenix/phoenix-core/src/main/java/org/apache/hadoop/hbase/ipc/controller/InterRegionServerIndexRpcControllerFactory.java>:[55,9]
cannot find symbol
[ERROR]   symbol:   class HBaseRpcController
[ERROR]   location: class org.apache.hadoop.hbase.ipc.controller.InterRegionServerIndexRpcControllerFactory
[ERROR] <https://builds.apache.org/job/Phoenix_Compile_Compat_wHBase/ws/phoenix/phoenix/phoenix-core/src/main/java/org/apache/hadoop/hbase/ipc/controller/InterRegionServerIndexRpcControllerFactory.java>:[61,7]
cannot find symbol
[ERROR]   symbol:   class HBaseRpcController
[ERROR]   location: class org.apache.hadoop.hbase.ipc.controller.InterRegionServerIndexRpcControllerFactory
[ERROR] <https://builds.apache.org/job/Phoenix_Compile_Compat_wHBase/ws/phoenix/phoenix/phoenix-core/src/main/java/org/apache/hadoop/hbase/ipc/PhoenixRpcScheduler.java>:[140,24]
cannot find symbol
[ERROR]   symbol:   method getReadQueueLength()
[ERROR]   location: variable delegate of type org.apache.hadoop.hbase.ipc.RpcScheduler
[ERROR] <https://builds.apache.org/job/Phoenix_Compile_Compat_wHBase/ws/phoenix/phoenix/phoenix-core/src/main/java/org/apache/hadoop/hbase/ipc/PhoenixRpcScheduler.java>:[138,5]
method does not override or implement a method from a supertype
[ERROR] <https://builds.apache.org/job/Phoenix_Compile_Compat_wHBase/ws/phoenix/phoenix/phoenix-core/src/main/java/org/apache/hadoop/hbase/ipc/PhoenixRpcScheduler.java>:[145,24]
cannot find symbol
[ERROR]   symbol:   method getWriteQueueLength()
[ERROR]   location: variable delegate of type org.apache.hadoop.hbase.ipc.RpcScheduler
[ERROR] <https://builds.apache.org/job/Phoenix_Compile_Compat_wHBase/ws/phoenix/phoenix/phoenix-core/src/main/java/org/apache/hadoop/hbase/ipc/PhoenixRpcScheduler.java>:[143,5]
method does not override or implement a method from a supertype
[ERROR] <https://builds.apache.org/job/Phoenix_Compile_Compat_wHBase/ws/phoenix/phoenix/phoenix-core/src/main/java/org/apache/hadoop/hbase/ipc/PhoenixRpcScheduler.java>:[150,24]
cannot find symbol
[ERROR]   symbol:   method getScanQueueLength()
[ERROR]   location: variable delegate of type org.apache.hadoop.hbase.ipc.RpcScheduler
[ERROR] <https://builds.apache.org/job/Phoenix_Compile_Compat_wHBase/ws/phoenix/phoenix/phoenix-core/src/main/java/org/apache/hadoop/hbase/ipc/PhoenixRpcScheduler.java>:[148,5]
method does not override or implement a method from a supertype
[ERROR] <https://builds.apache.org/job/Phoenix_Compile_Compat_wHBase/ws/phoenix/phoenix/phoenix-core/src/main/java/org/apache/hadoop/hbase/ipc/PhoenixRpcScheduler.java>:[155,24]
cannot find symbol
[ERROR]   symbol:   method getActiveReadRpcHandlerCount()
[ERROR]   location: variable delegate of type org.apache.hadoop.hbase.ipc.RpcScheduler
[ERROR] <https://builds.apache.org/job/Phoenix_Compile_Compat_wHBase/ws/phoenix/phoenix/phoenix-core/src/main/java/org/apache/hadoop/hbase/ipc/PhoenixRpcScheduler.java>:[153,5]
method does not override or implement a method from a supertype
[ERROR] <https://builds.apache.org/job/Phoenix_Compile_Compat_wHBase/ws/phoenix/phoenix/phoenix-core/src/main/java/org/apache/hadoop/hbase/ipc/PhoenixRpcScheduler.java>:[160,24]
cannot find symbol
[ERROR]   symbol:   method getActiveWriteRpcHandlerCount()
[ERROR]   location: variable delegate of type org.apache.hadoop.hbase.ipc.RpcScheduler
[ERROR] <https://builds.apache.org/job/Phoenix_Compile_Compat_wHBase/ws/phoenix/phoenix/phoenix-core/src/main/java/org/apache/hadoop/hbase/ipc/PhoenixRpcScheduler.java>:[158,5]
method does not override or implement a method from a supertype
[ERROR] <https://builds.apache.org/job/Phoenix_Compile_Compat_wHBase/ws/phoenix/phoenix/phoenix-core/src/main/java/org/apache/hadoop/hbase/ipc/PhoenixRpcScheduler.java>:[165,24]
cannot find symbol
[ERROR]   symbol:   method getActiveScanRpcHandlerCount()
[ERROR]   location: variable delegate of type org.apache.hadoop.hbase.ipc.RpcScheduler
[ERROR] <https://builds.apache.org/job/Phoenix_Compile_Compat_wHBase/ws/phoenix/phoenix/phoenix-core/src/main/java/org/apache/hadoop/hbase/ipc/PhoenixRpcScheduler.java>:[163,5]
method does not override or implement a method from a supertype
[ERROR] <https://builds.apache.org/job/Phoenix_Compile_Compat_wHBase/ws/phoenix/phoenix/phoenix-core/src/main/java/org/apache/hadoop/hbase/ipc/controller/IndexRpcController.java>:[49,25]
method setPriority in class org.apache.hadoop.hbase.ipc.controller.IndexRpcController cannot
be applied to given types;
[ERROR]   required: org.apache.hadoop.hbase.TableName
[ERROR]   found: int
[ERROR]   reason: actual argument int cannot be converted to org.apache.hadoop.hbase.TableName
by method invocation conversion
[ERROR] <https://builds.apache.org/job/Phoenix_Compile_Compat_wHBase/ws/phoenix/phoenix/phoenix-core/src/main/java/org/apache/hadoop/hbase/ipc/controller/IndexRpcController.java>:[52,13]
cannot find symbol
[ERROR]   symbol:   variable super
[ERROR]   location: class org.apache.hadoop.hbase.ipc.controller.IndexRpcController
[ERROR] <https://builds.apache.org/job/Phoenix_Compile_Compat_wHBase/ws/phoenix/phoenix/phoenix-core/src/main/java/org/apache/hadoop/hbase/ipc/controller/IndexRpcController.java>:[46,5]
method does not override or implement a method from a supertype
[ERROR] <https://builds.apache.org/job/Phoenix_Compile_Compat_wHBase/ws/phoenix/phoenix/phoenix-core/src/main/java/org/apache/hadoop/hbase/regionserver/IndexHalfStoreFileReaderGenerator.java>:[230,78]
cannot find symbol
[ERROR]   symbol:   method getScannerOrder()
[ERROR]   location: variable scanner of type org.apache.hadoop.hbase.regionserver.KeyValueScanner
[ERROR] <https://builds.apache.org/job/Phoenix_Compile_Compat_wHBase/ws/phoenix/phoenix/phoenix-core/src/main/java/org/apache/hadoop/hbase/regionserver/IndexHalfStoreFileReaderGenerator.java>:[394,38]
constructor StoreFileScanner in class org.apache.hadoop.hbase.regionserver.StoreFileScanner
cannot be applied to given types;
[ERROR]   required: org.apache.hadoop.hbase.regionserver.StoreFile.Reader,org.apache.hadoop.hbase.io.hfile.HFileScanner,boolean,boolean,long
[ERROR]   found: org.apache.hadoop.hbase.regionserver.StoreFile.Reader,org.apache.hadoop.hbase.io.hfile.HFileScanner,boolean,boolean,long,long,boolean
[ERROR]   reason: actual and formal argument lists differ in length
[ERROR] <https://builds.apache.org/job/Phoenix_Compile_Compat_wHBase/ws/phoenix/phoenix/phoenix-core/src/main/java/org/apache/phoenix/coprocessor/DelegateRegionCoprocessorEnvironment.java>:[122,24]
cannot find symbol
[ERROR]   symbol:   method getMetricRegistryForRegionServer()
[ERROR]   location: variable delegate of type org.apache.hadoop.hbase.coprocessor.RegionCoprocessorEnvironment
[ERROR] <https://builds.apache.org/job/Phoenix_Compile_Compat_wHBase/ws/phoenix/phoenix/phoenix-core/src/main/java/org/apache/phoenix/coprocessor/DelegateRegionCoprocessorEnvironment.java>:[120,5]
method does not override or implement a method from a supertype
[ERROR] <https://builds.apache.org/job/Phoenix_Compile_Compat_wHBase/ws/phoenix/phoenix/phoenix-core/src/main/java/org/apache/phoenix/coprocessor/DelegateRegionObserver.java>:[686,24]
method preFlushScannerOpen in interface org.apache.hadoop.hbase.coprocessor.RegionObserver
cannot be applied to given types;
[ERROR]   required: org.apache.hadoop.hbase.coprocessor.ObserverContext<org.apache.hadoop.hbase.coprocessor.RegionCoprocessorEnvironment>,org.apache.hadoop.hbase.regionserver.Store,org.apache.hadoop.hbase.regionserver.KeyValueScanner,org.apache.hadoop.hbase.regionserver.InternalScanner
[ERROR]   found: org.apache.hadoop.hbase.coprocessor.ObserverContext<org.apache.hadoop.hbase.coprocessor.RegionCoprocessorEnvironment>,org.apache.hadoop.hbase.regionserver.Store,org.apache.hadoop.hbase.regionserver.KeyValueScanner,org.apache.hadoop.hbase.regionserver.InternalScanner,long
[ERROR]   reason: actual and formal argument lists differ in length
[ERROR] <https://builds.apache.org/job/Phoenix_Compile_Compat_wHBase/ws/phoenix/phoenix/phoenix-core/src/main/java/org/apache/phoenix/coprocessor/DelegateRegionObserver.java>:[682,5]
method does not override or implement a method from a supertype
[ERROR] <https://builds.apache.org/job/Phoenix_Compile_Compat_wHBase/ws/phoenix/phoenix/phoenix-core/src/main/java/org/apache/phoenix/coprocessor/DelegateRegionObserver.java>:[694,22]
no suitable method found for preCompactScannerOpen(org.apache.hadoop.hbase.coprocessor.ObserverContext<org.apache.hadoop.hbase.coprocessor.RegionCoprocessorEnvironment>,org.apache.hadoop.hbase.regionserver.Store,java.util.List<capture#1
of ? extends org.apache.hadoop.hbase.regionserver.KeyValueScanner>,org.apache.hadoop.hbase.regionserver.ScanType,long,org.apache.hadoop.hbase.regionserver.InternalScanner,org.apache.hadoop.hbase.regionserver.compactions.CompactionRequest,long)
[ERROR]     method org.apache.hadoop.hbase.coprocessor.RegionObserver.preCompactScannerOpen(org.apache.hadoop.hbase.coprocessor.ObserverContext<org.apache.hadoop.hbase.coprocessor.RegionCoprocessorEnvironment>,org.apache.hadoop.hbase.regionserver.Store,java.util.List<?
extends org.apache.hadoop.hbase.regionserver.KeyValueScanner>,org.apache.hadoop.hbase.regionserver.ScanType,long,org.apache.hadoop.hbase.regionserver.InternalScanner)
is not applicable
[ERROR]       (actual and formal argument lists differ in length)
[ERROR]     method org.apache.hadoop.hbase.coprocessor.RegionObserver.preCompactScannerOpen(org.apache.hadoop.hbase.coprocessor.ObserverContext<org.apache.hadoop.hbase.coprocessor.RegionCoprocessorEnvironment>,org.apache.hadoop.hbase.regionserver.Store,java.util.List<?
extends org.apache.hadoop.hbase.regionserver.KeyValueScanner>,org.apache.hadoop.hbase.regionserver.ScanType,long,org.apache.hadoop.hbase.regionserver.InternalScanner,org.apache.hadoop.hbase.regionserver.compactions.CompactionRequest)
is not applicable
[ERROR]       (actual and formal argument lists differ in length)
[ERROR] <https://builds.apache.org/job/Phoenix_Compile_Compat_wHBase/ws/phoenix/phoenix/phoenix-core/src/main/java/org/apache/phoenix/coprocessor/DelegateRegionObserver.java>:[689,5]
method does not override or implement a method from a supertype
[ERROR] <https://builds.apache.org/job/Phoenix_Compile_Compat_wHBase/ws/phoenix/phoenix/phoenix-core/src/main/java/org/apache/phoenix/coprocessor/DelegateRegionObserver.java>:[701,17]
cannot find symbol
[ERROR]   symbol:   method preCommitStoreFile(org.apache.hadoop.hbase.coprocessor.ObserverContext<org.apache.hadoop.hbase.coprocessor.RegionCoprocessorEnvironment>,byte[],java.util.List<org.apache.hadoop.hbase.util.Pair<org.apache.hadoop.fs.Path,org.apache.hadoop.fs.Path>>)
[ERROR]   location: variable delegate of type org.apache.hadoop.hbase.coprocessor.RegionObserver
[ERROR] <https://builds.apache.org/job/Phoenix_Compile_Compat_wHBase/ws/phoenix/phoenix/phoenix-core/src/main/java/org/apache/phoenix/coprocessor/DelegateRegionObserver.java>:[698,5]
method does not override or implement a method from a supertype
[ERROR] <https://builds.apache.org/job/Phoenix_Compile_Compat_wHBase/ws/phoenix/phoenix/phoenix-core/src/main/java/org/apache/phoenix/coprocessor/DelegateRegionObserver.java>:[707,17]
cannot find symbol
[ERROR]   symbol:   method postCommitStoreFile(org.apache.hadoop.hbase.coprocessor.ObserverContext<org.apache.hadoop.hbase.coprocessor.RegionCoprocessorEnvironment>,byte[],org.apache.hadoop.fs.Path,org.apache.hadoop.fs.Path)
[ERROR]   location: variable delegate of type org.apache.hadoop.hbase.coprocessor.RegionObserver
[ERROR] <https://builds.apache.org/job/Phoenix_Compile_Compat_wHBase/ws/phoenix/phoenix/phoenix-core/src/main/java/org/apache/phoenix/coprocessor/DelegateRegionObserver.java>:[704,5]
method does not override or implement a method from a supertype
[ERROR] <https://builds.apache.org/job/Phoenix_Compile_Compat_wHBase/ws/phoenix/phoenix/phoenix-core/src/main/java/org/apache/hadoop/hbase/ipc/controller/ClientRpcControllerFactory.java>:[40,9]
cannot find symbol
[ERROR]   symbol:   class HBaseRpcController
[ERROR]   location: class org.apache.hadoop.hbase.ipc.controller.ClientRpcControllerFactory
[ERROR] <https://builds.apache.org/job/Phoenix_Compile_Compat_wHBase/ws/phoenix/phoenix/phoenix-core/src/main/java/org/apache/hadoop/hbase/ipc/controller/ClientRpcControllerFactory.java>:[46,9]
cannot find symbol
[ERROR]   symbol:   class HBaseRpcController
[ERROR]   location: class org.apache.hadoop.hbase.ipc.controller.ClientRpcControllerFactory
[ERROR] <https://builds.apache.org/job/Phoenix_Compile_Compat_wHBase/ws/phoenix/phoenix/phoenix-core/src/main/java/org/apache/hadoop/hbase/ipc/controller/ClientRpcControllerFactory.java>:[52,9]
cannot find symbol
[ERROR]   symbol:   class HBaseRpcController
[ERROR]   location: class org.apache.hadoop.hbase.ipc.controller.ClientRpcControllerFactory
[ERROR] <https://builds.apache.org/job/Phoenix_Compile_Compat_wHBase/ws/phoenix/phoenix/phoenix-core/src/main/java/org/apache/phoenix/iterate/SnapshotScanner.java>:[180,14]
cannot find symbol
[ERROR]   symbol: class MetricRegistry
[ERROR] <https://builds.apache.org/job/Phoenix_Compile_Compat_wHBase/ws/phoenix/phoenix/phoenix-core/src/main/java/org/apache/phoenix/iterate/SnapshotScanner.java>:[179,7]
method does not override or implement a method from a supertype
[ERROR] <https://builds.apache.org/job/Phoenix_Compile_Compat_wHBase/ws/phoenix/phoenix/phoenix-core/src/main/java/org/apache/phoenix/coprocessor/PhoenixAccessController.java>:[454,78]
cannot find symbol
[ERROR]   symbol: class HBaseRpcController
[ERROR] <https://builds.apache.org/job/Phoenix_Compile_Compat_wHBase/ws/phoenix/phoenix/phoenix-core/src/main/java/org/apache/phoenix/coprocessor/PhoenixAccessController.java>:[432,17]
cannot find symbol
[ERROR]   symbol: class HBaseRpcController
[ERROR] -> [Help 1]
[ERROR] 
[ERROR] To see the full stack trace of the errors, re-run Maven with the -e switch.
[ERROR] Re-run Maven using the -X switch to enable full debug logging.
[ERROR] 
[ERROR] For more information about the errors and possible solutions, please read the following
articles:
[ERROR] [Help 1] http://cwiki.apache.org/confluence/display/MAVEN/MojoFailureException
[ERROR] 
[ERROR] After correcting the problems, you can resume the build with the command
[ERROR]   mvn <goals> -rf :phoenix-core
Build step 'Execute shell' marked build as failure

Mime
View raw message