phoenix-commits mailing list archives

Site index · List index
Message view « Date » · « Thread »
Top « Date » · « Thread »
From Apache Jenkins Server <jenk...@builds.apache.org>
Subject Build failed in Jenkins: Phoenix | Master #1992
Date Fri, 13 Apr 2018 06:14:51 GMT
See <https://builds.apache.org/job/Phoenix-master/1992/display/redirect?page=changes>

Changes:

[jtaylor] PHOENIX-4605 Support running multiple transaction providers (ammendment)

------------------------------------------
[...truncated 111.57 KB...]
[INFO] Running org.apache.phoenix.end2end.join.HashJoinMoreIT
[INFO] Running org.apache.phoenix.end2end.join.SortMergeJoinGlobalIndexIT
[INFO] Running org.apache.phoenix.end2end.join.SortMergeJoinLocalIndexIT
[INFO] Running org.apache.phoenix.end2end.join.SortMergeJoinNoIndexIT
[INFO] Tests run: 8, Failures: 0, Errors: 0, Skipped: 0, Time elapsed: 106.145 s - in org.apache.phoenix.end2end.join.HashJoinMoreIT
[INFO] Running org.apache.phoenix.end2end.join.SubqueryIT
[INFO] Tests run: 33, Failures: 0, Errors: 0, Skipped: 0, Time elapsed: 419.089 s - in org.apache.phoenix.end2end.join.HashJoinNoIndexIT
[INFO] Running org.apache.phoenix.end2end.join.SubqueryUsingSortMergeJoinIT
[INFO] Tests run: 34, Failures: 0, Errors: 0, Skipped: 0, Time elapsed: 380.244 s - in org.apache.phoenix.end2end.join.SortMergeJoinNoIndexIT
[INFO] Running org.apache.phoenix.end2end.salted.SaltedTableIT
[INFO] Tests run: 24, Failures: 0, Errors: 0, Skipped: 0, Time elapsed: 402.301 s - in org.apache.phoenix.end2end.join.SubqueryIT
[INFO] Tests run: 8, Failures: 0, Errors: 0, Skipped: 0, Time elapsed: 26.53 s - in org.apache.phoenix.end2end.salted.SaltedTableIT
[INFO] Running org.apache.phoenix.end2end.salted.SaltedTableVarLengthRowKeyIT
[INFO] Tests run: 1, Failures: 0, Errors: 0, Skipped: 0, Time elapsed: 4.462 s - in org.apache.phoenix.end2end.salted.SaltedTableVarLengthRowKeyIT
[INFO] Running org.apache.phoenix.iterate.PhoenixQueryTimeoutIT
[INFO] Tests run: 2, Failures: 0, Errors: 0, Skipped: 0, Time elapsed: 9.281 s - in org.apache.phoenix.iterate.PhoenixQueryTimeoutIT
[INFO] Running org.apache.phoenix.iterate.RoundRobinResultIteratorIT
[INFO] Tests run: 33, Failures: 0, Errors: 0, Skipped: 0, Time elapsed: 746.467 s - in org.apache.phoenix.end2end.join.HashJoinGlobalIndexIT
[INFO] Running org.apache.phoenix.end2end.salted.SaltedTableUpsertSelectIT
[INFO] Running org.apache.phoenix.replication.SystemCatalogWALEntryFilterIT
[INFO] Tests run: 80, Failures: 0, Errors: 0, Skipped: 0, Time elapsed: 1,015.043 s - in org.apache.phoenix.end2end.index.MutableIndexIT
[INFO] Tests run: 2, Failures: 0, Errors: 0, Skipped: 0, Time elapsed: 0.5 s - in org.apache.phoenix.replication.SystemCatalogWALEntryFilterIT
[INFO] Running org.apache.phoenix.trace.PhoenixTableMetricsWriterIT
[INFO] Tests run: 2, Failures: 0, Errors: 0, Skipped: 0, Time elapsed: 14.473 s - in org.apache.phoenix.trace.PhoenixTableMetricsWriterIT
[INFO] Running org.apache.phoenix.trace.PhoenixTracingEndToEndIT
[INFO] Tests run: 9, Failures: 0, Errors: 0, Skipped: 0, Time elapsed: 80.134 s - in org.apache.phoenix.iterate.RoundRobinResultIteratorIT
[INFO] Running org.apache.phoenix.tx.FlappingTransactionIT
[INFO] Tests run: 6, Failures: 0, Errors: 0, Skipped: 0, Time elapsed: 50.952 s - in org.apache.phoenix.end2end.salted.SaltedTableUpsertSelectIT
[INFO] Running org.apache.phoenix.tx.ParameterizedTransactionIT
[INFO] Tests run: 4, Failures: 0, Errors: 0, Skipped: 0, Time elapsed: 18.877 s - in org.apache.phoenix.tx.FlappingTransactionIT
[INFO] Running org.apache.phoenix.tx.TransactionIT
[INFO] Running org.apache.phoenix.rpc.UpdateCacheIT
[INFO] Tests run: 34, Failures: 0, Errors: 0, Skipped: 0, Time elapsed: 644.21 s - in org.apache.phoenix.end2end.join.SortMergeJoinGlobalIndexIT
[INFO] Tests run: 15, Failures: 0, Errors: 0, Skipped: 0, Time elapsed: 285.652 s - in org.apache.phoenix.end2end.join.SubqueryUsingSortMergeJoinIT
[INFO] Tests run: 7, Failures: 0, Errors: 0, Skipped: 0, Time elapsed: 43.034 s - in org.apache.phoenix.rpc.UpdateCacheIT
[INFO] Tests run: 8, Failures: 0, Errors: 0, Skipped: 0, Time elapsed: 104.363 s - in org.apache.phoenix.trace.PhoenixTracingEndToEndIT
[INFO] Tests run: 8, Failures: 0, Errors: 0, Skipped: 0, Time elapsed: 95.948 s - in org.apache.phoenix.tx.TransactionIT
[INFO] Running org.apache.phoenix.tx.TxCheckpointIT
[INFO] Running org.apache.phoenix.util.IndexScrutinyIT
[INFO] Tests run: 3, Failures: 0, Errors: 0, Skipped: 0, Time elapsed: 28.863 s - in org.apache.phoenix.util.IndexScrutinyIT
[INFO] Tests run: 34, Failures: 0, Errors: 0, Skipped: 0, Time elapsed: 834.23 s - in org.apache.phoenix.end2end.join.HashJoinLocalIndexIT
[INFO] Tests run: 34, Failures: 0, Errors: 0, Skipped: 0, Time elapsed: 837.88 s - in org.apache.phoenix.end2end.join.SortMergeJoinLocalIndexIT
[WARNING] Tests run: 52, Failures: 0, Errors: 0, Skipped: 4, Time elapsed: 365.549 s - in
org.apache.phoenix.tx.ParameterizedTransactionIT
[INFO] Tests run: 40, Failures: 0, Errors: 0, Skipped: 0, Time elapsed: 442.657 s - in org.apache.phoenix.tx.TxCheckpointIT
[INFO] 
[INFO] Results:
[INFO] 
[ERROR] Failures: 
[ERROR]   ConcurrentMutationsIT.testConcurrentDeletesAndUpsertValues:214 Expected to find
PK in data table: (0,0)
[ERROR]   DefaultColumnValueIT.testDefaultIndexed:978
[ERROR]   RowValueConstructorIT.testRVCLastPkIsTable1stPkIndex:1584
[ERROR]   IndexMetadataIT.testMutableTableOnlyHasPrimaryKeyIndex:623->helpTestTableOnlyHasPrimaryKeyIndex:662
[ERROR] Errors: 
[ERROR]   OrderByIT.testOrderByReverseOptimizationWithNUllsLastBug3491:969->doTestOrderByReverseOptimizationWithNUllsLastBug3491:1017->assertResultSet:1185
ยป SQLTimeout
[INFO] 
[ERROR] Tests run: 3420, Failures: 4, Errors: 1, Skipped: 7
[INFO] 
[INFO] 
[INFO] --- maven-failsafe-plugin:2.20:integration-test (HBaseManagedTimeTests) @ phoenix-core
---
[INFO] 
[INFO] -------------------------------------------------------
[INFO]  T E S T S
[INFO] -------------------------------------------------------
[INFO] 
[INFO] Results:
[INFO] 
[INFO] Tests run: 0, Failures: 0, Errors: 0, Skipped: 0
[INFO] 
[INFO] 
[INFO] --- maven-failsafe-plugin:2.20:integration-test (NeedTheirOwnClusterTests) @ phoenix-core
---
[INFO] 
[INFO] -------------------------------------------------------
[INFO]  T E S T S
[INFO] -------------------------------------------------------
[INFO] Running org.apache.hadoop.hbase.regionserver.wal.WALReplayWithIndexWritesAndCompressedWALIT
[INFO] Running org.apache.phoenix.end2end.ChangePermissionsIT
[INFO] Running org.apache.phoenix.end2end.ConnectionUtilIT
[INFO] Tests run: 1, Failures: 0, Errors: 0, Skipped: 0, Time elapsed: 45.955 s - in org.apache.hadoop.hbase.regionserver.wal.WALReplayWithIndexWritesAndCompressedWALIT
[INFO] Running org.apache.hadoop.hbase.regionserver.wal.WALRecoveryRegionPostOpenIT
[INFO] Running org.apache.phoenix.end2end.ColumnEncodedImmutableNonTxStatsCollectorIT
[INFO] Running org.apache.phoenix.end2end.ColumnEncodedImmutableTxStatsCollectorIT
[INFO] Running org.apache.phoenix.end2end.ColumnEncodedMutableNonTxStatsCollectorIT
[INFO] Running org.apache.phoenix.end2end.ColumnEncodedMutableTxStatsCollectorIT
[INFO] Tests run: 1, Failures: 0, Errors: 0, Skipped: 0, Time elapsed: 12.947 s - in org.apache.hadoop.hbase.regionserver.wal.WALRecoveryRegionPostOpenIT
[INFO] Tests run: 1, Failures: 0, Errors: 0, Skipped: 0, Time elapsed: 49.268 s - in org.apache.phoenix.end2end.ConnectionUtilIT
[INFO] Running org.apache.phoenix.end2end.ContextClassloaderIT
[INFO] Tests run: 3, Failures: 0, Errors: 0, Skipped: 0, Time elapsed: 4.904 s - in org.apache.phoenix.end2end.ContextClassloaderIT
[INFO] Running org.apache.phoenix.end2end.CountDistinctCompressionIT
[INFO] Tests run: 1, Failures: 0, Errors: 0, Skipped: 0, Time elapsed: 4.783 s - in org.apache.phoenix.end2end.CountDistinctCompressionIT
[INFO] Running org.apache.phoenix.end2end.CostBasedDecisionIT
[INFO] Running org.apache.phoenix.end2end.CsvBulkLoadToolIT
[INFO] Running org.apache.phoenix.end2end.DropSchemaIT
[WARNING] Tests run: 26, Failures: 0, Errors: 0, Skipped: 4, Time elapsed: 207.943 s - in
org.apache.phoenix.end2end.ColumnEncodedImmutableNonTxStatsCollectorIT
[WARNING] Tests run: 26, Failures: 0, Errors: 0, Skipped: 4, Time elapsed: 216.169 s - in
org.apache.phoenix.end2end.ColumnEncodedImmutableTxStatsCollectorIT
[WARNING] Tests run: 26, Failures: 0, Errors: 0, Skipped: 4, Time elapsed: 214.821 s - in
org.apache.phoenix.end2end.ColumnEncodedMutableNonTxStatsCollectorIT
[WARNING] Tests run: 26, Failures: 0, Errors: 0, Skipped: 4, Time elapsed: 220.62 s - in org.apache.phoenix.end2end.ColumnEncodedMutableTxStatsCollectorIT
[INFO] Tests run: 2, Failures: 0, Errors: 0, Skipped: 0, Time elapsed: 39.776 s - in org.apache.phoenix.end2end.DropSchemaIT
[INFO] Tests run: 12, Failures: 0, Errors: 0, Skipped: 0, Time elapsed: 125.007 s - in org.apache.phoenix.end2end.CsvBulkLoadToolIT
[INFO] Running org.apache.phoenix.end2end.IndexExtendedIT
[INFO] Running org.apache.phoenix.end2end.IndexScrutinyToolIT
[INFO] Running org.apache.phoenix.end2end.IndexToolForPartialBuildIT
[INFO] Running org.apache.phoenix.end2end.FlappingLocalIndexIT
[INFO] Running org.apache.phoenix.end2end.IndexToolForPartialBuildWithNamespaceEnabledIT
[INFO] Tests run: 1, Failures: 0, Errors: 0, Skipped: 0, Time elapsed: 16.01 s - in org.apache.phoenix.end2end.IndexToolForPartialBuildIT
[INFO] Tests run: 2, Failures: 0, Errors: 0, Skipped: 0, Time elapsed: 30.014 s - in org.apache.phoenix.end2end.IndexToolForPartialBuildWithNamespaceEnabledIT
[INFO] Running org.apache.phoenix.end2end.IndexToolIT
[INFO] Running org.apache.phoenix.end2end.MigrateSystemTablesToSystemNamespaceIT
[INFO] Running org.apache.phoenix.end2end.LocalIndexSplitMergeIT
[INFO] Tests run: 32, Failures: 0, Errors: 0, Skipped: 0, Time elapsed: 204.588 s - in org.apache.phoenix.end2end.IndexExtendedIT
[INFO] Tests run: 12, Failures: 0, Errors: 0, Skipped: 0, Time elapsed: 203.664 s - in org.apache.phoenix.end2end.FlappingLocalIndexIT
[INFO] Running org.apache.phoenix.end2end.NonColumnEncodedImmutableTxStatsCollectorIT
[INFO] Running org.apache.phoenix.end2end.NonColumnEncodedImmutableNonTxStatsCollectorIT
[INFO] Tests run: 20, Failures: 0, Errors: 0, Skipped: 0, Time elapsed: 544.905 s - in org.apache.phoenix.end2end.CostBasedDecisionIT
[INFO] Running org.apache.phoenix.end2end.PartialResultServerConfigurationIT
[INFO] Tests run: 4, Failures: 0, Errors: 0, Skipped: 0, Time elapsed: 408.597 s - in org.apache.phoenix.end2end.MigrateSystemTablesToSystemNamespaceIT
[INFO] Tests run: 1, Failures: 0, Errors: 0, Skipped: 0, Time elapsed: 62.37 s - in org.apache.phoenix.end2end.PartialResultServerConfigurationIT
[WARNING] Tests run: 26, Failures: 0, Errors: 0, Skipped: 4, Time elapsed: 192.69 s - in org.apache.phoenix.end2end.NonColumnEncodedImmutableTxStatsCollectorIT
[WARNING] Tests run: 26, Failures: 0, Errors: 0, Skipped: 4, Time elapsed: 193.363 s - in
org.apache.phoenix.end2end.NonColumnEncodedImmutableNonTxStatsCollectorIT
[INFO] Running org.apache.phoenix.end2end.PhoenixDriverIT
[INFO] Tests run: 33, Failures: 0, Errors: 0, Skipped: 0, Time elapsed: 487.29 s - in org.apache.phoenix.end2end.IndexScrutinyToolIT
[INFO] Tests run: 3, Failures: 0, Errors: 0, Skipped: 0, Time elapsed: 424.207 s - in org.apache.phoenix.end2end.LocalIndexSplitMergeIT
[INFO] Running org.apache.phoenix.end2end.QueryLoggerIT
[INFO] Running org.apache.phoenix.end2end.QueryTimeoutIT
[INFO] Running org.apache.phoenix.end2end.QueryWithLimitIT
[INFO] Tests run: 2, Failures: 0, Errors: 0, Skipped: 0, Time elapsed: 7.811 s - in org.apache.phoenix.end2end.QueryWithLimitIT
[INFO] Tests run: 2, Failures: 0, Errors: 0, Skipped: 0, Time elapsed: 14.234 s - in org.apache.phoenix.end2end.QueryTimeoutIT
[INFO] Tests run: 4, Failures: 0, Errors: 0, Skipped: 0, Time elapsed: 91.621 s - in org.apache.phoenix.end2end.PhoenixDriverIT
[INFO] Running org.apache.phoenix.end2end.RebuildIndexConnectionPropsIT
[INFO] Tests run: 1, Failures: 0, Errors: 0, Skipped: 0, Time elapsed: 0.663 s - in org.apache.phoenix.end2end.RebuildIndexConnectionPropsIT
[INFO] Running org.apache.phoenix.end2end.SystemTablePermissionsIT
[INFO] Running org.apache.phoenix.end2end.RegexBulkLoadToolIT
[INFO] Tests run: 7, Failures: 0, Errors: 0, Skipped: 0, Time elapsed: 62.883 s - in org.apache.phoenix.end2end.QueryLoggerIT
[INFO] Running org.apache.phoenix.end2end.TableDDLPermissionsIT
[INFO] Running org.apache.phoenix.end2end.RenewLeaseIT
[INFO] Running org.apache.phoenix.end2end.SpillableGroupByIT
[INFO] Running org.apache.phoenix.end2end.SysTableNamespaceMappedStatsCollectorIT
[INFO] Tests run: 1, Failures: 0, Errors: 0, Skipped: 0, Time elapsed: 28.636 s - in org.apache.phoenix.end2end.RenewLeaseIT
[INFO] Tests run: 3, Failures: 0, Errors: 0, Skipped: 0, Time elapsed: 17.838 s - in org.apache.phoenix.end2end.SpillableGroupByIT
[INFO] Tests run: 10, Failures: 0, Errors: 0, Skipped: 0, Time elapsed: 98.502 s - in org.apache.phoenix.end2end.RegexBulkLoadToolIT
[INFO] Running org.apache.phoenix.end2end.TableSnapshotReadsMapReduceIT
[INFO] Tests run: 2, Failures: 0, Errors: 0, Skipped: 0, Time elapsed: 145.384 s - in org.apache.phoenix.end2end.SystemTablePermissionsIT
[INFO] Running org.apache.phoenix.end2end.UpdateCacheAcrossDifferentClientsIT
[INFO] Tests run: 3, Failures: 0, Errors: 0, Skipped: 0, Time elapsed: 29.665 s - in org.apache.phoenix.end2end.TableSnapshotReadsMapReduceIT
[INFO] Running org.apache.phoenix.end2end.UserDefinedFunctionsIT
[INFO] Tests run: 12, Failures: 0, Errors: 0, Skipped: 0, Time elapsed: 1,157.632 s - in org.apache.phoenix.end2end.ChangePermissionsIT
[INFO] Tests run: 6, Failures: 0, Errors: 0, Skipped: 0, Time elapsed: 58.323 s - in org.apache.phoenix.end2end.UpdateCacheAcrossDifferentClientsIT
[INFO] Running org.apache.phoenix.end2end.index.ImmutableIndexIT
[WARNING] Tests run: 26, Failures: 0, Errors: 0, Skipped: 4, Time elapsed: 169.084 s - in
org.apache.phoenix.end2end.SysTableNamespaceMappedStatsCollectorIT
[INFO] Running org.apache.phoenix.end2end.index.LocalIndexIT
[INFO] Running org.apache.phoenix.end2end.index.MutableIndexFailureIT
[INFO] Running org.apache.phoenix.end2end.index.MutableIndexReplicationIT
[INFO] Running org.apache.phoenix.end2end.index.PartialIndexRebuilderIT
[INFO] Tests run: 1, Failures: 0, Errors: 0, Skipped: 0, Time elapsed: 43.837 s - in org.apache.phoenix.end2end.index.MutableIndexReplicationIT
[INFO] Tests run: 16, Failures: 0, Errors: 0, Skipped: 0, Time elapsed: 181.262 s - in org.apache.phoenix.end2end.UserDefinedFunctionsIT
[INFO] Running org.apache.phoenix.end2end.index.txn.TxWriteFailureIT
[INFO] Running org.apache.phoenix.execute.PartialCommitIT
[INFO] Tests run: 8, Failures: 0, Errors: 0, Skipped: 0, Time elapsed: 61.925 s - in org.apache.phoenix.end2end.index.txn.TxWriteFailureIT
[INFO] Tests run: 12, Failures: 0, Errors: 0, Skipped: 0, Time elapsed: 1.091 s - in org.apache.phoenix.execute.PartialCommitIT
[INFO] Running org.apache.phoenix.hbase.index.FailForUnsupportedHBaseVersionsIT
[INFO] Tests run: 64, Failures: 0, Errors: 0, Skipped: 0, Time elapsed: 1,054.848 s - in org.apache.phoenix.end2end.IndexToolIT
[INFO] Tests run: 2, Failures: 0, Errors: 0, Skipped: 0, Time elapsed: 36.866 s - in org.apache.phoenix.hbase.index.FailForUnsupportedHBaseVersionsIT
[INFO] Running org.apache.phoenix.execute.UpsertSelectOverlappingBatchesIT
[INFO] Running org.apache.phoenix.iterate.RoundRobinResultIteratorWithStatsIT
[INFO] Running org.apache.phoenix.iterate.ScannerLeaseRenewalIT
[INFO] Tests run: 1, Failures: 0, Errors: 0, Skipped: 0, Time elapsed: 9.752 s - in org.apache.phoenix.iterate.RoundRobinResultIteratorWithStatsIT
[INFO] Tests run: 3, Failures: 0, Errors: 0, Skipped: 0, Time elapsed: 83.567 s - in org.apache.phoenix.execute.UpsertSelectOverlappingBatchesIT
[INFO] Tests run: 4, Failures: 0, Errors: 0, Skipped: 0, Time elapsed: 604.538 s - in org.apache.phoenix.end2end.TableDDLPermissionsIT
[ERROR] Tests run: 25, Failures: 4, Errors: 0, Skipped: 4, Time elapsed: 322.903 s <<<
FAILURE! - in org.apache.phoenix.end2end.index.PartialIndexRebuilderIT
[ERROR] testWriteWhileRebuilding(org.apache.phoenix.end2end.index.PartialIndexRebuilderIT)
 Time elapsed: 32.29 s  <<< FAILURE!
java.lang.AssertionError: Expected equality for V2, but null!=2
	at org.apache.phoenix.end2end.index.PartialIndexRebuilderIT.testWriteWhileRebuilding(PartialIndexRebuilderIT.java:396)

[ERROR] testConcurrentUpsertsWithRebuild(org.apache.phoenix.end2end.index.PartialIndexRebuilderIT)
 Time elapsed: 39.038 s  <<< FAILURE!
java.lang.AssertionError: Expected equality for V1, but null!=11
	at org.apache.phoenix.end2end.index.PartialIndexRebuilderIT.testConcurrentUpsertsWithRebuild(PartialIndexRebuilderIT.java:230)

[ERROR] testDeleteAndUpsertAfterFailure-1(org.apache.phoenix.end2end.index.PartialIndexRebuilderIT)
 Time elapsed: 22.614 s  <<< FAILURE!
java.lang.AssertionError: Expected equality for V2, but null!=1
	at org.apache.phoenix.end2end.index.PartialIndexRebuilderIT.testDeleteAndUpsertAfterFailure(PartialIndexRebuilderIT.java:347)

[ERROR] testDeleteAndUpsertAfterFailure [5 times]  Time elapsed: 21.471 s  <<< FAILURE!
java.lang.AssertionError: Expected equality for V2, but null!=0

[INFO] Running org.apache.phoenix.monitoring.PhoenixMetricsIT
[WARNING] Tests run: 40, Failures: 0, Errors: 0, Skipped: 16, Time elapsed: 438.267 s - in
org.apache.phoenix.end2end.index.ImmutableIndexIT
[INFO] Running org.apache.phoenix.rpc.PhoenixClientRpcIT
[INFO] Running org.apache.phoenix.rpc.PhoenixServerRpcIT
[INFO] Tests run: 2, Failures: 0, Errors: 0, Skipped: 0, Time elapsed: 9.626 s - in org.apache.phoenix.rpc.PhoenixClientRpcIT
[INFO] Tests run: 2, Failures: 0, Errors: 0, Skipped: 0, Time elapsed: 19.921 s - in org.apache.phoenix.rpc.PhoenixServerRpcIT
[INFO] Tests run: 21, Failures: 0, Errors: 0, Skipped: 0, Time elapsed: 464.308 s - in org.apache.phoenix.end2end.index.MutableIndexFailureIT
[INFO] Tests run: 36, Failures: 0, Errors: 0, Skipped: 0, Time elapsed: 510.039 s - in org.apache.phoenix.end2end.index.LocalIndexIT
[INFO] Tests run: 2, Failures: 0, Errors: 0, Skipped: 0, Time elapsed: 169.474 s - in org.apache.phoenix.iterate.ScannerLeaseRenewalIT
[INFO] Tests run: 22, Failures: 0, Errors: 0, Skipped: 0, Time elapsed: 117.173 s - in org.apache.phoenix.monitoring.PhoenixMetricsIT
[INFO] 
[INFO] Results:
[INFO] 
[ERROR] Failures: 
[ERROR]   PartialIndexRebuilderIT.testConcurrentUpsertsWithRebuild:230 Expected equality for
V1, but null!=11
[ERROR]   PartialIndexRebuilderIT.testDeleteAndUpsertAfterFailure:347 Expected equality for
V2, but null!=1
[ERROR]   PartialIndexRebuilderIT.testWriteWhileRebuilding:396 Expected equality for V2, but
null!=2
[ERROR]   Expected equality for V2, but null!=0
[INFO] 
[ERROR] Tests run: 625, Failures: 4, Errors: 0, Skipped: 48
[INFO] 
[INFO] 
[INFO] --- maven-failsafe-plugin:2.20:verify (ParallelStatsEnabledTest) @ phoenix-core ---
[INFO] ------------------------------------------------------------------------
[INFO] Reactor Summary:
[INFO] 
[INFO] Apache Phoenix ..................................... SUCCESS [  3.325 s]
[INFO] Phoenix Core ....................................... FAILURE [  02:08 h]
[INFO] Phoenix - Flume .................................... SKIPPED
[INFO] Phoenix - Kafka .................................... SKIPPED
[INFO] Phoenix - Pig ...................................... SKIPPED
[INFO] Phoenix Query Server Client ........................ SKIPPED
[INFO] Phoenix Query Server ............................... SKIPPED
[INFO] Phoenix - Pherf .................................... SKIPPED
[INFO] Phoenix - Spark .................................... SKIPPED
[INFO] Phoenix - Hive ..................................... SKIPPED
[INFO] Phoenix Client ..................................... SKIPPED
[INFO] Phoenix Server ..................................... SKIPPED
[INFO] Phoenix Assembly ................................... SKIPPED
[INFO] Phoenix - Tracing Web Application .................. SKIPPED
[INFO] Phoenix Load Balancer .............................. SKIPPED
[INFO] ------------------------------------------------------------------------
[INFO] BUILD FAILURE
[INFO] ------------------------------------------------------------------------
[INFO] Total time: 02:08 h
[INFO] Finished at: 2018-04-13T06:04:04Z
[INFO] Final Memory: 66M/1354M
[INFO] ------------------------------------------------------------------------
[ERROR] Failed to execute goal org.apache.maven.plugins:maven-failsafe-plugin:2.20:verify
(ParallelStatsEnabledTest) on project phoenix-core: There are test failures.
[ERROR] 
[ERROR] Please refer to <https://builds.apache.org/job/Phoenix-master/ws/phoenix-core/target/failsafe-reports>
for the individual test results.
[ERROR] Please refer to dump files (if any exist) [date]-jvmRun[N].dump, [date].dumpstream
and [date]-jvmRun[N].dumpstream.
[ERROR] -> [Help 1]
[ERROR] 
[ERROR] To see the full stack trace of the errors, re-run Maven with the -e switch.
[ERROR] Re-run Maven using the -X switch to enable full debug logging.
[ERROR] 
[ERROR] For more information about the errors and possible solutions, please read the following
articles:
[ERROR] [Help 1] http://cwiki.apache.org/confluence/display/MAVEN/MojoFailureException
[ERROR] 
[ERROR] After correcting the problems, you can resume the build with the command
[ERROR]   mvn <goals> -rf :phoenix-core
Build step 'Invoke top-level Maven targets' marked build as failure
Archiving artifacts
Recording test results
Not sending mail to unregistered user ankitsinghal59@gmail.com

Mime
View raw message