phoenix-commits mailing list archives

Site index · List index
Message view « Date » · « Thread »
Top « Date » · « Thread »
From Apache Jenkins Server <jenk...@builds.apache.org>
Subject Build failed in Jenkins: Phoenix | 4.x-HBase-0.98 #1843
Date Wed, 28 Mar 2018 16:02:22 GMT
See <https://builds.apache.org/job/Phoenix-4.x-HBase-0.98/1843/display/redirect?page=changes>

Changes:

[elserj] PHOENIX-4675 Better parsing around the allowed UDF jar directory

------------------------------------------
[...truncated 119.75 KB...]
[INFO] -------------------------------------------------------
[INFO]  T E S T S
[INFO] -------------------------------------------------------
[INFO] Running org.apache.hadoop.hbase.regionserver.wal.WALReplayWithIndexWritesAndCompressedWALIT
[INFO] Tests run: 1, Failures: 0, Errors: 0, Skipped: 0, Time elapsed: 20.023 s - in org.apache.hadoop.hbase.regionserver.wal.WALReplayWithIndexWritesAndCompressedWALIT
[INFO] Running org.apache.hadoop.hbase.regionserver.wal.WALRecoveryRegionPostOpenIT
[INFO] Tests run: 1, Failures: 0, Errors: 0, Skipped: 0, Time elapsed: 3.447 s - in org.apache.hadoop.hbase.regionserver.wal.WALRecoveryRegionPostOpenIT
[INFO] Running org.apache.phoenix.end2end.ColumnEncodedImmutableNonTxStatsCollectorIT
[INFO] Running org.apache.phoenix.end2end.ColumnEncodedMutableNonTxStatsCollectorIT
[INFO] Running org.apache.phoenix.end2end.ColumnEncodedImmutableTxStatsCollectorIT
[INFO] Running org.apache.phoenix.end2end.ColumnEncodedMutableTxStatsCollectorIT
[INFO] Running org.apache.phoenix.end2end.ConnectionUtilIT
[INFO] Tests run: 1, Failures: 0, Errors: 0, Skipped: 0, Time elapsed: 20.772 s - in org.apache.phoenix.end2end.ConnectionUtilIT
[WARNING] Tests run: 26, Failures: 0, Errors: 0, Skipped: 4, Time elapsed: 76.458 s - in org.apache.phoenix.end2end.ColumnEncodedImmutableNonTxStatsCollectorIT
[WARNING] Tests run: 26, Failures: 0, Errors: 0, Skipped: 4, Time elapsed: 76.042 s - in org.apache.phoenix.end2end.ColumnEncodedMutableNonTxStatsCollectorIT
[WARNING] Tests run: 26, Failures: 0, Errors: 0, Skipped: 4, Time elapsed: 81.053 s - in org.apache.phoenix.end2end.ColumnEncodedImmutableTxStatsCollectorIT
[INFO] Running org.apache.phoenix.end2end.ContextClassloaderIT
[INFO] Tests run: 3, Failures: 0, Errors: 0, Skipped: 0, Time elapsed: 1.923 s - in org.apache.phoenix.end2end.ContextClassloaderIT
[WARNING] Tests run: 26, Failures: 0, Errors: 0, Skipped: 4, Time elapsed: 79.957 s - in org.apache.phoenix.end2end.ColumnEncodedMutableTxStatsCollectorIT
[INFO] Running org.apache.phoenix.end2end.CountDistinctCompressionIT
[INFO] Tests run: 1, Failures: 0, Errors: 0, Skipped: 0, Time elapsed: 2.895 s - in org.apache.phoenix.end2end.CountDistinctCompressionIT
[INFO] Running org.apache.phoenix.end2end.CsvBulkLoadToolIT
[INFO] Running org.apache.phoenix.end2end.CostBasedDecisionIT
[INFO] Running org.apache.phoenix.end2end.DropSchemaIT
[INFO] Tests run: 2, Failures: 0, Errors: 0, Skipped: 0, Time elapsed: 7.727 s - in org.apache.phoenix.end2end.DropSchemaIT
[INFO] Running org.apache.phoenix.end2end.FlappingLocalIndexIT
[INFO] Running org.apache.phoenix.end2end.IndexExtendedIT
[INFO] Running org.apache.phoenix.end2end.IndexScrutinyToolIT
[INFO] Tests run: 12, Failures: 0, Errors: 0, Skipped: 0, Time elapsed: 73.664 s - in org.apache.phoenix.end2end.CsvBulkLoadToolIT
[INFO] Running org.apache.phoenix.end2end.IndexToolForPartialBuildIT
[INFO] Tests run: 32, Failures: 0, Errors: 0, Skipped: 0, Time elapsed: 76.227 s - in org.apache.phoenix.end2end.IndexExtendedIT
[INFO] Tests run: 12, Failures: 0, Errors: 0, Skipped: 0, Time elapsed: 111.511 s - in org.apache.phoenix.end2end.FlappingLocalIndexIT
[INFO] Running org.apache.phoenix.end2end.IndexToolForPartialBuildWithNamespaceEnabledIT
[INFO] Running org.apache.phoenix.end2end.IndexToolIT
[INFO] Tests run: 20, Failures: 0, Errors: 0, Skipped: 0, Time elapsed: 286.067 s - in org.apache.phoenix.end2end.CostBasedDecisionIT
[INFO] Running org.apache.phoenix.end2end.LocalIndexSplitMergeIT
[INFO] Tests run: 33, Failures: 0, Errors: 0, Skipped: 0, Time elapsed: 313.141 s - in org.apache.phoenix.end2end.IndexScrutinyToolIT
[INFO] Running org.apache.phoenix.end2end.MigrateSystemTablesToSystemNamespaceIT
[INFO] Tests run: 3, Failures: 0, Errors: 0, Skipped: 0, Time elapsed: 74.759 s - in org.apache.phoenix.end2end.LocalIndexSplitMergeIT
[INFO] Running org.apache.phoenix.end2end.NonColumnEncodedImmutableNonTxStatsCollectorIT
[INFO] Tests run: 32, Failures: 0, Errors: 0, Skipped: 0, Time elapsed: 381.735 s - in org.apache.phoenix.end2end.IndexToolIT
[WARNING] Tests run: 26, Failures: 0, Errors: 0, Skipped: 4, Time elapsed: 92.675 s - in org.apache.phoenix.end2end.NonColumnEncodedImmutableNonTxStatsCollectorIT
[INFO] Running org.apache.phoenix.end2end.NonColumnEncodedImmutableTxStatsCollectorIT
[INFO] Running org.apache.phoenix.end2end.PhoenixDriverIT
[INFO] Tests run: 4, Failures: 0, Errors: 0, Skipped: 0, Time elapsed: 228.936 s - in org.apache.phoenix.end2end.MigrateSystemTablesToSystemNamespaceIT
[INFO] Tests run: 4, Failures: 0, Errors: 0, Skipped: 0, Time elapsed: 48.824 s - in org.apache.phoenix.end2end.PhoenixDriverIT
[INFO] Running org.apache.phoenix.end2end.QueryTimeoutIT
[INFO] Tests run: 2, Failures: 0, Errors: 0, Skipped: 0, Time elapsed: 9.533 s - in org.apache.phoenix.end2end.QueryTimeoutIT
[INFO] Tests run: 2, Failures: 0, Errors: 0, Skipped: 0, Time elapsed: 582.385 s - in org.apache.phoenix.end2end.IndexToolForPartialBuildIT
[WARNING] Tests run: 26, Failures: 0, Errors: 0, Skipped: 4, Time elapsed: 96.764 s - in org.apache.phoenix.end2end.NonColumnEncodedImmutableTxStatsCollectorIT
[INFO] Running org.apache.phoenix.end2end.QueryWithLimitIT
[INFO] Tests run: 2, Failures: 0, Errors: 0, Skipped: 0, Time elapsed: 4.745 s - in org.apache.phoenix.end2end.QueryWithLimitIT
[INFO] Running org.apache.phoenix.end2end.RebuildIndexConnectionPropsIT
[INFO] Tests run: 1, Failures: 0, Errors: 0, Skipped: 0, Time elapsed: 1.052 s - in org.apache.phoenix.end2end.RebuildIndexConnectionPropsIT
[INFO] Tests run: 2, Failures: 0, Errors: 0, Skipped: 0, Time elapsed: 577.259 s - in org.apache.phoenix.end2end.IndexToolForPartialBuildWithNamespaceEnabledIT
[INFO] Running org.apache.phoenix.end2end.RegexBulkLoadToolIT
[INFO] Running org.apache.phoenix.end2end.RenewLeaseIT
[INFO] Running org.apache.phoenix.end2end.SystemTablePermissionsIT
[INFO] Running org.apache.phoenix.end2end.SpillableGroupByIT
[INFO] Tests run: 1, Failures: 0, Errors: 0, Skipped: 0, Time elapsed: 25.595 s - in org.apache.phoenix.end2end.RenewLeaseIT
[INFO] Tests run: 3, Failures: 0, Errors: 0, Skipped: 0, Time elapsed: 8.661 s - in org.apache.phoenix.end2end.SpillableGroupByIT
[INFO] Running org.apache.phoenix.end2end.SysTableNamespaceMappedStatsCollectorIT
[INFO] Tests run: 10, Failures: 0, Errors: 0, Skipped: 0, Time elapsed: 59.301 s - in org.apache.phoenix.end2end.RegexBulkLoadToolIT
[INFO] Running org.apache.phoenix.end2end.TableSnapshotReadsMapReduceIT
[ERROR] Tests run: 2, Failures: 0, Errors: 1, Skipped: 0, Time elapsed: 76.428 s <<<
FAILURE! - in org.apache.phoenix.end2end.SystemTablePermissionsIT
[ERROR] testNamespaceMappedSystemTables(org.apache.phoenix.end2end.SystemTablePermissionsIT)
 Time elapsed: 38.435 s  <<< ERROR!
java.io.IOException: Shutting down
	at org.apache.phoenix.end2end.SystemTablePermissionsIT.testNamespaceMappedSystemTables(SystemTablePermissionsIT.java:162)
Caused by: java.lang.RuntimeException: Master not active after 30000 seconds
	at org.apache.phoenix.end2end.SystemTablePermissionsIT.testNamespaceMappedSystemTables(SystemTablePermissionsIT.java:162)

[INFO] Running org.apache.phoenix.end2end.UpdateCacheAcrossDifferentClientsIT
[INFO] Tests run: 3, Failures: 0, Errors: 0, Skipped: 0, Time elapsed: 17.689 s - in org.apache.phoenix.end2end.TableSnapshotReadsMapReduceIT
[INFO] Running org.apache.phoenix.end2end.UserDefinedFunctionsIT
[INFO] Tests run: 6, Failures: 0, Errors: 0, Skipped: 0, Time elapsed: 20.876 s - in org.apache.phoenix.end2end.UpdateCacheAcrossDifferentClientsIT
[INFO] Running org.apache.phoenix.end2end.index.ImmutableIndexIT
[INFO] Running org.apache.phoenix.end2end.index.LocalIndexIT
[INFO] Running org.apache.phoenix.end2end.index.MutableIndexFailureIT
[INFO] Tests run: 16, Failures: 0, Errors: 0, Skipped: 0, Time elapsed: 98.963 s - in org.apache.phoenix.end2end.UserDefinedFunctionsIT
[INFO] Running org.apache.phoenix.end2end.index.MutableIndexReplicationIT
[INFO] Tests run: 1, Failures: 0, Errors: 0, Skipped: 0, Time elapsed: 17.065 s - in org.apache.phoenix.end2end.index.MutableIndexReplicationIT
[INFO] Running org.apache.phoenix.end2end.index.PartialIndexRebuilderIT
[INFO] Tests run: 21, Failures: 0, Errors: 0, Skipped: 0, Time elapsed: 245.348 s - in org.apache.phoenix.end2end.index.MutableIndexFailureIT
[WARNING] Tests run: 40, Failures: 0, Errors: 0, Skipped: 16, Time elapsed: 309.459 s - in
org.apache.phoenix.end2end.index.ImmutableIndexIT
[INFO] Tests run: 36, Failures: 0, Errors: 0, Skipped: 0, Time elapsed: 317.859 s - in org.apache.phoenix.end2end.index.LocalIndexIT
[INFO] Running org.apache.phoenix.end2end.index.txn.TxWriteFailureIT
[INFO] Tests run: 25, Failures: 0, Errors: 0, Skipped: 0, Time elapsed: 202.987 s - in org.apache.phoenix.end2end.index.PartialIndexRebuilderIT
[INFO] Running org.apache.phoenix.execute.UpsertSelectOverlappingBatchesIT
[INFO] Running org.apache.phoenix.hbase.index.FailForUnsupportedHBaseVersionsIT
[INFO] Tests run: 8, Failures: 0, Errors: 0, Skipped: 0, Time elapsed: 45.232 s - in org.apache.phoenix.end2end.index.txn.TxWriteFailureIT
[INFO] Running org.apache.phoenix.execute.PartialCommitIT
[INFO] Tests run: 12, Failures: 0, Errors: 0, Skipped: 0, Time elapsed: 0.943 s - in org.apache.phoenix.execute.PartialCommitIT
[INFO] Tests run: 2, Failures: 0, Errors: 0, Skipped: 0, Time elapsed: 21.555 s - in org.apache.phoenix.hbase.index.FailForUnsupportedHBaseVersionsIT
[INFO] Running org.apache.phoenix.iterate.RoundRobinResultIteratorWithStatsIT
[INFO] Tests run: 1, Failures: 0, Errors: 0, Skipped: 0, Time elapsed: 7.633 s - in org.apache.phoenix.iterate.RoundRobinResultIteratorWithStatsIT
[INFO] Running org.apache.phoenix.iterate.ScannerLeaseRenewalIT
[INFO] Running org.apache.phoenix.monitoring.PhoenixMetricsIT
[INFO] Running org.apache.phoenix.rpc.PhoenixClientRpcIT
[INFO] Tests run: 2, Failures: 0, Errors: 0, Skipped: 0, Time elapsed: 3.25 s - in org.apache.phoenix.rpc.PhoenixClientRpcIT
[INFO] Tests run: 22, Failures: 0, Errors: 0, Skipped: 0, Time elapsed: 68.681 s - in org.apache.phoenix.monitoring.PhoenixMetricsIT
[INFO] Running org.apache.phoenix.rpc.PhoenixServerRpcIT
[INFO] Tests run: 2, Failures: 0, Errors: 0, Skipped: 0, Time elapsed: 11.065 s - in org.apache.phoenix.rpc.PhoenixServerRpcIT
[INFO] Tests run: 3, Failures: 0, Errors: 0, Skipped: 0, Time elapsed: 160.749 s - in org.apache.phoenix.execute.UpsertSelectOverlappingBatchesIT
[INFO] Tests run: 2, Failures: 0, Errors: 0, Skipped: 0, Time elapsed: 162.119 s - in org.apache.phoenix.iterate.ScannerLeaseRenewalIT
[ERROR] Tests run: 26, Failures: 0, Errors: 18, Skipped: 4, Time elapsed: 855.683 s <<<
FAILURE! - in org.apache.phoenix.end2end.SysTableNamespaceMappedStatsCollectorIT
[ERROR] testRowCountAndByteCounts[mutable = true, transactional = true, isUserTableNamespaceMapped
= false, columnEncoded = false](org.apache.phoenix.end2end.SysTableNamespaceMappedStatsCollectorIT)
 Time elapsed: 46.148 s  <<< ERROR!
java.lang.RuntimeException: org.apache.thrift.TException: Unable to discover transaction service.
Caused by: org.apache.thrift.TException: Unable to discover transaction service.

[ERROR] testSomeUpdateEmptyStats[mutable = true, transactional = true, isUserTableNamespaceMapped
= false, columnEncoded = false](org.apache.phoenix.end2end.SysTableNamespaceMappedStatsCollectorIT)
 Time elapsed: 46.128 s  <<< ERROR!
java.lang.RuntimeException: org.apache.thrift.TException: Unable to discover transaction service.
Caused by: org.apache.thrift.TException: Unable to discover transaction service.

[ERROR] testUpdateStatsWithMultipleTables[mutable = true, transactional = true, isUserTableNamespaceMapped
= false, columnEncoded = false](org.apache.phoenix.end2end.SysTableNamespaceMappedStatsCollectorIT)
 Time elapsed: 46.124 s  <<< ERROR!
java.lang.RuntimeException: org.apache.thrift.TException: Unable to discover transaction service.
Caused by: org.apache.thrift.TException: Unable to discover transaction service.

[ERROR] testUpdateStats[mutable = true, transactional = true, isUserTableNamespaceMapped =
false, columnEncoded = false](org.apache.phoenix.end2end.SysTableNamespaceMappedStatsCollectorIT)
 Time elapsed: 46.126 s  <<< ERROR!
java.lang.RuntimeException: org.apache.thrift.TException: Unable to discover transaction service.
Caused by: org.apache.thrift.TException: Unable to discover transaction service.

[ERROR] testGuidePostWidthUsedInDefaultStatsCollector[mutable = true, transactional = true,
isUserTableNamespaceMapped = false, columnEncoded = false](org.apache.phoenix.end2end.SysTableNamespaceMappedStatsCollectorIT)
 Time elapsed: 46.101 s  <<< ERROR!
java.lang.RuntimeException: org.apache.thrift.TException: Unable to discover transaction service.
Caused by: org.apache.thrift.TException: Unable to discover transaction service.

[ERROR] testNoDuplicatesAfterUpdateStatsWithDesc[mutable = true, transactional = true, isUserTableNamespaceMapped
= false, columnEncoded = false](org.apache.phoenix.end2end.SysTableNamespaceMappedStatsCollectorIT)
 Time elapsed: 46.12 s  <<< ERROR!
java.lang.RuntimeException: org.apache.thrift.TException: Unable to discover transaction service.
Caused by: org.apache.thrift.TException: Unable to discover transaction service.

[ERROR] testNoDuplicatesAfterUpdateStatsWithSplits[mutable = true, transactional = true, isUserTableNamespaceMapped
= false, columnEncoded = false](org.apache.phoenix.end2end.SysTableNamespaceMappedStatsCollectorIT)
 Time elapsed: 46.132 s  <<< ERROR!
java.lang.RuntimeException: org.apache.thrift.TException: Unable to discover transaction service.
Caused by: org.apache.thrift.TException: Unable to discover transaction service.

[ERROR] testUpdateEmptyStats[mutable = true, transactional = true, isUserTableNamespaceMapped
= false, columnEncoded = false](org.apache.phoenix.end2end.SysTableNamespaceMappedStatsCollectorIT)
 Time elapsed: 46.12 s  <<< ERROR!
java.lang.RuntimeException: org.apache.thrift.TException: Unable to discover transaction service.
Caused by: org.apache.thrift.TException: Unable to discover transaction service.

[ERROR] testWithMultiCF[mutable = true, transactional = true, isUserTableNamespaceMapped =
false, columnEncoded = false](org.apache.phoenix.end2end.SysTableNamespaceMappedStatsCollectorIT)
 Time elapsed: 46.383 s  <<< ERROR!
java.lang.RuntimeException: org.apache.thrift.TException: Unable to discover transaction service.
Caused by: org.apache.thrift.TException: Unable to discover transaction service.

[ERROR] testRowCountAndByteCounts[mutable = true, transactional = true, isUserTableNamespaceMapped
= false, columnEncoded = true](org.apache.phoenix.end2end.SysTableNamespaceMappedStatsCollectorIT)
 Time elapsed: 46.119 s  <<< ERROR!
java.lang.RuntimeException: org.apache.thrift.TException: Unable to discover transaction service.
Caused by: org.apache.thrift.TException: Unable to discover transaction service.

[ERROR] testSomeUpdateEmptyStats[mutable = true, transactional = true, isUserTableNamespaceMapped
= false, columnEncoded = true](org.apache.phoenix.end2end.SysTableNamespaceMappedStatsCollectorIT)
 Time elapsed: 46.123 s  <<< ERROR!
java.lang.RuntimeException: org.apache.thrift.TException: Unable to discover transaction service.
Caused by: org.apache.thrift.TException: Unable to discover transaction service.

[ERROR] testUpdateStatsWithMultipleTables[mutable = true, transactional = true, isUserTableNamespaceMapped
= false, columnEncoded = true](org.apache.phoenix.end2end.SysTableNamespaceMappedStatsCollectorIT)
 Time elapsed: 46.122 s  <<< ERROR!
java.lang.RuntimeException: org.apache.thrift.TException: Unable to discover transaction service.
Caused by: org.apache.thrift.TException: Unable to discover transaction service.

[ERROR] testUpdateStats[mutable = true, transactional = true, isUserTableNamespaceMapped =
false, columnEncoded = true](org.apache.phoenix.end2end.SysTableNamespaceMappedStatsCollectorIT)
 Time elapsed: 46.125 s  <<< ERROR!
java.lang.RuntimeException: org.apache.thrift.TException: Unable to discover transaction service.
Caused by: org.apache.thrift.TException: Unable to discover transaction service.

[ERROR] testGuidePostWidthUsedInDefaultStatsCollector[mutable = true, transactional = true,
isUserTableNamespaceMapped = false, columnEncoded = true](org.apache.phoenix.end2end.SysTableNamespaceMappedStatsCollectorIT)
 Time elapsed: 46.128 s  <<< ERROR!
java.lang.RuntimeException: org.apache.thrift.TException: Unable to discover transaction service.
Caused by: org.apache.thrift.TException: Unable to discover transaction service.

[ERROR] testNoDuplicatesAfterUpdateStatsWithDesc[mutable = true, transactional = true, isUserTableNamespaceMapped
= false, columnEncoded = true](org.apache.phoenix.end2end.SysTableNamespaceMappedStatsCollectorIT)
 Time elapsed: 46.128 s  <<< ERROR!
java.lang.RuntimeException: org.apache.thrift.TException: Unable to discover transaction service.
Caused by: org.apache.thrift.TException: Unable to discover transaction service.

[ERROR] testNoDuplicatesAfterUpdateStatsWithSplits[mutable = true, transactional = true, isUserTableNamespaceMapped
= false, columnEncoded = true](org.apache.phoenix.end2end.SysTableNamespaceMappedStatsCollectorIT)
 Time elapsed: 46.125 s  <<< ERROR!
java.lang.RuntimeException: org.apache.thrift.TException: Unable to discover transaction service.
Caused by: org.apache.thrift.TException: Unable to discover transaction service.

[ERROR] testUpdateEmptyStats[mutable = true, transactional = true, isUserTableNamespaceMapped
= false, columnEncoded = true](org.apache.phoenix.end2end.SysTableNamespaceMappedStatsCollectorIT)
 Time elapsed: 46.124 s  <<< ERROR!
java.lang.RuntimeException: org.apache.thrift.TException: Unable to discover transaction service.
Caused by: org.apache.thrift.TException: Unable to discover transaction service.

[ERROR] testWithMultiCF[mutable = true, transactional = true, isUserTableNamespaceMapped =
false, columnEncoded = true](org.apache.phoenix.end2end.SysTableNamespaceMappedStatsCollectorIT)
 Time elapsed: 46.126 s  <<< ERROR!
java.lang.RuntimeException: org.apache.thrift.TException: Unable to discover transaction service.
Caused by: org.apache.thrift.TException: Unable to discover transaction service.

[INFO] 
[INFO] Results:
[INFO] 
[ERROR] Errors: 
[ERROR]   SysTableNamespaceMappedStatsCollectorIT>StatsCollectorIT.testGuidePostWidthUsedInDefaultStatsCollector:747->BaseTest.createTestTable:763->BaseTest.createTestTable:799
» Runtime
[ERROR]   SysTableNamespaceMappedStatsCollectorIT>StatsCollectorIT.testGuidePostWidthUsedInDefaultStatsCollector:747->BaseTest.createTestTable:763->BaseTest.createTestTable:799
» Runtime
[ERROR]   SysTableNamespaceMappedStatsCollectorIT>StatsCollectorIT.testNoDuplicatesAfterUpdateStatsWithDesc:275->StatsCollectorIT.testNoDuplicatesAfterUpdateStats:251
» Runtime
[ERROR]   SysTableNamespaceMappedStatsCollectorIT>StatsCollectorIT.testNoDuplicatesAfterUpdateStatsWithDesc:275->StatsCollectorIT.testNoDuplicatesAfterUpdateStats:251
» Runtime
[ERROR]   SysTableNamespaceMappedStatsCollectorIT>StatsCollectorIT.testNoDuplicatesAfterUpdateStatsWithSplits:270->StatsCollectorIT.testNoDuplicatesAfterUpdateStats:251
» Runtime
[ERROR]   SysTableNamespaceMappedStatsCollectorIT>StatsCollectorIT.testNoDuplicatesAfterUpdateStatsWithSplits:270->StatsCollectorIT.testNoDuplicatesAfterUpdateStats:251
» Runtime
[ERROR]   SysTableNamespaceMappedStatsCollectorIT>StatsCollectorIT.testRowCountAndByteCounts:607
» Runtime
[ERROR]   SysTableNamespaceMappedStatsCollectorIT>StatsCollectorIT.testRowCountAndByteCounts:607
» Runtime
[ERROR]   SysTableNamespaceMappedStatsCollectorIT>StatsCollectorIT.testSomeUpdateEmptyStats:181
» Runtime
[ERROR]   SysTableNamespaceMappedStatsCollectorIT>StatsCollectorIT.testSomeUpdateEmptyStats:181
» Runtime
[ERROR]   SysTableNamespaceMappedStatsCollectorIT>StatsCollectorIT.testUpdateEmptyStats:165
» Runtime
[ERROR]   SysTableNamespaceMappedStatsCollectorIT>StatsCollectorIT.testUpdateEmptyStats:165
» Runtime
[ERROR]   SysTableNamespaceMappedStatsCollectorIT>StatsCollectorIT.testUpdateStatsWithMultipleTables:286
» Runtime
[ERROR]   SysTableNamespaceMappedStatsCollectorIT>StatsCollectorIT.testUpdateStatsWithMultipleTables:286
» Runtime
[ERROR]   SysTableNamespaceMappedStatsCollectorIT>StatsCollectorIT.testUpdateStats:221
» Runtime
[ERROR]   SysTableNamespaceMappedStatsCollectorIT>StatsCollectorIT.testUpdateStats:221
» Runtime
[ERROR]   SysTableNamespaceMappedStatsCollectorIT>StatsCollectorIT.testWithMultiCF:510
» Runtime
[ERROR]   SysTableNamespaceMappedStatsCollectorIT>StatsCollectorIT.testWithMultiCF:510
» Runtime
[ERROR]   SystemTablePermissionsIT.testNamespaceMappedSystemTables:162 » IO Shutting dow...
[INFO] 
[ERROR] Tests run: 570, Failures: 0, Errors: 19, Skipped: 44
[INFO] 
[INFO] 
[INFO] --- maven-failsafe-plugin:2.20:verify (ParallelStatsEnabledTest) @ phoenix-core ---
[INFO] ------------------------------------------------------------------------
[INFO] Reactor Summary:
[INFO] 
[INFO] Apache Phoenix ..................................... SUCCESS [  2.867 s]
[INFO] Phoenix Core ....................................... FAILURE [  01:37 h]
[INFO] Phoenix - Flume .................................... SKIPPED
[INFO] Phoenix - Kafka .................................... SKIPPED
[INFO] Phoenix - Pig ...................................... SKIPPED
[INFO] Phoenix Query Server Client ........................ SKIPPED
[INFO] Phoenix Query Server ............................... SKIPPED
[INFO] Phoenix - Pherf .................................... SKIPPED
[INFO] Phoenix - Spark .................................... SKIPPED
[INFO] Phoenix - Hive ..................................... SKIPPED
[INFO] Phoenix Client ..................................... SKIPPED
[INFO] Phoenix Server ..................................... SKIPPED
[INFO] Phoenix Assembly ................................... SKIPPED
[INFO] Phoenix - Tracing Web Application .................. SKIPPED
[INFO] Phoenix Load Balancer .............................. SKIPPED
[INFO] ------------------------------------------------------------------------
[INFO] BUILD FAILURE
[INFO] ------------------------------------------------------------------------
[INFO] Total time: 01:37 h
[INFO] Finished at: 2018-03-28T15:54:44Z
[INFO] Final Memory: 61M/792M
[INFO] ------------------------------------------------------------------------
[ERROR] Failed to execute goal org.apache.maven.plugins:maven-failsafe-plugin:2.20:verify
(ParallelStatsEnabledTest) on project phoenix-core: There are test failures.
[ERROR] 
[ERROR] Please refer to <https://builds.apache.org/job/Phoenix-4.x-HBase-0.98/ws/phoenix-core/target/failsafe-reports>
for the individual test results.
[ERROR] Please refer to dump files (if any exist) [date]-jvmRun[N].dump, [date].dumpstream
and [date]-jvmRun[N].dumpstream.
[ERROR] -> [Help 1]
[ERROR] 
[ERROR] To see the full stack trace of the errors, re-run Maven with the -e switch.
[ERROR] Re-run Maven using the -X switch to enable full debug logging.
[ERROR] 
[ERROR] For more information about the errors and possible solutions, please read the following
articles:
[ERROR] [Help 1] http://cwiki.apache.org/confluence/display/MAVEN/MojoFailureException
[ERROR] 
[ERROR] After correcting the problems, you can resume the build with the command
[ERROR]   mvn <goals> -rf :phoenix-core
Build step 'Invoke top-level Maven targets' marked build as failure
Archiving artifacts
[Fast Archiver] Compressed 1.50 GB of artifacts by 24.1% relative to #1841
[JIRA] Updating issue PHOENIX-4675
Recording test results

Mime
View raw message