phoenix-commits mailing list archives

Site index · List index
Message view « Date » · « Thread »
Top « Date » · « Thread »
From Apache Jenkins Server <jenk...@builds.apache.org>
Subject Build failed in Jenkins: Phoenix-4.x-HBase-1.2 #301
Date Fri, 23 Mar 2018 04:49:30 GMT
See <https://builds.apache.org/job/Phoenix-4.x-HBase-1.2/301/display/redirect?page=changes>

Changes:

[elserj] PHOENIX-4662 Avoid NPE when server-caches are null (Csaba Skrabak)

------------------------------------------
[...truncated 541.56 KB...]
[INFO] Running org.apache.phoenix.end2end.CsvBulkLoadToolIT
[INFO] Running org.apache.phoenix.end2end.DropSchemaIT
[WARNING] Tests run: 26, Failures: 0, Errors: 0, Skipped: 4, Time elapsed: 178.847 s - in
org.apache.phoenix.end2end.ColumnEncodedMutableTxStatsCollectorIT
[WARNING] Tests run: 26, Failures: 0, Errors: 0, Skipped: 4, Time elapsed: 183.99 s - in org.apache.phoenix.end2end.ColumnEncodedImmutableNonTxStatsCollectorIT
[WARNING] Tests run: 26, Failures: 0, Errors: 0, Skipped: 4, Time elapsed: 189.722 s - in
org.apache.phoenix.end2end.ColumnEncodedMutableNonTxStatsCollectorIT
[WARNING] Tests run: 26, Failures: 0, Errors: 0, Skipped: 4, Time elapsed: 194.058 s - in
org.apache.phoenix.end2end.ColumnEncodedImmutableTxStatsCollectorIT
[INFO] Tests run: 2, Failures: 0, Errors: 0, Skipped: 0, Time elapsed: 30.114 s - in org.apache.phoenix.end2end.DropSchemaIT
[INFO] Tests run: 12, Failures: 0, Errors: 0, Skipped: 0, Time elapsed: 123.956 s - in org.apache.phoenix.end2end.CsvBulkLoadToolIT
[INFO] Running org.apache.phoenix.end2end.IndexScrutinyToolIT
[INFO] Running org.apache.phoenix.end2end.FlappingLocalIndexIT
[INFO] Running org.apache.phoenix.end2end.IndexExtendedIT
[INFO] Running org.apache.phoenix.end2end.IndexToolForPartialBuildIT
[INFO] Running org.apache.phoenix.end2end.IndexToolForPartialBuildWithNamespaceEnabledIT
[INFO] Running org.apache.phoenix.end2end.IndexToolIT
[INFO] Tests run: 12, Failures: 0, Errors: 0, Skipped: 0, Time elapsed: 203.44 s - in org.apache.phoenix.end2end.FlappingLocalIndexIT
[INFO] Tests run: 32, Failures: 0, Errors: 0, Skipped: 0, Time elapsed: 207.345 s - in org.apache.phoenix.end2end.IndexExtendedIT
[INFO] Running org.apache.phoenix.end2end.MigrateSystemTablesToSystemNamespaceIT
[INFO] Running org.apache.phoenix.end2end.LocalIndexSplitMergeIT
[INFO] Tests run: 3, Failures: 0, Errors: 0, Skipped: 0, Time elapsed: 93.166 s - in org.apache.phoenix.end2end.LocalIndexSplitMergeIT
[INFO] Tests run: 20, Failures: 0, Errors: 0, Skipped: 0, Time elapsed: 593.215 s - in org.apache.phoenix.end2end.CostBasedDecisionIT
[INFO] Running org.apache.phoenix.end2end.NonColumnEncodedImmutableNonTxStatsCollectorIT
[INFO] Running org.apache.phoenix.end2end.NonColumnEncodedImmutableTxStatsCollectorIT
[INFO] Tests run: 33, Failures: 0, Errors: 0, Skipped: 0, Time elapsed: 505.527 s - in org.apache.phoenix.end2end.IndexScrutinyToolIT
[INFO] Running org.apache.phoenix.end2end.PartialResultServerConfigurationIT
[INFO] Tests run: 2, Failures: 0, Errors: 0, Skipped: 0, Time elapsed: 590.304 s - in org.apache.phoenix.end2end.IndexToolForPartialBuildIT
[INFO] Tests run: 2, Failures: 0, Errors: 0, Skipped: 0, Time elapsed: 593.738 s - in org.apache.phoenix.end2end.IndexToolForPartialBuildWithNamespaceEnabledIT
[INFO] Tests run: 4, Failures: 0, Errors: 0, Skipped: 0, Time elapsed: 382.12 s - in org.apache.phoenix.end2end.MigrateSystemTablesToSystemNamespaceIT
[INFO] Tests run: 1, Failures: 0, Errors: 0, Skipped: 0, Time elapsed: 55.94 s - in org.apache.phoenix.end2end.PartialResultServerConfigurationIT
[INFO] Running org.apache.phoenix.end2end.PhoenixDriverIT
[WARNING] Tests run: 26, Failures: 0, Errors: 0, Skipped: 4, Time elapsed: 193.955 s - in
org.apache.phoenix.end2end.NonColumnEncodedImmutableNonTxStatsCollectorIT
[INFO] Running org.apache.phoenix.end2end.QueryTimeoutIT
[INFO] Running org.apache.phoenix.end2end.QueryWithLimitIT
[INFO] Running org.apache.phoenix.end2end.RebuildIndexConnectionPropsIT
[INFO] Tests run: 1, Failures: 0, Errors: 0, Skipped: 0, Time elapsed: 0.833 s - in org.apache.phoenix.end2end.RebuildIndexConnectionPropsIT
[WARNING] Tests run: 26, Failures: 0, Errors: 0, Skipped: 4, Time elapsed: 190.903 s - in
org.apache.phoenix.end2end.NonColumnEncodedImmutableTxStatsCollectorIT
[INFO] Tests run: 2, Failures: 0, Errors: 0, Skipped: 0, Time elapsed: 10.143 s - in org.apache.phoenix.end2end.QueryWithLimitIT
[INFO] Tests run: 2, Failures: 0, Errors: 0, Skipped: 0, Time elapsed: 14.473 s - in org.apache.phoenix.end2end.QueryTimeoutIT
[INFO] Running org.apache.phoenix.end2end.SystemTablePermissionsIT
[INFO] Running org.apache.phoenix.end2end.RegexBulkLoadToolIT
[INFO] Tests run: 4, Failures: 0, Errors: 0, Skipped: 0, Time elapsed: 90.222 s - in org.apache.phoenix.end2end.PhoenixDriverIT
[INFO] Running org.apache.phoenix.end2end.TableDDLPermissionsIT
[INFO] Running org.apache.phoenix.end2end.RenewLeaseIT
[INFO] Running org.apache.phoenix.end2end.SpillableGroupByIT
[INFO] Running org.apache.phoenix.end2end.SysTableNamespaceMappedStatsCollectorIT
[INFO] Tests run: 1, Failures: 0, Errors: 0, Skipped: 0, Time elapsed: 28.866 s - in org.apache.phoenix.end2end.RenewLeaseIT
[INFO] Tests run: 3, Failures: 0, Errors: 0, Skipped: 0, Time elapsed: 18.653 s - in org.apache.phoenix.end2end.SpillableGroupByIT
[INFO] Tests run: 10, Failures: 0, Errors: 0, Skipped: 0, Time elapsed: 97.385 s - in org.apache.phoenix.end2end.RegexBulkLoadToolIT
[INFO] Tests run: 12, Failures: 0, Errors: 0, Skipped: 0, Time elapsed: 1,150.327 s - in org.apache.phoenix.end2end.ChangePermissionsIT
[INFO] Running org.apache.phoenix.end2end.TableSnapshotReadsMapReduceIT
[INFO] Tests run: 2, Failures: 0, Errors: 0, Skipped: 0, Time elapsed: 152.297 s - in org.apache.phoenix.end2end.SystemTablePermissionsIT
[INFO] Running org.apache.phoenix.end2end.UpdateCacheAcrossDifferentClientsIT
[INFO] Running org.apache.phoenix.end2end.UserDefinedFunctionsIT
[INFO] Tests run: 3, Failures: 0, Errors: 0, Skipped: 0, Time elapsed: 29.982 s - in org.apache.phoenix.end2end.TableSnapshotReadsMapReduceIT
[ERROR] Tests run: 64, Failures: 0, Errors: 16, Skipped: 0, Time elapsed: 856.918 s <<<
FAILURE! - in org.apache.phoenix.end2end.IndexToolIT
[ERROR] testSecondaryIndex[transactional = true , mutable = false , localIndex = false, directApi
= false, useSnapshot = false](org.apache.phoenix.end2end.IndexToolIT)  Time elapsed: 2.072
s  <<< ERROR!
java.lang.RuntimeException: org.apache.thrift.TException: Unable to discover transaction service.
	at org.apache.phoenix.end2end.IndexToolIT.testSecondaryIndex(IndexToolIT.java:132)
Caused by: org.apache.thrift.TException: Unable to discover transaction service.
	at org.apache.phoenix.end2end.IndexToolIT.testSecondaryIndex(IndexToolIT.java:132)

[ERROR] testSecondaryIndex[transactional = true , mutable = false , localIndex = false, directApi
= false, useSnapshot = true](org.apache.phoenix.end2end.IndexToolIT)  Time elapsed: 2.004
s  <<< ERROR!
java.lang.RuntimeException: org.apache.thrift.TException: Unable to discover transaction service.
	at org.apache.phoenix.end2end.IndexToolIT.testSecondaryIndex(IndexToolIT.java:132)
Caused by: org.apache.thrift.TException: Unable to discover transaction service.
	at org.apache.phoenix.end2end.IndexToolIT.testSecondaryIndex(IndexToolIT.java:132)

[ERROR] testSecondaryIndex[transactional = true , mutable = false , localIndex = false, directApi
= true, useSnapshot = false](org.apache.phoenix.end2end.IndexToolIT)  Time elapsed: 2.004
s  <<< ERROR!
java.lang.RuntimeException: org.apache.thrift.TException: Unable to discover transaction service.
	at org.apache.phoenix.end2end.IndexToolIT.testSecondaryIndex(IndexToolIT.java:132)
Caused by: org.apache.thrift.TException: Unable to discover transaction service.
	at org.apache.phoenix.end2end.IndexToolIT.testSecondaryIndex(IndexToolIT.java:132)

[ERROR] testSecondaryIndex[transactional = true , mutable = false , localIndex = false, directApi
= true, useSnapshot = true](org.apache.phoenix.end2end.IndexToolIT)  Time elapsed: 2.003 s
 <<< ERROR!
java.lang.RuntimeException: org.apache.thrift.TException: Unable to discover transaction service.
	at org.apache.phoenix.end2end.IndexToolIT.testSecondaryIndex(IndexToolIT.java:132)
Caused by: org.apache.thrift.TException: Unable to discover transaction service.
	at org.apache.phoenix.end2end.IndexToolIT.testSecondaryIndex(IndexToolIT.java:132)

[ERROR] testSecondaryIndex[transactional = true , mutable = false , localIndex = true, directApi
= false, useSnapshot = false](org.apache.phoenix.end2end.IndexToolIT)  Time elapsed: 2.005
s  <<< ERROR!
java.lang.RuntimeException: org.apache.thrift.TException: Unable to discover transaction service.
	at org.apache.phoenix.end2end.IndexToolIT.testSecondaryIndex(IndexToolIT.java:132)
Caused by: org.apache.thrift.TException: Unable to discover transaction service.
	at org.apache.phoenix.end2end.IndexToolIT.testSecondaryIndex(IndexToolIT.java:132)

[ERROR] testSecondaryIndex[transactional = true , mutable = false , localIndex = true, directApi
= false, useSnapshot = true](org.apache.phoenix.end2end.IndexToolIT)  Time elapsed: 2.004
s  <<< ERROR!
java.lang.RuntimeException: org.apache.thrift.TException: Unable to discover transaction service.
	at org.apache.phoenix.end2end.IndexToolIT.testSecondaryIndex(IndexToolIT.java:132)
Caused by: org.apache.thrift.TException: Unable to discover transaction service.
	at org.apache.phoenix.end2end.IndexToolIT.testSecondaryIndex(IndexToolIT.java:132)

[ERROR] testSecondaryIndex[transactional = true , mutable = false , localIndex = true, directApi
= true, useSnapshot = false](org.apache.phoenix.end2end.IndexToolIT)  Time elapsed: 2.004
s  <<< ERROR!
java.lang.RuntimeException: org.apache.thrift.TException: Unable to discover transaction service.
	at org.apache.phoenix.end2end.IndexToolIT.testSecondaryIndex(IndexToolIT.java:132)
Caused by: org.apache.thrift.TException: Unable to discover transaction service.
	at org.apache.phoenix.end2end.IndexToolIT.testSecondaryIndex(IndexToolIT.java:132)

[ERROR] testSecondaryIndex[transactional = true , mutable = false , localIndex = true, directApi
= true, useSnapshot = true](org.apache.phoenix.end2end.IndexToolIT)  Time elapsed: 2.005 s
 <<< ERROR!
java.lang.RuntimeException: org.apache.thrift.TException: Unable to discover transaction service.
	at org.apache.phoenix.end2end.IndexToolIT.testSecondaryIndex(IndexToolIT.java:132)
Caused by: org.apache.thrift.TException: Unable to discover transaction service.
	at org.apache.phoenix.end2end.IndexToolIT.testSecondaryIndex(IndexToolIT.java:132)

[ERROR] testSecondaryIndex[transactional = true , mutable = true , localIndex = false, directApi
= false, useSnapshot = false](org.apache.phoenix.end2end.IndexToolIT)  Time elapsed: 2.003
s  <<< ERROR!
java.lang.RuntimeException: org.apache.thrift.TException: Unable to discover transaction service.
	at org.apache.phoenix.end2end.IndexToolIT.testSecondaryIndex(IndexToolIT.java:132)
Caused by: org.apache.thrift.TException: Unable to discover transaction service.
	at org.apache.phoenix.end2end.IndexToolIT.testSecondaryIndex(IndexToolIT.java:132)

[ERROR] testSecondaryIndex[transactional = true , mutable = true , localIndex = false, directApi
= false, useSnapshot = true](org.apache.phoenix.end2end.IndexToolIT)  Time elapsed: 2.005
s  <<< ERROR!
java.lang.RuntimeException: org.apache.thrift.TException: Unable to discover transaction service.
	at org.apache.phoenix.end2end.IndexToolIT.testSecondaryIndex(IndexToolIT.java:132)
Caused by: org.apache.thrift.TException: Unable to discover transaction service.
	at org.apache.phoenix.end2end.IndexToolIT.testSecondaryIndex(IndexToolIT.java:132)

[ERROR] testSecondaryIndex[transactional = true , mutable = true , localIndex = false, directApi
= true, useSnapshot = false](org.apache.phoenix.end2end.IndexToolIT)  Time elapsed: 2.005
s  <<< ERROR!
java.lang.RuntimeException: org.apache.thrift.TException: Unable to discover transaction service.
	at org.apache.phoenix.end2end.IndexToolIT.testSecondaryIndex(IndexToolIT.java:132)
Caused by: org.apache.thrift.TException: Unable to discover transaction service.
	at org.apache.phoenix.end2end.IndexToolIT.testSecondaryIndex(IndexToolIT.java:132)

[ERROR] testSecondaryIndex[transactional = true , mutable = true , localIndex = false, directApi
= true, useSnapshot = true](org.apache.phoenix.end2end.IndexToolIT)  Time elapsed: 2.004 s
 <<< ERROR!
java.lang.RuntimeException: org.apache.thrift.TException: Unable to discover transaction service.
	at org.apache.phoenix.end2end.IndexToolIT.testSecondaryIndex(IndexToolIT.java:132)
Caused by: org.apache.thrift.TException: Unable to discover transaction service.
	at org.apache.phoenix.end2end.IndexToolIT.testSecondaryIndex(IndexToolIT.java:132)

[ERROR] testSecondaryIndex[transactional = true , mutable = true , localIndex = true, directApi
= false, useSnapshot = false](org.apache.phoenix.end2end.IndexToolIT)  Time elapsed: 2.002
s  <<< ERROR!
java.lang.RuntimeException: org.apache.thrift.TException: Unable to discover transaction service.
	at org.apache.phoenix.end2end.IndexToolIT.testSecondaryIndex(IndexToolIT.java:132)
Caused by: org.apache.thrift.TException: Unable to discover transaction service.
	at org.apache.phoenix.end2end.IndexToolIT.testSecondaryIndex(IndexToolIT.java:132)

[ERROR] testSecondaryIndex[transactional = true , mutable = true , localIndex = true, directApi
= false, useSnapshot = true](org.apache.phoenix.end2end.IndexToolIT)  Time elapsed: 2.003
s  <<< ERROR!
java.lang.RuntimeException: org.apache.thrift.TException: Unable to discover transaction service.
	at org.apache.phoenix.end2end.IndexToolIT.testSecondaryIndex(IndexToolIT.java:132)
Caused by: org.apache.thrift.TException: Unable to discover transaction service.
	at org.apache.phoenix.end2end.IndexToolIT.testSecondaryIndex(IndexToolIT.java:132)

[ERROR] testSecondaryIndex[transactional = true , mutable = true , localIndex = true, directApi
= true, useSnapshot = false](org.apache.phoenix.end2end.IndexToolIT)  Time elapsed: 2.004
s  <<< ERROR!
java.lang.RuntimeException: org.apache.thrift.TException: Unable to discover transaction service.
	at org.apache.phoenix.end2end.IndexToolIT.testSecondaryIndex(IndexToolIT.java:132)
Caused by: org.apache.thrift.TException: Unable to discover transaction service.
	at org.apache.phoenix.end2end.IndexToolIT.testSecondaryIndex(IndexToolIT.java:132)

[ERROR] testSecondaryIndex[transactional = true , mutable = true , localIndex = true, directApi
= true, useSnapshot = true](org.apache.phoenix.end2end.IndexToolIT)  Time elapsed: 2.004 s
 <<< ERROR!
java.lang.RuntimeException: org.apache.thrift.TException: Unable to discover transaction service.
	at org.apache.phoenix.end2end.IndexToolIT.testSecondaryIndex(IndexToolIT.java:132)
Caused by: org.apache.thrift.TException: Unable to discover transaction service.
	at org.apache.phoenix.end2end.IndexToolIT.testSecondaryIndex(IndexToolIT.java:132)

[INFO] Running org.apache.phoenix.end2end.index.ImmutableIndexIT
[INFO] Tests run: 6, Failures: 0, Errors: 0, Skipped: 0, Time elapsed: 59.593 s - in org.apache.phoenix.end2end.UpdateCacheAcrossDifferentClientsIT
[INFO] Running org.apache.phoenix.end2end.index.LocalIndexIT
[INFO] Running org.apache.phoenix.end2end.index.MutableIndexFailureIT
[WARNING] Tests run: 26, Failures: 0, Errors: 0, Skipped: 4, Time elapsed: 202.301 s - in
org.apache.phoenix.end2end.SysTableNamespaceMappedStatsCollectorIT
[INFO] Running org.apache.phoenix.end2end.index.MutableIndexReplicationIT
[INFO] Running org.apache.phoenix.end2end.index.PartialIndexRebuilderIT
[INFO] Tests run: 1, Failures: 0, Errors: 0, Skipped: 0, Time elapsed: 50.666 s - in org.apache.phoenix.end2end.index.MutableIndexReplicationIT
[INFO] Running org.apache.phoenix.end2end.index.txn.TxWriteFailureIT
[INFO] Tests run: 16, Failures: 0, Errors: 0, Skipped: 0, Time elapsed: 185.157 s - in org.apache.phoenix.end2end.UserDefinedFunctionsIT
[INFO] Running org.apache.phoenix.execute.UpsertSelectOverlappingBatchesIT
[INFO] Tests run: 8, Failures: 0, Errors: 0, Skipped: 0, Time elapsed: 91.881 s - in org.apache.phoenix.end2end.index.txn.TxWriteFailureIT
[INFO] Running org.apache.phoenix.hbase.index.FailForUnsupportedHBaseVersionsIT
[INFO] Running org.apache.phoenix.execute.PartialCommitIT
[INFO] Tests run: 12, Failures: 0, Errors: 0, Skipped: 0, Time elapsed: 1.019 s - in org.apache.phoenix.execute.PartialCommitIT
[INFO] Tests run: 2, Failures: 0, Errors: 0, Skipped: 0, Time elapsed: 38.003 s - in org.apache.phoenix.hbase.index.FailForUnsupportedHBaseVersionsIT
[INFO] Tests run: 3, Failures: 0, Errors: 0, Skipped: 0, Time elapsed: 87.404 s - in org.apache.phoenix.execute.UpsertSelectOverlappingBatchesIT
[INFO] Running org.apache.phoenix.iterate.RoundRobinResultIteratorWithStatsIT
[INFO] Tests run: 1, Failures: 0, Errors: 0, Skipped: 0, Time elapsed: 10.317 s - in org.apache.phoenix.iterate.RoundRobinResultIteratorWithStatsIT
[INFO] Running org.apache.phoenix.iterate.ScannerLeaseRenewalIT
[INFO] Running org.apache.phoenix.monitoring.PhoenixMetricsIT
[INFO] Running org.apache.phoenix.rpc.PhoenixClientRpcIT
[INFO] Tests run: 2, Failures: 0, Errors: 0, Skipped: 0, Time elapsed: 13.578 s - in org.apache.phoenix.rpc.PhoenixClientRpcIT
[WARNING] Tests run: 40, Failures: 0, Errors: 0, Skipped: 16, Time elapsed: 467.099 s - in
org.apache.phoenix.end2end.index.ImmutableIndexIT
[INFO] Running org.apache.phoenix.rpc.PhoenixServerRpcIT
[INFO] Tests run: 2, Failures: 0, Errors: 0, Skipped: 0, Time elapsed: 169.558 s - in org.apache.phoenix.iterate.ScannerLeaseRenewalIT
[INFO] Tests run: 25, Failures: 0, Errors: 0, Skipped: 0, Time elapsed: 419.082 s - in org.apache.phoenix.end2end.index.PartialIndexRebuilderIT
[INFO] Tests run: 2, Failures: 0, Errors: 0, Skipped: 0, Time elapsed: 30.499 s - in org.apache.phoenix.rpc.PhoenixServerRpcIT
[INFO] Tests run: 22, Failures: 0, Errors: 0, Skipped: 0, Time elapsed: 154.049 s - in org.apache.phoenix.monitoring.PhoenixMetricsIT
[INFO] Tests run: 36, Failures: 0, Errors: 0, Skipped: 0, Time elapsed: 527.412 s - in org.apache.phoenix.end2end.index.LocalIndexIT
[INFO] Tests run: 4, Failures: 0, Errors: 0, Skipped: 0, Time elapsed: 741.186 s - in org.apache.phoenix.end2end.TableDDLPermissionsIT
[INFO] Tests run: 21, Failures: 0, Errors: 0, Skipped: 0, Time elapsed: 519.195 s - in org.apache.phoenix.end2end.index.MutableIndexFailureIT
[INFO] 
[INFO] Results:
[INFO] 
[ERROR] Errors: 
[ERROR]   IndexToolIT.testSecondaryIndex:132 » Runtime org.apache.thrift.TException: Una...
[ERROR]   IndexToolIT.testSecondaryIndex:132 » Runtime org.apache.thrift.TException: Una...
[ERROR]   IndexToolIT.testSecondaryIndex:132 » Runtime org.apache.thrift.TException: Una...
[ERROR]   IndexToolIT.testSecondaryIndex:132 » Runtime org.apache.thrift.TException: Una...
[ERROR]   IndexToolIT.testSecondaryIndex:132 » Runtime org.apache.thrift.TException: Una...
[ERROR]   IndexToolIT.testSecondaryIndex:132 » Runtime org.apache.thrift.TException: Una...
[ERROR]   IndexToolIT.testSecondaryIndex:132 » Runtime org.apache.thrift.TException: Una...
[ERROR]   IndexToolIT.testSecondaryIndex:132 » Runtime org.apache.thrift.TException: Una...
[ERROR]   IndexToolIT.testSecondaryIndex:132 » Runtime org.apache.thrift.TException: Una...
[ERROR]   IndexToolIT.testSecondaryIndex:132 » Runtime org.apache.thrift.TException: Una...
[ERROR]   IndexToolIT.testSecondaryIndex:132 » Runtime org.apache.thrift.TException: Una...
[ERROR]   IndexToolIT.testSecondaryIndex:132 » Runtime org.apache.thrift.TException: Una...
[ERROR]   IndexToolIT.testSecondaryIndex:132 » Runtime org.apache.thrift.TException: Una...
[ERROR]   IndexToolIT.testSecondaryIndex:132 » Runtime org.apache.thrift.TException: Una...
[ERROR]   IndexToolIT.testSecondaryIndex:132 » Runtime org.apache.thrift.TException: Una...
[ERROR]   IndexToolIT.testSecondaryIndex:132 » Runtime org.apache.thrift.TException: Una...
[INFO] 
[ERROR] Tests run: 619, Failures: 0, Errors: 16, Skipped: 44
[INFO] 
[INFO] 
[INFO] --- maven-failsafe-plugin:2.20:verify (ParallelStatsEnabledTest) @ phoenix-core ---
[INFO] ------------------------------------------------------------------------
[INFO] Reactor Summary:
[INFO] 
[INFO] Apache Phoenix ..................................... SUCCESS [  2.444 s]
[INFO] Phoenix Core ....................................... FAILURE [  02:03 h]
[INFO] Phoenix - Flume .................................... SKIPPED
[INFO] Phoenix - Kafka .................................... SKIPPED
[INFO] Phoenix - Pig ...................................... SKIPPED
[INFO] Phoenix Query Server Client ........................ SKIPPED
[INFO] Phoenix Query Server ............................... SKIPPED
[INFO] Phoenix - Pherf .................................... SKIPPED
[INFO] Phoenix - Spark .................................... SKIPPED
[INFO] Phoenix - Hive ..................................... SKIPPED
[INFO] Phoenix Client ..................................... SKIPPED
[INFO] Phoenix Server ..................................... SKIPPED
[INFO] Phoenix Assembly ................................... SKIPPED
[INFO] Phoenix - Tracing Web Application .................. SKIPPED
[INFO] Phoenix Load Balancer .............................. SKIPPED
[INFO] ------------------------------------------------------------------------
[INFO] BUILD FAILURE
[INFO] ------------------------------------------------------------------------
[INFO] Total time: 02:03 h
[INFO] Finished at: 2018-03-23T04:38:06Z
[INFO] Final Memory: 63M/901M
[INFO] ------------------------------------------------------------------------
[ERROR] Failed to execute goal org.apache.maven.plugins:maven-failsafe-plugin:2.20:verify
(ParallelStatsEnabledTest) on project phoenix-core: There are test failures.
[ERROR] 
[ERROR] Please refer to <https://builds.apache.org/job/Phoenix-4.x-HBase-1.2/ws/phoenix-core/target/failsafe-reports>
for the individual test results.
[ERROR] Please refer to dump files (if any exist) [date]-jvmRun[N].dump, [date].dumpstream
and [date]-jvmRun[N].dumpstream.
[ERROR] -> [Help 1]
[ERROR] 
[ERROR] To see the full stack trace of the errors, re-run Maven with the -e switch.
[ERROR] Re-run Maven using the -X switch to enable full debug logging.
[ERROR] 
[ERROR] For more information about the errors and possible solutions, please read the following
articles:
[ERROR] [Help 1] http://cwiki.apache.org/confluence/display/MAVEN/MojoFailureException
[ERROR] 
[ERROR] After correcting the problems, you can resume the build with the command
[ERROR]   mvn <goals> -rf :phoenix-core
Build step 'Invoke top-level Maven targets' marked build as failure
Archiving artifacts
Recording test results

Mime
View raw message