phoenix-commits mailing list archives

Site index · List index
Message view « Date » · « Thread »
Top « Date » · « Thread »
From Apache Jenkins Server <jenk...@builds.apache.org>
Subject Build failed in Jenkins: Phoenix | 4.x-HBase-0.98 #1806
Date Sat, 03 Feb 2018 01:56:56 GMT
See <https://builds.apache.org/job/Phoenix-4.x-HBase-0.98/1806/display/redirect?page=changes>

Changes:

[elserj] PHOENIX-4577 Use cp -r for the argparse directory in bin/

------------------------------------------
[...truncated 126.85 KB...]
[INFO] 
[INFO] --- maven-failsafe-plugin:2.20:integration-test (NeedTheirOwnClusterTests) @ phoenix-core
---
[INFO] 
[INFO] -------------------------------------------------------
[INFO]  T E S T S
[INFO] -------------------------------------------------------
[INFO] Running org.apache.hadoop.hbase.regionserver.wal.WALReplayWithIndexWritesAndCompressedWALIT
[INFO] Tests run: 1, Failures: 0, Errors: 0, Skipped: 0, Time elapsed: 34.678 s - in org.apache.hadoop.hbase.regionserver.wal.WALReplayWithIndexWritesAndCompressedWALIT
[INFO] Running org.apache.hadoop.hbase.regionserver.wal.WALRecoveryRegionPostOpenIT
[INFO] Tests run: 1, Failures: 0, Errors: 0, Skipped: 0, Time elapsed: 8.204 s - in org.apache.hadoop.hbase.regionserver.wal.WALRecoveryRegionPostOpenIT
[INFO] Running org.apache.phoenix.end2end.ColumnEncodedImmutableTxStatsCollectorIT
[INFO] Running org.apache.phoenix.end2end.ColumnEncodedMutableNonTxStatsCollectorIT
[INFO] Running org.apache.phoenix.end2end.ColumnEncodedImmutableNonTxStatsCollectorIT
[INFO] Running org.apache.phoenix.end2end.ConnectionUtilIT
[INFO] Running org.apache.phoenix.end2end.ColumnEncodedMutableTxStatsCollectorIT
[INFO] Tests run: 1, Failures: 0, Errors: 0, Skipped: 0, Time elapsed: 26.048 s - in org.apache.phoenix.end2end.ConnectionUtilIT
[INFO] Running org.apache.phoenix.end2end.ContextClassloaderIT
[INFO] Tests run: 3, Failures: 0, Errors: 0, Skipped: 0, Time elapsed: 2.507 s - in org.apache.phoenix.end2end.ContextClassloaderIT
[WARNING] Tests run: 26, Failures: 0, Errors: 0, Skipped: 4, Time elapsed: 117.09 s - in org.apache.phoenix.end2end.ColumnEncodedImmutableTxStatsCollectorIT
[WARNING] Tests run: 26, Failures: 0, Errors: 0, Skipped: 4, Time elapsed: 116.822 s - in
org.apache.phoenix.end2end.ColumnEncodedMutableNonTxStatsCollectorIT
[WARNING] Tests run: 26, Failures: 0, Errors: 0, Skipped: 4, Time elapsed: 117.806 s - in
org.apache.phoenix.end2end.ColumnEncodedImmutableNonTxStatsCollectorIT
[WARNING] Tests run: 26, Failures: 0, Errors: 0, Skipped: 4, Time elapsed: 119.899 s - in
org.apache.phoenix.end2end.ColumnEncodedMutableTxStatsCollectorIT
[INFO] Running org.apache.phoenix.end2end.CountDistinctCompressionIT
[INFO] Tests run: 1, Failures: 0, Errors: 0, Skipped: 0, Time elapsed: 3.148 s - in org.apache.phoenix.end2end.CountDistinctCompressionIT
[INFO] Running org.apache.phoenix.end2end.CsvBulkLoadToolIT
[INFO] Running org.apache.phoenix.end2end.DropSchemaIT
[INFO] Tests run: 2, Failures: 0, Errors: 0, Skipped: 0, Time elapsed: 8.529 s - in org.apache.phoenix.end2end.DropSchemaIT
[INFO] Running org.apache.phoenix.end2end.FlappingLocalIndexIT
[INFO] Running org.apache.phoenix.end2end.IndexExtendedIT
[INFO] Running org.apache.phoenix.end2end.IndexScrutinyToolIT
[INFO] Running org.apache.phoenix.end2end.IndexToolForPartialBuildIT
[INFO] Tests run: 12, Failures: 0, Errors: 0, Skipped: 0, Time elapsed: 84.453 s - in org.apache.phoenix.end2end.CsvBulkLoadToolIT
[INFO] Tests run: 32, Failures: 0, Errors: 0, Skipped: 0, Time elapsed: 92.953 s - in org.apache.phoenix.end2end.IndexExtendedIT
[INFO] Running org.apache.phoenix.end2end.IndexToolForPartialBuildWithNamespaceEnabledIT
[INFO] Tests run: 12, Failures: 0, Errors: 0, Skipped: 0, Time elapsed: 136.215 s - in org.apache.phoenix.end2end.FlappingLocalIndexIT
[INFO] Running org.apache.phoenix.end2end.LocalIndexSplitMergeIT
[WARNING] Tests run: 2, Failures: 0, Errors: 0, Skipped: 2, Time elapsed: 0.001 s - in org.apache.phoenix.end2end.LocalIndexSplitMergeIT
[INFO] Running org.apache.phoenix.end2end.MigrateSystemTablesToSystemNamespaceIT
[INFO] Running org.apache.phoenix.end2end.IndexToolIT
[INFO] Tests run: 33, Failures: 0, Errors: 0, Skipped: 0, Time elapsed: 344.768 s - in org.apache.phoenix.end2end.IndexScrutinyToolIT
[INFO] Tests run: 4, Failures: 0, Errors: 0, Skipped: 0, Time elapsed: 239.148 s - in org.apache.phoenix.end2end.MigrateSystemTablesToSystemNamespaceIT
[INFO] Running org.apache.phoenix.end2end.NonColumnEncodedImmutableNonTxStatsCollectorIT
[INFO] Running org.apache.phoenix.end2end.NonColumnEncodedImmutableTxStatsCollectorIT
[WARNING] Tests run: 26, Failures: 0, Errors: 0, Skipped: 4, Time elapsed: 83.346 s - in org.apache.phoenix.end2end.NonColumnEncodedImmutableNonTxStatsCollectorIT
[WARNING] Tests run: 26, Failures: 0, Errors: 0, Skipped: 4, Time elapsed: 80.494 s - in org.apache.phoenix.end2end.NonColumnEncodedImmutableTxStatsCollectorIT
[INFO] Running org.apache.phoenix.end2end.PhoenixDriverIT
[INFO] Tests run: 32, Failures: 0, Errors: 0, Skipped: 0, Time elapsed: 385.204 s - in org.apache.phoenix.end2end.IndexToolIT
[INFO] Running org.apache.phoenix.end2end.QueryTimeoutIT
[INFO] Tests run: 2, Failures: 0, Errors: 0, Skipped: 0, Time elapsed: 10.28 s - in org.apache.phoenix.end2end.QueryTimeoutIT
[INFO] Tests run: 4, Failures: 0, Errors: 0, Skipped: 0, Time elapsed: 48.748 s - in org.apache.phoenix.end2end.PhoenixDriverIT
[INFO] Running org.apache.phoenix.end2end.QueryWithLimitIT
[INFO] Tests run: 2, Failures: 0, Errors: 0, Skipped: 0, Time elapsed: 5.382 s - in org.apache.phoenix.end2end.QueryWithLimitIT
[INFO] Tests run: 2, Failures: 0, Errors: 0, Skipped: 0, Time elapsed: 584.794 s - in org.apache.phoenix.end2end.IndexToolForPartialBuildIT
[INFO] Running org.apache.phoenix.end2end.RebuildIndexConnectionPropsIT
[INFO] Tests run: 1, Failures: 0, Errors: 0, Skipped: 0, Time elapsed: 1.234 s - in org.apache.phoenix.end2end.RebuildIndexConnectionPropsIT
[INFO] Running org.apache.phoenix.end2end.RegexBulkLoadToolIT
[INFO] Running org.apache.phoenix.end2end.RenewLeaseIT
[INFO] Running org.apache.phoenix.end2end.SpillableGroupByIT
[INFO] Tests run: 1, Failures: 0, Errors: 0, Skipped: 0, Time elapsed: 25.983 s - in org.apache.phoenix.end2end.RenewLeaseIT
[INFO] Tests run: 2, Failures: 0, Errors: 0, Skipped: 0, Time elapsed: 6.256 s - in org.apache.phoenix.end2end.SpillableGroupByIT
[INFO] Running org.apache.phoenix.end2end.SystemTablePermissionsIT
[INFO] Running org.apache.phoenix.end2end.SysTableNamespaceMappedStatsCollectorIT
[INFO] Tests run: 10, Failures: 0, Errors: 0, Skipped: 0, Time elapsed: 65.654 s - in org.apache.phoenix.end2end.RegexBulkLoadToolIT
[INFO] Tests run: 2, Failures: 0, Errors: 0, Skipped: 0, Time elapsed: 585.337 s - in org.apache.phoenix.end2end.IndexToolForPartialBuildWithNamespaceEnabledIT
[INFO] Running org.apache.phoenix.end2end.TableSnapshotReadsMapReduceIT
[INFO] Running org.apache.phoenix.end2end.UpdateCacheAcrossDifferentClientsIT
[INFO] Tests run: 3, Failures: 0, Errors: 0, Skipped: 0, Time elapsed: 24.471 s - in org.apache.phoenix.end2end.TableSnapshotReadsMapReduceIT
[ERROR] Tests run: 2, Failures: 0, Errors: 2, Skipped: 0, Time elapsed: 73.619 s <<<
FAILURE! - in org.apache.phoenix.end2end.SystemTablePermissionsIT
[ERROR] testNamespaceMappedSystemTables(org.apache.phoenix.end2end.SystemTablePermissionsIT)
 Time elapsed: 39.174 s  <<< ERROR!
java.io.IOException: Shutting down
	at org.apache.phoenix.end2end.SystemTablePermissionsIT.testNamespaceMappedSystemTables(SystemTablePermissionsIT.java:162)
Caused by: java.lang.RuntimeException: Master not active after 30000 seconds
	at org.apache.phoenix.end2end.SystemTablePermissionsIT.testNamespaceMappedSystemTables(SystemTablePermissionsIT.java:162)

[ERROR] testSystemTablePermissions(org.apache.phoenix.end2end.SystemTablePermissionsIT)  Time
elapsed: 34.444 s  <<< ERROR!
java.io.IOException: Shutting down
	at org.apache.phoenix.end2end.SystemTablePermissionsIT.testSystemTablePermissions(SystemTablePermissionsIT.java:104)
Caused by: java.lang.RuntimeException: Master not active after 30000 seconds
	at org.apache.phoenix.end2end.SystemTablePermissionsIT.testSystemTablePermissions(SystemTablePermissionsIT.java:104)

[INFO] Running org.apache.phoenix.end2end.UserDefinedFunctionsIT
[INFO] Tests run: 6, Failures: 0, Errors: 0, Skipped: 0, Time elapsed: 24.134 s - in org.apache.phoenix.end2end.UpdateCacheAcrossDifferentClientsIT
[WARNING] Tests run: 26, Failures: 0, Errors: 0, Skipped: 4, Time elapsed: 94.035 s - in org.apache.phoenix.end2end.SysTableNamespaceMappedStatsCollectorIT
[INFO] Running org.apache.phoenix.end2end.index.ImmutableIndexIT
[INFO] Tests run: 14, Failures: 0, Errors: 0, Skipped: 0, Time elapsed: 48.791 s - in org.apache.phoenix.end2end.UserDefinedFunctionsIT
[INFO] Running org.apache.phoenix.end2end.index.LocalIndexIT
[INFO] Running org.apache.phoenix.end2end.index.MutableIndexFailureIT
[INFO] Running org.apache.phoenix.end2end.index.MutableIndexReplicationIT
[INFO] Running org.apache.phoenix.end2end.index.PartialIndexRebuilderIT
[INFO] Tests run: 1, Failures: 0, Errors: 0, Skipped: 0, Time elapsed: 22.487 s - in org.apache.phoenix.end2end.index.MutableIndexReplicationIT
[INFO] Running org.apache.phoenix.end2end.index.txn.TxWriteFailureIT
[INFO] Tests run: 8, Failures: 0, Errors: 0, Skipped: 0, Time elapsed: 49.416 s - in org.apache.phoenix.end2end.index.txn.TxWriteFailureIT
[INFO] Running org.apache.phoenix.execute.PartialCommitIT
[INFO] Tests run: 12, Failures: 0, Errors: 0, Skipped: 0, Time elapsed: 0.927 s - in org.apache.phoenix.execute.PartialCommitIT
[INFO] Running org.apache.phoenix.execute.UpsertSelectOverlappingBatchesIT
[INFO] Tests run: 21, Failures: 0, Errors: 0, Skipped: 0, Time elapsed: 267.479 s - in org.apache.phoenix.end2end.index.MutableIndexFailureIT
[INFO] Tests run: 26, Failures: 0, Errors: 0, Skipped: 0, Time elapsed: 250.657 s - in org.apache.phoenix.end2end.index.PartialIndexRebuilderIT
[INFO] Running org.apache.phoenix.hbase.index.FailForUnsupportedHBaseVersionsIT
[INFO] Tests run: 2, Failures: 0, Errors: 0, Skipped: 0, Time elapsed: 37.616 s - in org.apache.phoenix.hbase.index.FailForUnsupportedHBaseVersionsIT
[INFO] Running org.apache.phoenix.iterate.RoundRobinResultIteratorWithStatsIT
[INFO] Tests run: 1, Failures: 0, Errors: 0, Skipped: 0, Time elapsed: 5.841 s - in org.apache.phoenix.iterate.RoundRobinResultIteratorWithStatsIT
[INFO] Tests run: 36, Failures: 0, Errors: 0, Skipped: 0, Time elapsed: 363.707 s - in org.apache.phoenix.end2end.index.LocalIndexIT
[INFO] Running org.apache.phoenix.iterate.ScannerLeaseRenewalIT
[INFO] Running org.apache.phoenix.monitoring.PhoenixMetricsIT
[INFO] Running org.apache.phoenix.rpc.PhoenixClientRpcIT
[INFO] Tests run: 2, Failures: 0, Errors: 0, Skipped: 0, Time elapsed: 4.851 s - in org.apache.phoenix.rpc.PhoenixClientRpcIT
[INFO] Tests run: 3, Failures: 0, Errors: 0, Skipped: 0, Time elapsed: 166.48 s - in org.apache.phoenix.execute.UpsertSelectOverlappingBatchesIT
[INFO] Running org.apache.phoenix.rpc.PhoenixServerRpcIT
[INFO] Tests run: 2, Failures: 0, Errors: 0, Skipped: 0, Time elapsed: 15.672 s - in org.apache.phoenix.rpc.PhoenixServerRpcIT
[INFO] Tests run: 22, Failures: 0, Errors: 0, Skipped: 0, Time elapsed: 83.657 s - in org.apache.phoenix.monitoring.PhoenixMetricsIT
[INFO] Tests run: 2, Failures: 0, Errors: 0, Skipped: 0, Time elapsed: 162.57 s - in org.apache.phoenix.iterate.ScannerLeaseRenewalIT
[ERROR] Tests run: 40, Failures: 0, Errors: 12, Skipped: 16, Time elapsed: 807.052 s <<<
FAILURE! - in org.apache.phoenix.end2end.index.ImmutableIndexIT
[ERROR] testDeleteFromPartialPK[ImmutableIndexIT_localIndex=false,transactional=true,columnEncoded=false](org.apache.phoenix.end2end.index.ImmutableIndexIT)
 Time elapsed: 46.14 s  <<< ERROR!
java.lang.RuntimeException: org.apache.thrift.TException: Unable to discover transaction service.
	at org.apache.phoenix.end2end.index.ImmutableIndexIT.testDeleteFromPartialPK(ImmutableIndexIT.java:175)
Caused by: org.apache.thrift.TException: Unable to discover transaction service.
	at org.apache.phoenix.end2end.index.ImmutableIndexIT.testDeleteFromPartialPK(ImmutableIndexIT.java:175)

[ERROR] testDropIfImmutableKeyValueColumn[ImmutableIndexIT_localIndex=false,transactional=true,columnEncoded=false](org.apache.phoenix.end2end.index.ImmutableIndexIT)
 Time elapsed: 46.46 s  <<< ERROR!
java.lang.RuntimeException: org.apache.thrift.TException: Unable to discover transaction service.
	at org.apache.phoenix.end2end.index.ImmutableIndexIT.testDropIfImmutableKeyValueColumn(ImmutableIndexIT.java:132)
Caused by: org.apache.thrift.TException: Unable to discover transaction service.
	at org.apache.phoenix.end2end.index.ImmutableIndexIT.testDropIfImmutableKeyValueColumn(ImmutableIndexIT.java:132)

[ERROR] testDeleteFromNonPK[ImmutableIndexIT_localIndex=false,transactional=true,columnEncoded=false](org.apache.phoenix.end2end.index.ImmutableIndexIT)
 Time elapsed: 45.782 s  <<< ERROR!
java.lang.RuntimeException: org.apache.thrift.TException: Unable to discover transaction service.
	at org.apache.phoenix.end2end.index.ImmutableIndexIT.testDeleteFromNonPK(ImmutableIndexIT.java:217)
Caused by: org.apache.thrift.TException: Unable to discover transaction service.
	at org.apache.phoenix.end2end.index.ImmutableIndexIT.testDeleteFromNonPK(ImmutableIndexIT.java:217)

[ERROR] testDeleteFromPartialPK[ImmutableIndexIT_localIndex=false,transactional=true,columnEncoded=true](org.apache.phoenix.end2end.index.ImmutableIndexIT)
 Time elapsed: 46.121 s  <<< ERROR!
java.lang.RuntimeException: org.apache.thrift.TException: Unable to discover transaction service.
	at org.apache.phoenix.end2end.index.ImmutableIndexIT.testDeleteFromPartialPK(ImmutableIndexIT.java:175)
Caused by: org.apache.thrift.TException: Unable to discover transaction service.
	at org.apache.phoenix.end2end.index.ImmutableIndexIT.testDeleteFromPartialPK(ImmutableIndexIT.java:175)

[ERROR] testDropIfImmutableKeyValueColumn[ImmutableIndexIT_localIndex=false,transactional=true,columnEncoded=true](org.apache.phoenix.end2end.index.ImmutableIndexIT)
 Time elapsed: 46.117 s  <<< ERROR!
java.lang.RuntimeException: org.apache.thrift.TException: Unable to discover transaction service.
	at org.apache.phoenix.end2end.index.ImmutableIndexIT.testDropIfImmutableKeyValueColumn(ImmutableIndexIT.java:132)
Caused by: org.apache.thrift.TException: Unable to discover transaction service.
	at org.apache.phoenix.end2end.index.ImmutableIndexIT.testDropIfImmutableKeyValueColumn(ImmutableIndexIT.java:132)

[ERROR] testDeleteFromNonPK[ImmutableIndexIT_localIndex=false,transactional=true,columnEncoded=true](org.apache.phoenix.end2end.index.ImmutableIndexIT)
 Time elapsed: 46.117 s  <<< ERROR!
java.lang.RuntimeException: org.apache.thrift.TException: Unable to discover transaction service.
	at org.apache.phoenix.end2end.index.ImmutableIndexIT.testDeleteFromNonPK(ImmutableIndexIT.java:217)
Caused by: org.apache.thrift.TException: Unable to discover transaction service.
	at org.apache.phoenix.end2end.index.ImmutableIndexIT.testDeleteFromNonPK(ImmutableIndexIT.java:217)

[ERROR] testDeleteFromPartialPK[ImmutableIndexIT_localIndex=true,transactional=true,columnEncoded=false](org.apache.phoenix.end2end.index.ImmutableIndexIT)
 Time elapsed: 46.121 s  <<< ERROR!
java.lang.RuntimeException: org.apache.thrift.TException: Unable to discover transaction service.
	at org.apache.phoenix.end2end.index.ImmutableIndexIT.testDeleteFromPartialPK(ImmutableIndexIT.java:175)
Caused by: org.apache.thrift.TException: Unable to discover transaction service.
	at org.apache.phoenix.end2end.index.ImmutableIndexIT.testDeleteFromPartialPK(ImmutableIndexIT.java:175)

[ERROR] testDropIfImmutableKeyValueColumn[ImmutableIndexIT_localIndex=true,transactional=true,columnEncoded=false](org.apache.phoenix.end2end.index.ImmutableIndexIT)
 Time elapsed: 46.121 s  <<< ERROR!
java.lang.RuntimeException: org.apache.thrift.TException: Unable to discover transaction service.
	at org.apache.phoenix.end2end.index.ImmutableIndexIT.testDropIfImmutableKeyValueColumn(ImmutableIndexIT.java:132)
Caused by: org.apache.thrift.TException: Unable to discover transaction service.
	at org.apache.phoenix.end2end.index.ImmutableIndexIT.testDropIfImmutableKeyValueColumn(ImmutableIndexIT.java:132)

[ERROR] testDeleteFromNonPK[ImmutableIndexIT_localIndex=true,transactional=true,columnEncoded=false](org.apache.phoenix.end2end.index.ImmutableIndexIT)
 Time elapsed: 46.12 s  <<< ERROR!
java.lang.RuntimeException: org.apache.thrift.TException: Unable to discover transaction service.
	at org.apache.phoenix.end2end.index.ImmutableIndexIT.testDeleteFromNonPK(ImmutableIndexIT.java:217)
Caused by: org.apache.thrift.TException: Unable to discover transaction service.
	at org.apache.phoenix.end2end.index.ImmutableIndexIT.testDeleteFromNonPK(ImmutableIndexIT.java:217)

[ERROR] testDeleteFromPartialPK[ImmutableIndexIT_localIndex=true,transactional=true,columnEncoded=true](org.apache.phoenix.end2end.index.ImmutableIndexIT)
 Time elapsed: 46.12 s  <<< ERROR!
java.lang.RuntimeException: org.apache.thrift.TException: Unable to discover transaction service.
	at org.apache.phoenix.end2end.index.ImmutableIndexIT.testDeleteFromPartialPK(ImmutableIndexIT.java:175)
Caused by: org.apache.thrift.TException: Unable to discover transaction service.
	at org.apache.phoenix.end2end.index.ImmutableIndexIT.testDeleteFromPartialPK(ImmutableIndexIT.java:175)

[ERROR] testDropIfImmutableKeyValueColumn[ImmutableIndexIT_localIndex=true,transactional=true,columnEncoded=true](org.apache.phoenix.end2end.index.ImmutableIndexIT)
 Time elapsed: 46.119 s  <<< ERROR!
java.lang.RuntimeException: org.apache.thrift.TException: Unable to discover transaction service.
	at org.apache.phoenix.end2end.index.ImmutableIndexIT.testDropIfImmutableKeyValueColumn(ImmutableIndexIT.java:132)
Caused by: org.apache.thrift.TException: Unable to discover transaction service.
	at org.apache.phoenix.end2end.index.ImmutableIndexIT.testDropIfImmutableKeyValueColumn(ImmutableIndexIT.java:132)

[ERROR] testDeleteFromNonPK[ImmutableIndexIT_localIndex=true,transactional=true,columnEncoded=true](org.apache.phoenix.end2end.index.ImmutableIndexIT)
 Time elapsed: 46.115 s  <<< ERROR!
java.lang.RuntimeException: org.apache.thrift.TException: Unable to discover transaction service.
	at org.apache.phoenix.end2end.index.ImmutableIndexIT.testDeleteFromNonPK(ImmutableIndexIT.java:217)
Caused by: org.apache.thrift.TException: Unable to discover transaction service.
	at org.apache.phoenix.end2end.index.ImmutableIndexIT.testDeleteFromNonPK(ImmutableIndexIT.java:217)

[INFO] 
[INFO] Results:
[INFO] 
[ERROR] Errors: 
[ERROR]   SystemTablePermissionsIT.testNamespaceMappedSystemTables:162 » IO Shutting dow...
[ERROR]   SystemTablePermissionsIT.testSystemTablePermissions:104 » IO Shutting down
[ERROR]   ImmutableIndexIT.testDeleteFromNonPK:217 » Runtime org.apache.thrift.TExceptio...
[ERROR]   ImmutableIndexIT.testDeleteFromNonPK:217 » Runtime org.apache.thrift.TExceptio...
[ERROR]   ImmutableIndexIT.testDeleteFromNonPK:217 » Runtime org.apache.thrift.TExceptio...
[ERROR]   ImmutableIndexIT.testDeleteFromNonPK:217 » Runtime org.apache.thrift.TExceptio...
[ERROR]   ImmutableIndexIT.testDeleteFromPartialPK:175 » Runtime org.apache.thrift.TExce...
[ERROR]   ImmutableIndexIT.testDeleteFromPartialPK:175 » Runtime org.apache.thrift.TExce...
[ERROR]   ImmutableIndexIT.testDeleteFromPartialPK:175 » Runtime org.apache.thrift.TExce...
[ERROR]   ImmutableIndexIT.testDeleteFromPartialPK:175 » Runtime org.apache.thrift.TExce...
[ERROR]   ImmutableIndexIT.testDropIfImmutableKeyValueColumn:132 » Runtime org.apache.th...
[ERROR]   ImmutableIndexIT.testDropIfImmutableKeyValueColumn:132 » Runtime org.apache.th...
[ERROR]   ImmutableIndexIT.testDropIfImmutableKeyValueColumn:132 » Runtime org.apache.th...
[ERROR]   ImmutableIndexIT.testDropIfImmutableKeyValueColumn:132 » Runtime org.apache.th...
[INFO] 
[ERROR] Tests run: 547, Failures: 0, Errors: 14, Skipped: 46
[INFO] 
[INFO] 
[INFO] --- maven-failsafe-plugin:2.20:verify (ParallelStatsEnabledTest) @ phoenix-core ---
[INFO] ------------------------------------------------------------------------
[INFO] Reactor Summary:
[INFO] 
[INFO] Apache Phoenix ..................................... SUCCESS [  2.177 s]
[INFO] Phoenix Core ....................................... FAILURE [  01:56 h]
[INFO] Phoenix - Flume .................................... SKIPPED
[INFO] Phoenix - Kafka .................................... SKIPPED
[INFO] Phoenix - Pig ...................................... SKIPPED
[INFO] Phoenix Query Server Client ........................ SKIPPED
[INFO] Phoenix Query Server ............................... SKIPPED
[INFO] Phoenix - Pherf .................................... SKIPPED
[INFO] Phoenix - Spark .................................... SKIPPED
[INFO] Phoenix - Hive ..................................... SKIPPED
[INFO] Phoenix Client ..................................... SKIPPED
[INFO] Phoenix Server ..................................... SKIPPED
[INFO] Phoenix Assembly ................................... SKIPPED
[INFO] Phoenix - Tracing Web Application .................. SKIPPED
[INFO] Phoenix Load Balancer .............................. SKIPPED
[INFO] ------------------------------------------------------------------------
[INFO] BUILD FAILURE
[INFO] ------------------------------------------------------------------------
[INFO] Total time: 01:56 h
[INFO] Finished at: 2018-02-03T01:50:46Z
[INFO] Final Memory: 61M/844M
[INFO] ------------------------------------------------------------------------
[ERROR] Failed to execute goal org.apache.maven.plugins:maven-failsafe-plugin:2.20:verify
(ParallelStatsEnabledTest) on project phoenix-core: There are test failures.
[ERROR] 
[ERROR] Please refer to <https://builds.apache.org/job/Phoenix-4.x-HBase-0.98/ws/phoenix-core/target/failsafe-reports>
for the individual test results.
[ERROR] Please refer to dump files (if any exist) [date]-jvmRun[N].dump, [date].dumpstream
and [date]-jvmRun[N].dumpstream.
[ERROR] -> [Help 1]
[ERROR] 
[ERROR] To see the full stack trace of the errors, re-run Maven with the -e switch.
[ERROR] Re-run Maven using the -X switch to enable full debug logging.
[ERROR] 
[ERROR] For more information about the errors and possible solutions, please read the following
articles:
[ERROR] [Help 1] http://cwiki.apache.org/confluence/display/MAVEN/MojoFailureException
[ERROR] 
[ERROR] After correcting the problems, you can resume the build with the command
[ERROR]   mvn <goals> -rf :phoenix-core
Build step 'Invoke top-level Maven targets' marked build as failure
Archiving artifacts
Recording test results

Mime
View raw message