phoenix-commits mailing list archives

Site index · List index
Message view « Date » · « Thread »
Top « Date » · « Thread »
From Apache Jenkins Server <jenk...@builds.apache.org>
Subject Build failed in Jenkins: Phoenix-4.x-HBase-1.2 #271
Date Thu, 15 Feb 2018 07:36:28 GMT
See <https://builds.apache.org/job/Phoenix-4.x-HBase-1.2/271/display/redirect?page=changes>

Changes:

[jtaylor] PHOENIX-2566 Support NOT NULL constraint for any column for immutable

------------------------------------------
[...truncated 137.29 KB...]
CLIENT AGGREGATE INTO DISTINCT ROWS BY [E.BUCKET, E.TIMESTAMP]]> but was:<...CLIENT
SORTED BY [E.[TIMESTAMP, E.BUCKET]
CLIENT AGGREGATE INTO DISTINCT ROWS BY [E.TIMESTAMP, E.BUCKET]]>
[ERROR]   HashJoinMoreIT.testBug2894:806 expected:<...O DISTINCT ROWS BY [[E.BUCKET, "E.TIMESTAMP"]]
CLIENT MERGE SORT
...> but was:<...O DISTINCT ROWS BY [["E.TIMESTAMP", E.BUCKET]]
CLIENT MERGE SORT
...>
[ERROR] Errors: 
[ERROR]   VariableLengthPKIT.testMissingPKColumn:884 » NullPointer
[ERROR]   GlobalImmutableTxIndexIT>BaseIndexIT.createIndexOnTableWithSpecifiedDefaultCF:499
» Runtime
[ERROR]   GlobalImmutableTxIndexIT>BaseIndexIT.createIndexOnTableWithSpecifiedDefaultCF:499
» Runtime
[ERROR]   GlobalImmutableTxIndexIT>BaseIndexIT.testCreateIndexAfterUpsertStartedTxnl:264->BaseIndexIT.testCreateIndexAfterUpsertStarted:276
» Runtime
[ERROR]   GlobalImmutableTxIndexIT>BaseIndexIT.testCreateIndexAfterUpsertStartedTxnl:264->BaseIndexIT.testCreateIndexAfterUpsertStarted:276
» Runtime
[ERROR]   GlobalImmutableTxIndexIT>BaseIndexIT.testCreateIndexAfterUpsertStarted:256->BaseIndexIT.testCreateIndexAfterUpsertStarted:276
» Runtime
[ERROR]   GlobalImmutableTxIndexIT>BaseIndexIT.testCreateIndexAfterUpsertStarted:256->BaseIndexIT.testCreateIndexAfterUpsertStarted:276
» Runtime
[ERROR]   GlobalImmutableTxIndexIT>BaseIndexIT.testDeleteFromAllPKColumnIndex:192 » Runtime
[ERROR]   GlobalImmutableTxIndexIT>BaseIndexIT.testDeleteFromAllPKColumnIndex:192 » Runtime
[ERROR]   GlobalImmutableTxIndexIT>BaseIndexIT.testDeleteFromNonPKColumnIndex:370 » Runtime
[ERROR]   GlobalImmutableTxIndexIT>BaseIndexIT.testDeleteFromNonPKColumnIndex:370 » Runtime
[ERROR]   GlobalImmutableTxIndexIT>BaseIndexIT.testGroupByCount:424 » Runtime org.apache...
[ERROR]   GlobalImmutableTxIndexIT>BaseIndexIT.testGroupByCount:424 » Runtime org.apache...
[ERROR]   GlobalImmutableTxIndexIT>BaseIndexIT.testInClauseWithIndexOnColumnOfUsignedIntType:470
» Runtime
[ERROR]   GlobalImmutableTxIndexIT>BaseIndexIT.testInClauseWithIndexOnColumnOfUsignedIntType:470
» Runtime
[ERROR]   GlobalImmutableTxIndexIT>BaseIndexIT.testInFilterOnIndexedTable:1008 » Runtime
[ERROR]   GlobalImmutableTxIndexIT>BaseIndexIT.testInFilterOnIndexedTable:1008 » Runtime
[ERROR]   GlobalImmutableTxIndexIT>BaseIndexIT.testIndexWithCaseSensitiveCols:893 » Runtime
[ERROR]   GlobalImmutableTxIndexIT>BaseIndexIT.testIndexWithCaseSensitiveCols:893 » Runtime
[ERROR]   GlobalImmutableTxIndexIT>BaseIndexIT.testIndexWithDecimalCol:1031 » Runtime
or...
[ERROR]   GlobalImmutableTxIndexIT>BaseIndexIT.testIndexWithDecimalCol:1031 » Runtime
or...
[ERROR]   GlobalImmutableTxIndexIT>BaseIndexIT.testIndexWithNullableDateCol:539 » Runtime
[ERROR]   GlobalImmutableTxIndexIT>BaseIndexIT.testIndexWithNullableDateCol:539 » Runtime
[ERROR]   GlobalImmutableTxIndexIT>BaseIndexIT.testIndexWithNullableFixedWithCols:132 »
Runtime
[ERROR]   GlobalImmutableTxIndexIT>BaseIndexIT.testIndexWithNullableFixedWithCols:132 »
Runtime
[ERROR]   GlobalImmutableTxIndexIT>BaseIndexIT.testMultipleUpdatesAcrossRegions:803 »
Runtime
[ERROR]   GlobalImmutableTxIndexIT>BaseIndexIT.testMultipleUpdatesAcrossRegions:803 »
Runtime
[ERROR]   GlobalImmutableTxIndexIT>BaseIndexIT.testReturnedTimestamp:1168->BaseTest.initATableValues:1083->BaseTest.ensureTableCreated:717->BaseTest.createTestTable:775->BaseTest.createTestTable:811
» Runtime
[ERROR]   GlobalImmutableTxIndexIT>BaseIndexIT.testReturnedTimestamp:1168->BaseTest.initATableValues:1083->BaseTest.ensureTableCreated:717->BaseTest.createTestTable:775->BaseTest.createTestTable:811
» Runtime
[ERROR]   GlobalImmutableTxIndexIT>BaseIndexIT.testSelectAllAndAliasWithIndex:598 » Runtime
[ERROR]   GlobalImmutableTxIndexIT>BaseIndexIT.testSelectAllAndAliasWithIndex:598 » Runtime
[ERROR]   GlobalImmutableTxIndexIT>BaseIndexIT.testSelectCF:677 » Runtime org.apache.thr...
[ERROR]   GlobalImmutableTxIndexIT>BaseIndexIT.testSelectCF:677 » Runtime org.apache.thr...
[ERROR]   GlobalImmutableTxIndexIT>BaseIndexIT.testSelectDistinctOnTableWithSecondaryImmutableIndex:445
» Runtime
[ERROR]   GlobalImmutableTxIndexIT>BaseIndexIT.testSelectDistinctOnTableWithSecondaryImmutableIndex:445
» Runtime
[ERROR]   GlobalImmutableTxIndexIT>BaseIndexIT.testTableDescriptorPriority:1093 » Runtime
[ERROR]   GlobalImmutableTxIndexIT>BaseIndexIT.testTableDescriptorPriority:1093 » Runtime
[ERROR]   GlobalImmutableTxIndexIT>BaseIndexIT.testUpsertAfterIndexDrop:738 » Runtime
or...
[ERROR]   GlobalImmutableTxIndexIT>BaseIndexIT.testUpsertAfterIndexDrop:738 » Runtime
or...
[INFO] 
[ERROR] Tests run: 3370, Failures: 3, Errors: 39, Skipped: 7
[INFO] 
[INFO] 
[INFO] --- maven-failsafe-plugin:2.20:integration-test (HBaseManagedTimeTests) @ phoenix-core
---
[INFO] 
[INFO] -------------------------------------------------------
[INFO]  T E S T S
[INFO] -------------------------------------------------------
[INFO] 
[INFO] Results:
[INFO] 
[INFO] Tests run: 0, Failures: 0, Errors: 0, Skipped: 0
[INFO] 
[INFO] 
[INFO] --- maven-failsafe-plugin:2.20:integration-test (NeedTheirOwnClusterTests) @ phoenix-core
---
[INFO] 
[INFO] -------------------------------------------------------
[INFO]  T E S T S
[INFO] -------------------------------------------------------
[INFO] Running org.apache.hadoop.hbase.regionserver.wal.WALReplayWithIndexWritesAndCompressedWALIT
[INFO] Running org.apache.phoenix.end2end.ChangePermissionsIT
[INFO] Running org.apache.phoenix.end2end.ConnectionUtilIT
[INFO] Tests run: 1, Failures: 0, Errors: 0, Skipped: 0, Time elapsed: 34.637 s - in org.apache.hadoop.hbase.regionserver.wal.WALReplayWithIndexWritesAndCompressedWALIT
[INFO] Running org.apache.hadoop.hbase.regionserver.wal.WALRecoveryRegionPostOpenIT
[INFO] Running org.apache.phoenix.end2end.ColumnEncodedImmutableNonTxStatsCollectorIT
[INFO] Running org.apache.phoenix.end2end.ColumnEncodedMutableNonTxStatsCollectorIT
[INFO] Running org.apache.phoenix.end2end.ColumnEncodedImmutableTxStatsCollectorIT
[INFO] Running org.apache.phoenix.end2end.ColumnEncodedMutableTxStatsCollectorIT
[INFO] Tests run: 1, Failures: 0, Errors: 0, Skipped: 0, Time elapsed: 12.668 s - in org.apache.hadoop.hbase.regionserver.wal.WALRecoveryRegionPostOpenIT
[INFO] Tests run: 1, Failures: 0, Errors: 0, Skipped: 0, Time elapsed: 43.772 s - in org.apache.phoenix.end2end.ConnectionUtilIT
[INFO] Running org.apache.phoenix.end2end.ContextClassloaderIT
[INFO] Tests run: 3, Failures: 0, Errors: 0, Skipped: 0, Time elapsed: 4.672 s - in org.apache.phoenix.end2end.ContextClassloaderIT
[INFO] Running org.apache.phoenix.end2end.CountDistinctCompressionIT
[INFO] Tests run: 1, Failures: 0, Errors: 0, Skipped: 0, Time elapsed: 4.699 s - in org.apache.phoenix.end2end.CountDistinctCompressionIT
[INFO] Running org.apache.phoenix.end2end.CostBasedDecisionIT
[INFO] Running org.apache.phoenix.end2end.CsvBulkLoadToolIT
[INFO] Running org.apache.phoenix.end2end.DropSchemaIT
[WARNING] Tests run: 26, Failures: 0, Errors: 0, Skipped: 4, Time elapsed: 160.748 s - in
org.apache.phoenix.end2end.ColumnEncodedImmutableNonTxStatsCollectorIT
[WARNING] Tests run: 26, Failures: 0, Errors: 0, Skipped: 4, Time elapsed: 158.233 s - in
org.apache.phoenix.end2end.ColumnEncodedMutableNonTxStatsCollectorIT
[INFO] Tests run: 2, Failures: 0, Errors: 0, Skipped: 0, Time elapsed: 20.001 s - in org.apache.phoenix.end2end.DropSchemaIT
[WARNING] Tests run: 26, Failures: 0, Errors: 0, Skipped: 4, Time elapsed: 168.887 s - in
org.apache.phoenix.end2end.ColumnEncodedImmutableTxStatsCollectorIT
[WARNING] Tests run: 26, Failures: 0, Errors: 0, Skipped: 4, Time elapsed: 171.714 s - in
org.apache.phoenix.end2end.ColumnEncodedMutableTxStatsCollectorIT
[INFO] Tests run: 12, Failures: 0, Errors: 0, Skipped: 0, Time elapsed: 113.791 s - in org.apache.phoenix.end2end.CsvBulkLoadToolIT
[INFO] Running org.apache.phoenix.end2end.FlappingLocalIndexIT
[INFO] Running org.apache.phoenix.end2end.IndexExtendedIT
[INFO] Running org.apache.phoenix.end2end.IndexScrutinyToolIT
[INFO] Running org.apache.phoenix.end2end.IndexToolForPartialBuildIT
[INFO] Running org.apache.phoenix.end2end.IndexToolForPartialBuildWithNamespaceEnabledIT
[INFO] Running org.apache.phoenix.end2end.IndexToolIT
[INFO] Tests run: 12, Failures: 0, Errors: 0, Skipped: 0, Time elapsed: 183.612 s - in org.apache.phoenix.end2end.FlappingLocalIndexIT
[INFO] Tests run: 32, Failures: 0, Errors: 0, Skipped: 0, Time elapsed: 192.899 s - in org.apache.phoenix.end2end.IndexExtendedIT
[INFO] Running org.apache.phoenix.end2end.MigrateSystemTablesToSystemNamespaceIT
[INFO] Running org.apache.phoenix.end2end.LocalIndexSplitMergeIT
[INFO] Tests run: 2, Failures: 0, Errors: 0, Skipped: 0, Time elapsed: 68.316 s - in org.apache.phoenix.end2end.LocalIndexSplitMergeIT
[INFO] Tests run: 20, Failures: 0, Errors: 0, Skipped: 0, Time elapsed: 494.815 s - in org.apache.phoenix.end2end.CostBasedDecisionIT
[INFO] Running org.apache.phoenix.end2end.NonColumnEncodedImmutableNonTxStatsCollectorIT
[INFO] Running org.apache.phoenix.end2end.NonColumnEncodedImmutableTxStatsCollectorIT
[INFO] Tests run: 33, Failures: 0, Errors: 0, Skipped: 0, Time elapsed: 461.835 s - in org.apache.phoenix.end2end.IndexScrutinyToolIT
[INFO] Running org.apache.phoenix.end2end.PartialResultServerConfigurationIT
[INFO] Tests run: 4, Failures: 0, Errors: 0, Skipped: 0, Time elapsed: 309.031 s - in org.apache.phoenix.end2end.MigrateSystemTablesToSystemNamespaceIT
[WARNING] Tests run: 26, Failures: 0, Errors: 0, Skipped: 4, Time elapsed: 155.262 s - in
org.apache.phoenix.end2end.NonColumnEncodedImmutableNonTxStatsCollectorIT
[INFO] Running org.apache.phoenix.end2end.PhoenixDriverIT
[INFO] Tests run: 12, Failures: 0, Errors: 0, Skipped: 0, Time elapsed: 834.095 s - in org.apache.phoenix.end2end.ChangePermissionsIT
[INFO] Tests run: 1, Failures: 0, Errors: 0, Skipped: 0, Time elapsed: 37.794 s - in org.apache.phoenix.end2end.PartialResultServerConfigurationIT
[WARNING] Tests run: 26, Failures: 0, Errors: 0, Skipped: 4, Time elapsed: 148.486 s - in
org.apache.phoenix.end2end.NonColumnEncodedImmutableTxStatsCollectorIT
[INFO] Running org.apache.phoenix.end2end.QueryWithLimitIT
[INFO] Tests run: 2, Failures: 0, Errors: 0, Skipped: 0, Time elapsed: 589.309 s - in org.apache.phoenix.end2end.IndexToolForPartialBuildIT
[INFO] Running org.apache.phoenix.end2end.QueryTimeoutIT
[INFO] Tests run: 2, Failures: 0, Errors: 0, Skipped: 0, Time elapsed: 590.369 s - in org.apache.phoenix.end2end.IndexToolForPartialBuildWithNamespaceEnabledIT
[INFO] Tests run: 2, Failures: 0, Errors: 0, Skipped: 0, Time elapsed: 7.367 s - in org.apache.phoenix.end2end.QueryWithLimitIT
[INFO] Running org.apache.phoenix.end2end.RebuildIndexConnectionPropsIT
[INFO] Tests run: 1, Failures: 0, Errors: 0, Skipped: 0, Time elapsed: 0.53 s - in org.apache.phoenix.end2end.RebuildIndexConnectionPropsIT
[INFO] Tests run: 2, Failures: 0, Errors: 0, Skipped: 0, Time elapsed: 12.375 s - in org.apache.phoenix.end2end.QueryTimeoutIT
[INFO] Tests run: 4, Failures: 0, Errors: 0, Skipped: 0, Time elapsed: 73.785 s - in org.apache.phoenix.end2end.PhoenixDriverIT
[INFO] Running org.apache.phoenix.end2end.RegexBulkLoadToolIT
[INFO] Running org.apache.phoenix.end2end.SystemTablePermissionsIT
[INFO] Running org.apache.phoenix.end2end.TableDDLPermissionsIT
[INFO] Running org.apache.phoenix.end2end.RenewLeaseIT
[INFO] Running org.apache.phoenix.end2end.SpillableGroupByIT
[INFO] Running org.apache.phoenix.end2end.SysTableNamespaceMappedStatsCollectorIT
[INFO] Running org.apache.phoenix.end2end.TableSnapshotReadsMapReduceIT
[INFO] Tests run: 2, Failures: 0, Errors: 0, Skipped: 0, Time elapsed: 11.544 s - in org.apache.phoenix.end2end.SpillableGroupByIT
[INFO] Tests run: 1, Failures: 0, Errors: 0, Skipped: 0, Time elapsed: 28.463 s - in org.apache.phoenix.end2end.RenewLeaseIT
[INFO] Tests run: 3, Failures: 0, Errors: 0, Skipped: 0, Time elapsed: 28.702 s - in org.apache.phoenix.end2end.TableSnapshotReadsMapReduceIT
[INFO] Tests run: 10, Failures: 0, Errors: 0, Skipped: 0, Time elapsed: 90.207 s - in org.apache.phoenix.end2end.RegexBulkLoadToolIT
[INFO] Running org.apache.phoenix.end2end.UpdateCacheAcrossDifferentClientsIT
[INFO] Tests run: 2, Failures: 0, Errors: 0, Skipped: 0, Time elapsed: 123.664 s - in org.apache.phoenix.end2end.SystemTablePermissionsIT
[INFO] Running org.apache.phoenix.end2end.UserDefinedFunctionsIT
[INFO] Running org.apache.phoenix.end2end.index.ImmutableIndexIT
[INFO] Running org.apache.phoenix.end2end.index.LocalIndexIT
[INFO] Running org.apache.phoenix.end2end.index.MutableIndexFailureIT
[INFO] Tests run: 6, Failures: 0, Errors: 0, Skipped: 0, Time elapsed: 56.985 s - in org.apache.phoenix.end2end.UpdateCacheAcrossDifferentClientsIT
[WARNING] Tests run: 26, Failures: 0, Errors: 0, Skipped: 4, Time elapsed: 165.092 s - in
org.apache.phoenix.end2end.SysTableNamespaceMappedStatsCollectorIT
[INFO] Tests run: 14, Failures: 0, Errors: 0, Skipped: 0, Time elapsed: 91.456 s - in org.apache.phoenix.end2end.UserDefinedFunctionsIT
[INFO] Running org.apache.phoenix.end2end.index.MutableIndexReplicationIT
[INFO] Running org.apache.phoenix.end2end.index.PartialIndexRebuilderIT
[INFO] Tests run: 1, Failures: 0, Errors: 0, Skipped: 0, Time elapsed: 40.46 s - in org.apache.phoenix.end2end.index.MutableIndexReplicationIT
[INFO] Running org.apache.phoenix.end2end.index.txn.TxWriteFailureIT
[INFO] Tests run: 8, Failures: 0, Errors: 0, Skipped: 0, Time elapsed: 78.993 s - in org.apache.phoenix.end2end.index.txn.TxWriteFailureIT
[INFO] Running org.apache.phoenix.execute.PartialCommitIT
[INFO] Tests run: 12, Failures: 0, Errors: 0, Skipped: 0, Time elapsed: 0.908 s - in org.apache.phoenix.execute.PartialCommitIT
[INFO] Running org.apache.phoenix.hbase.index.FailForUnsupportedHBaseVersionsIT
[INFO] Tests run: 2, Failures: 0, Errors: 0, Skipped: 0, Time elapsed: 21.003 s - in org.apache.phoenix.hbase.index.FailForUnsupportedHBaseVersionsIT
[INFO] Tests run: 64, Failures: 0, Errors: 0, Skipped: 0, Time elapsed: 995.071 s - in org.apache.phoenix.end2end.IndexToolIT
[INFO] Running org.apache.phoenix.execute.UpsertSelectOverlappingBatchesIT
[INFO] Running org.apache.phoenix.iterate.RoundRobinResultIteratorWithStatsIT
[INFO] Tests run: 4, Failures: 0, Errors: 0, Skipped: 0, Time elapsed: 459.82 s - in org.apache.phoenix.end2end.TableDDLPermissionsIT
[INFO] Tests run: 1, Failures: 0, Errors: 0, Skipped: 0, Time elapsed: 8.503 s - in org.apache.phoenix.iterate.RoundRobinResultIteratorWithStatsIT
[INFO] Running org.apache.phoenix.iterate.ScannerLeaseRenewalIT
[INFO] Tests run: 3, Failures: 0, Errors: 0, Skipped: 0, Time elapsed: 84.103 s - in org.apache.phoenix.execute.UpsertSelectOverlappingBatchesIT
[INFO] Running org.apache.phoenix.monitoring.PhoenixMetricsIT
[INFO] Running org.apache.phoenix.rpc.PhoenixClientRpcIT
[INFO] Tests run: 2, Failures: 0, Errors: 0, Skipped: 0, Time elapsed: 11.593 s - in org.apache.phoenix.rpc.PhoenixClientRpcIT
[INFO] Running org.apache.phoenix.rpc.PhoenixServerRpcIT
[INFO] Tests run: 2, Failures: 0, Errors: 0, Skipped: 0, Time elapsed: 20.1 s - in org.apache.phoenix.rpc.PhoenixServerRpcIT
[WARNING] Tests run: 40, Failures: 0, Errors: 0, Skipped: 16, Time elapsed: 429.169 s - in
org.apache.phoenix.end2end.index.ImmutableIndexIT
[INFO] Tests run: 22, Failures: 0, Errors: 0, Skipped: 0, Time elapsed: 112.167 s - in org.apache.phoenix.monitoring.PhoenixMetricsIT
[INFO] Tests run: 36, Failures: 0, Errors: 0, Skipped: 0, Time elapsed: 468.285 s - in org.apache.phoenix.end2end.index.LocalIndexIT
[INFO] Tests run: 26, Failures: 0, Errors: 0, Skipped: 0, Time elapsed: 375.462 s - in org.apache.phoenix.end2end.index.PartialIndexRebuilderIT
[INFO] Tests run: 2, Failures: 0, Errors: 0, Skipped: 0, Time elapsed: 169.448 s - in org.apache.phoenix.iterate.ScannerLeaseRenewalIT
[ERROR] Tests run: 21, Failures: 0, Errors: 4, Skipped: 0, Time elapsed: 526.063 s <<<
FAILURE! - in org.apache.phoenix.end2end.index.MutableIndexFailureIT
[ERROR] testIndexWriteFailure[MutableIndexFailureIT_transactional=true,localIndex=false,isNamespaceMapped=false,disableIndexOnWriteFailure=true,failRebuildTask=false,throwIndexWriteFailure=null](org.apache.phoenix.end2end.index.MutableIndexFailureIT)
 Time elapsed: 46.143 s  <<< ERROR!
java.lang.RuntimeException: org.apache.thrift.TException: Unable to discover transaction service.
	at org.apache.phoenix.end2end.index.MutableIndexFailureIT.testIndexWriteFailure(MutableIndexFailureIT.java:241)
Caused by: org.apache.thrift.TException: Unable to discover transaction service.
	at org.apache.phoenix.end2end.index.MutableIndexFailureIT.testIndexWriteFailure(MutableIndexFailureIT.java:241)

[ERROR] testIndexWriteFailure[MutableIndexFailureIT_transactional=true,localIndex=false,isNamespaceMapped=true,disableIndexOnWriteFailure=true,failRebuildTask=false,throwIndexWriteFailure=null](org.apache.phoenix.end2end.index.MutableIndexFailureIT)
 Time elapsed: 46.248 s  <<< ERROR!
java.lang.RuntimeException: org.apache.thrift.TException: Unable to discover transaction service.
	at org.apache.phoenix.end2end.index.MutableIndexFailureIT.testIndexWriteFailure(MutableIndexFailureIT.java:241)
Caused by: org.apache.thrift.TException: Unable to discover transaction service.
	at org.apache.phoenix.end2end.index.MutableIndexFailureIT.testIndexWriteFailure(MutableIndexFailureIT.java:241)

[ERROR] testIndexWriteFailure[MutableIndexFailureIT_transactional=true,localIndex=true,isNamespaceMapped=false,disableIndexOnWriteFailure=true,failRebuildTask=false,throwIndexWriteFailure=null](org.apache.phoenix.end2end.index.MutableIndexFailureIT)
 Time elapsed: 46.115 s  <<< ERROR!
java.lang.RuntimeException: org.apache.thrift.TException: Unable to discover transaction service.
	at org.apache.phoenix.end2end.index.MutableIndexFailureIT.testIndexWriteFailure(MutableIndexFailureIT.java:241)
Caused by: org.apache.thrift.TException: Unable to discover transaction service.
	at org.apache.phoenix.end2end.index.MutableIndexFailureIT.testIndexWriteFailure(MutableIndexFailureIT.java:241)

[ERROR] testIndexWriteFailure[MutableIndexFailureIT_transactional=true,localIndex=true,isNamespaceMapped=true,disableIndexOnWriteFailure=null,failRebuildTask=false,throwIndexWriteFailure=null](org.apache.phoenix.end2end.index.MutableIndexFailureIT)
 Time elapsed: 46.186 s  <<< ERROR!
java.lang.RuntimeException: org.apache.thrift.TException: Unable to discover transaction service.
	at org.apache.phoenix.end2end.index.MutableIndexFailureIT.testIndexWriteFailure(MutableIndexFailureIT.java:241)
Caused by: org.apache.thrift.TException: Unable to discover transaction service.
	at org.apache.phoenix.end2end.index.MutableIndexFailureIT.testIndexWriteFailure(MutableIndexFailureIT.java:241)

[INFO] 
[INFO] Results:
[INFO] 
[ERROR] Errors: 
[ERROR]   MutableIndexFailureIT.testIndexWriteFailure:241 » Runtime org.apache.thrift.TE...
[ERROR]   MutableIndexFailureIT.testIndexWriteFailure:241 » Runtime org.apache.thrift.TE...
[ERROR]   MutableIndexFailureIT.testIndexWriteFailure:241 » Runtime org.apache.thrift.TE...
[ERROR]   MutableIndexFailureIT.testIndexWriteFailure:241 » Runtime org.apache.thrift.TE...
[INFO] 
[ERROR] Tests run: 616, Failures: 0, Errors: 4, Skipped: 44
[INFO] 
[INFO] 
[INFO] --- maven-failsafe-plugin:2.20:verify (ParallelStatsEnabledTest) @ phoenix-core ---
[INFO] ------------------------------------------------------------------------
[INFO] Reactor Summary:
[INFO] 
[INFO] Apache Phoenix ..................................... SUCCESS [  1.931 s]
[INFO] Phoenix Core ....................................... FAILURE [  01:56 h]
[INFO] Phoenix - Flume .................................... SKIPPED
[INFO] Phoenix - Kafka .................................... SKIPPED
[INFO] Phoenix - Pig ...................................... SKIPPED
[INFO] Phoenix Query Server Client ........................ SKIPPED
[INFO] Phoenix Query Server ............................... SKIPPED
[INFO] Phoenix - Pherf .................................... SKIPPED
[INFO] Phoenix - Spark .................................... SKIPPED
[INFO] Phoenix - Hive ..................................... SKIPPED
[INFO] Phoenix Client ..................................... SKIPPED
[INFO] Phoenix Server ..................................... SKIPPED
[INFO] Phoenix Assembly ................................... SKIPPED
[INFO] Phoenix - Tracing Web Application .................. SKIPPED
[INFO] Phoenix Load Balancer .............................. SKIPPED
[INFO] ------------------------------------------------------------------------
[INFO] BUILD FAILURE
[INFO] ------------------------------------------------------------------------
[INFO] Total time: 01:56 h
[INFO] Finished at: 2018-02-15T07:26:16Z
[INFO] Final Memory: 62M/1441M
[INFO] ------------------------------------------------------------------------
[ERROR] Failed to execute goal org.apache.maven.plugins:maven-failsafe-plugin:2.20:verify
(ParallelStatsEnabledTest) on project phoenix-core: There are test failures.
[ERROR] 
[ERROR] Please refer to <https://builds.apache.org/job/Phoenix-4.x-HBase-1.2/ws/phoenix-core/target/failsafe-reports>
for the individual test results.
[ERROR] Please refer to dump files (if any exist) [date]-jvmRun[N].dump, [date].dumpstream
and [date]-jvmRun[N].dumpstream.
[ERROR] -> [Help 1]
[ERROR] 
[ERROR] To see the full stack trace of the errors, re-run Maven with the -e switch.
[ERROR] Re-run Maven using the -X switch to enable full debug logging.
[ERROR] 
[ERROR] For more information about the errors and possible solutions, please read the following
articles:
[ERROR] [Help 1] http://cwiki.apache.org/confluence/display/MAVEN/MojoFailureException
[ERROR] 
[ERROR] After correcting the problems, you can resume the build with the command
[ERROR]   mvn <goals> -rf :phoenix-core
Build step 'Invoke top-level Maven targets' marked build as failure
Archiving artifacts
[Fast Archiver] Compressed -538392791 B of artifacts by 380.6% relative to #268
Recording test results

Mime
View raw message