phoenix-commits mailing list archives

Site index · List index
Message view « Date » · « Thread »
Top « Date » · « Thread »
From Apache Jenkins Server <jenk...@builds.apache.org>
Subject Build failed in Jenkins: Phoenix-4.x-HBase-1.2 #270
Date Thu, 15 Feb 2018 05:29:00 GMT
See <https://builds.apache.org/job/Phoenix-4.x-HBase-1.2/270/display/redirect?page=changes>

Changes:

[jtaylor] PHOENIX-2566 Support NOT NULL constraint for any column for immutable

------------------------------------------
[...truncated 107.32 KB...]
[INFO] Running org.apache.phoenix.end2end.join.HashJoinGlobalIndexIT
[INFO] Tests run: 6, Failures: 0, Errors: 0, Skipped: 0, Time elapsed: 107.471 s - in org.apache.phoenix.end2end.index.txn.MutableRollbackIT
[INFO] Running org.apache.phoenix.end2end.join.HashJoinLocalIndexIT
[INFO] Tests run: 8, Failures: 0, Errors: 0, Skipped: 0, Time elapsed: 84.096 s - in org.apache.phoenix.end2end.index.txn.RollbackIT
[INFO] Running org.apache.phoenix.end2end.join.HashJoinMoreIT
[INFO] Tests run: 40, Failures: 0, Errors: 0, Skipped: 0, Time elapsed: 457.677 s - in org.apache.phoenix.end2end.index.LocalMutableNonTxIndexIT
[INFO] Tests run: 40, Failures: 0, Errors: 0, Skipped: 0, Time elapsed: 456.184 s - in org.apache.phoenix.end2end.index.LocalImmutableNonTxIndexIT
[INFO] Running org.apache.phoenix.end2end.join.HashJoinNoIndexIT
[INFO] Tests run: 40, Failures: 0, Errors: 0, Skipped: 0, Time elapsed: 476.643 s - in org.apache.phoenix.end2end.index.LocalImmutableTxIndexIT
[ERROR] Tests run: 8, Failures: 1, Errors: 0, Skipped: 0, Time elapsed: 93.052 s <<<
FAILURE! - in org.apache.phoenix.end2end.join.HashJoinMoreIT
[ERROR] testBug2894(org.apache.phoenix.end2end.join.HashJoinMoreIT)  Time elapsed: 9.001 s
 <<< FAILURE!
org.junit.ComparisonFailure: 
expected:<...O DISTINCT ROWS BY [[E.BUCKET, "E.TIMESTAMP"]]
CLIENT MERGE SORT
...> but was:<...O DISTINCT ROWS BY [["E.TIMESTAMP", E.BUCKET]]
CLIENT MERGE SORT
...>
	at org.apache.phoenix.end2end.join.HashJoinMoreIT.testBug2894(HashJoinMoreIT.java:806)

[INFO] Running org.apache.phoenix.end2end.join.SortMergeJoinNoIndexIT
[INFO] Tests run: 40, Failures: 0, Errors: 0, Skipped: 0, Time elapsed: 473.809 s - in org.apache.phoenix.end2end.index.LocalMutableTxIndexIT
[INFO] Running org.apache.phoenix.end2end.join.SortMergeJoinGlobalIndexIT
[INFO] Running org.apache.phoenix.end2end.join.SortMergeJoinLocalIndexIT
[INFO] Running org.apache.phoenix.end2end.join.SubqueryIT
[INFO] Tests run: 33, Failures: 0, Errors: 0, Skipped: 0, Time elapsed: 353.864 s - in org.apache.phoenix.end2end.join.HashJoinNoIndexIT
[INFO] Tests run: 64, Failures: 0, Errors: 0, Skipped: 0, Time elapsed: 716.163 s - in org.apache.phoenix.end2end.index.MutableIndexIT
[INFO] Tests run: 34, Failures: 0, Errors: 0, Skipped: 0, Time elapsed: 356.398 s - in org.apache.phoenix.end2end.join.SortMergeJoinNoIndexIT
[INFO] Running org.apache.phoenix.end2end.salted.SaltedTableIT
[INFO] Running org.apache.phoenix.end2end.join.SubqueryUsingSortMergeJoinIT
[INFO] Running org.apache.phoenix.end2end.salted.SaltedTableUpsertSelectIT
[INFO] Tests run: 8, Failures: 0, Errors: 0, Skipped: 0, Time elapsed: 24.491 s - in org.apache.phoenix.end2end.salted.SaltedTableIT
[INFO] Running org.apache.phoenix.end2end.salted.SaltedTableVarLengthRowKeyIT
[INFO] Tests run: 1, Failures: 0, Errors: 0, Skipped: 0, Time elapsed: 4.361 s - in org.apache.phoenix.end2end.salted.SaltedTableVarLengthRowKeyIT
[INFO] Running org.apache.phoenix.iterate.PhoenixQueryTimeoutIT
[INFO] Tests run: 2, Failures: 0, Errors: 0, Skipped: 0, Time elapsed: 8.859 s - in org.apache.phoenix.iterate.PhoenixQueryTimeoutIT
[INFO] Running org.apache.phoenix.iterate.RoundRobinResultIteratorIT
[INFO] Tests run: 24, Failures: 0, Errors: 0, Skipped: 0, Time elapsed: 384.127 s - in org.apache.phoenix.end2end.join.SubqueryIT
[INFO] Tests run: 6, Failures: 0, Errors: 0, Skipped: 0, Time elapsed: 49.751 s - in org.apache.phoenix.end2end.salted.SaltedTableUpsertSelectIT
[INFO] Running org.apache.phoenix.rpc.UpdateCacheIT
[INFO] Tests run: 33, Failures: 0, Errors: 0, Skipped: 0, Time elapsed: 605.27 s - in org.apache.phoenix.end2end.join.HashJoinGlobalIndexIT
[INFO] Running org.apache.phoenix.replication.SystemCatalogWALEntryFilterIT
[INFO] Tests run: 2, Failures: 0, Errors: 0, Skipped: 0, Time elapsed: 0.266 s - in org.apache.phoenix.replication.SystemCatalogWALEntryFilterIT
[INFO] Running org.apache.phoenix.trace.PhoenixTracingEndToEndIT
[INFO] Tests run: 7, Failures: 0, Errors: 0, Skipped: 0, Time elapsed: 43.389 s - in org.apache.phoenix.rpc.UpdateCacheIT
[INFO] Running org.apache.phoenix.tx.FlappingTransactionIT
[INFO] Running org.apache.phoenix.trace.PhoenixTableMetricsWriterIT
[INFO] Tests run: 4, Failures: 0, Errors: 0, Skipped: 0, Time elapsed: 22.221 s - in org.apache.phoenix.tx.FlappingTransactionIT
[INFO] Running org.apache.phoenix.tx.ParameterizedTransactionIT
[INFO] Tests run: 9, Failures: 0, Errors: 0, Skipped: 0, Time elapsed: 88.512 s - in org.apache.phoenix.iterate.RoundRobinResultIteratorIT
[INFO] Running org.apache.phoenix.tx.TransactionIT
[INFO] Tests run: 2, Failures: 0, Errors: 0, Skipped: 0, Time elapsed: 18.633 s - in org.apache.phoenix.trace.PhoenixTableMetricsWriterIT
[INFO] Running org.apache.phoenix.tx.TxCheckpointIT
[INFO] Tests run: 8, Failures: 0, Errors: 0, Skipped: 0, Time elapsed: 111.184 s - in org.apache.phoenix.trace.PhoenixTracingEndToEndIT
[INFO] Running org.apache.phoenix.util.IndexScrutinyIT
[INFO] Tests run: 3, Failures: 0, Errors: 0, Skipped: 0, Time elapsed: 29.58 s - in org.apache.phoenix.util.IndexScrutinyIT
[INFO] Tests run: 8, Failures: 0, Errors: 0, Skipped: 0, Time elapsed: 111.635 s - in org.apache.phoenix.tx.TransactionIT
[INFO] Tests run: 34, Failures: 0, Errors: 0, Skipped: 0, Time elapsed: 641.725 s - in org.apache.phoenix.end2end.join.SortMergeJoinGlobalIndexIT
[INFO] Tests run: 15, Failures: 0, Errors: 0, Skipped: 0, Time elapsed: 297.946 s - in org.apache.phoenix.end2end.join.SubqueryUsingSortMergeJoinIT
[INFO] Tests run: 34, Failures: 0, Errors: 0, Skipped: 0, Time elapsed: 812.571 s - in org.apache.phoenix.end2end.join.HashJoinLocalIndexIT
[WARNING] Tests run: 52, Failures: 0, Errors: 0, Skipped: 4, Time elapsed: 326.955 s - in
org.apache.phoenix.tx.ParameterizedTransactionIT
[INFO] Tests run: 34, Failures: 0, Errors: 0, Skipped: 0, Time elapsed: 805.641 s - in org.apache.phoenix.end2end.join.SortMergeJoinLocalIndexIT
[INFO] Tests run: 40, Failures: 0, Errors: 0, Skipped: 0, Time elapsed: 408.975 s - in org.apache.phoenix.tx.TxCheckpointIT
[INFO] 
[INFO] Results:
[INFO] 
[ERROR] Failures: 
[ERROR]   QueryDatabaseMetaDataIT.testAddPKColumn:964 ERROR 1006 (42J04): Only nullable columns
may be added to primary key. columnName=Z_STRING
[ERROR]   SortMergeJoinMoreIT.testBug2894:463 expected:<...CLIENT SORTED BY [E.[BUCKET,
E.TIMESTAMP]
CLIENT AGGREGATE INTO DISTINCT ROWS BY [E.BUCKET, E.TIMESTAMP]]> but was:<...CLIENT
SORTED BY [E.[TIMESTAMP, E.BUCKET]
CLIENT AGGREGATE INTO DISTINCT ROWS BY [E.TIMESTAMP, E.BUCKET]]>
[ERROR]   HashJoinMoreIT.testBug2894:806 expected:<...O DISTINCT ROWS BY [[E.BUCKET, "E.TIMESTAMP"]]
CLIENT MERGE SORT
...> but was:<...O DISTINCT ROWS BY [["E.TIMESTAMP", E.BUCKET]]
CLIENT MERGE SORT
...>
[ERROR] Errors: 
[ERROR]   VariableLengthPKIT.testMissingPKColumn:884 ยป NullPointer
[INFO] 
[ERROR] Tests run: 3370, Failures: 3, Errors: 1, Skipped: 7
[INFO] 
[INFO] 
[INFO] --- maven-failsafe-plugin:2.20:integration-test (HBaseManagedTimeTests) @ phoenix-core
---
[INFO] 
[INFO] -------------------------------------------------------
[INFO]  T E S T S
[INFO] -------------------------------------------------------
[INFO] 
[INFO] Results:
[INFO] 
[INFO] Tests run: 0, Failures: 0, Errors: 0, Skipped: 0
[INFO] 
[INFO] 
[INFO] --- maven-failsafe-plugin:2.20:integration-test (NeedTheirOwnClusterTests) @ phoenix-core
---
[INFO] 
[INFO] -------------------------------------------------------
[INFO]  T E S T S
[INFO] -------------------------------------------------------
[INFO] Running org.apache.hadoop.hbase.regionserver.wal.WALReplayWithIndexWritesAndCompressedWALIT
[INFO] Running org.apache.phoenix.end2end.ChangePermissionsIT
[INFO] Running org.apache.phoenix.end2end.ConnectionUtilIT
[INFO] Tests run: 1, Failures: 0, Errors: 0, Skipped: 0, Time elapsed: 34.146 s - in org.apache.hadoop.hbase.regionserver.wal.WALReplayWithIndexWritesAndCompressedWALIT
[INFO] Running org.apache.hadoop.hbase.regionserver.wal.WALRecoveryRegionPostOpenIT
[INFO] Running org.apache.phoenix.end2end.ColumnEncodedMutableTxStatsCollectorIT
[INFO] Running org.apache.phoenix.end2end.ColumnEncodedMutableNonTxStatsCollectorIT
[INFO] Tests run: 1, Failures: 0, Errors: 0, Skipped: 0, Time elapsed: 8.257 s - in org.apache.hadoop.hbase.regionserver.wal.WALRecoveryRegionPostOpenIT
[INFO] Running org.apache.phoenix.end2end.ColumnEncodedImmutableTxStatsCollectorIT
[INFO] Running org.apache.phoenix.end2end.ColumnEncodedImmutableNonTxStatsCollectorIT
[INFO] Tests run: 1, Failures: 0, Errors: 0, Skipped: 0, Time elapsed: 44.212 s - in org.apache.phoenix.end2end.ConnectionUtilIT
[INFO] Running org.apache.phoenix.end2end.ContextClassloaderIT
[INFO] Tests run: 3, Failures: 0, Errors: 0, Skipped: 0, Time elapsed: 2.645 s - in org.apache.phoenix.end2end.ContextClassloaderIT
[INFO] Running org.apache.phoenix.end2end.CountDistinctCompressionIT
[INFO] Tests run: 1, Failures: 0, Errors: 0, Skipped: 0, Time elapsed: 4.757 s - in org.apache.phoenix.end2end.CountDistinctCompressionIT
[INFO] Running org.apache.phoenix.end2end.CostBasedDecisionIT
[INFO] Running org.apache.phoenix.end2end.CsvBulkLoadToolIT
[INFO] Running org.apache.phoenix.end2end.DropSchemaIT
[WARNING] Tests run: 26, Failures: 0, Errors: 0, Skipped: 4, Time elapsed: 149.569 s - in
org.apache.phoenix.end2end.ColumnEncodedMutableNonTxStatsCollectorIT
[WARNING] Tests run: 26, Failures: 0, Errors: 0, Skipped: 4, Time elapsed: 155.856 s - in
org.apache.phoenix.end2end.ColumnEncodedMutableTxStatsCollectorIT
[WARNING] Tests run: 26, Failures: 0, Errors: 0, Skipped: 4, Time elapsed: 154.213 s - in
org.apache.phoenix.end2end.ColumnEncodedImmutableNonTxStatsCollectorIT
[INFO] Tests run: 2, Failures: 0, Errors: 0, Skipped: 0, Time elapsed: 24.133 s - in org.apache.phoenix.end2end.DropSchemaIT
[WARNING] Tests run: 26, Failures: 0, Errors: 0, Skipped: 4, Time elapsed: 159.729 s - in
org.apache.phoenix.end2end.ColumnEncodedImmutableTxStatsCollectorIT
[INFO] Tests run: 12, Failures: 0, Errors: 0, Skipped: 0, Time elapsed: 109.171 s - in org.apache.phoenix.end2end.CsvBulkLoadToolIT
[INFO] Running org.apache.phoenix.end2end.IndexToolForPartialBuildIT
[INFO] Running org.apache.phoenix.end2end.IndexScrutinyToolIT
[INFO] Running org.apache.phoenix.end2end.FlappingLocalIndexIT
[INFO] Running org.apache.phoenix.end2end.IndexExtendedIT
[INFO] Running org.apache.phoenix.end2end.IndexToolForPartialBuildWithNamespaceEnabledIT
[INFO] Running org.apache.phoenix.end2end.IndexToolIT
[INFO] Tests run: 32, Failures: 0, Errors: 0, Skipped: 0, Time elapsed: 177.348 s - in org.apache.phoenix.end2end.IndexExtendedIT
[INFO] Tests run: 12, Failures: 0, Errors: 0, Skipped: 0, Time elapsed: 194.376 s - in org.apache.phoenix.end2end.FlappingLocalIndexIT
[INFO] Running org.apache.phoenix.end2end.MigrateSystemTablesToSystemNamespaceIT
[INFO] Running org.apache.phoenix.end2end.LocalIndexSplitMergeIT
[INFO] Tests run: 2, Failures: 0, Errors: 0, Skipped: 0, Time elapsed: 68.738 s - in org.apache.phoenix.end2end.LocalIndexSplitMergeIT
[INFO] Tests run: 20, Failures: 0, Errors: 0, Skipped: 0, Time elapsed: 465.132 s - in org.apache.phoenix.end2end.CostBasedDecisionIT
[INFO] Running org.apache.phoenix.end2end.NonColumnEncodedImmutableNonTxStatsCollectorIT
[INFO] Running org.apache.phoenix.end2end.NonColumnEncodedImmutableTxStatsCollectorIT
[INFO] Tests run: 33, Failures: 0, Errors: 0, Skipped: 0, Time elapsed: 453.36 s - in org.apache.phoenix.end2end.IndexScrutinyToolIT
[INFO] Running org.apache.phoenix.end2end.PartialResultServerConfigurationIT
[INFO] Tests run: 4, Failures: 0, Errors: 0, Skipped: 0, Time elapsed: 321.128 s - in org.apache.phoenix.end2end.MigrateSystemTablesToSystemNamespaceIT
[WARNING] Tests run: 26, Failures: 0, Errors: 0, Skipped: 4, Time elapsed: 154.052 s - in
org.apache.phoenix.end2end.NonColumnEncodedImmutableNonTxStatsCollectorIT
[WARNING] Tests run: 26, Failures: 0, Errors: 0, Skipped: 4, Time elapsed: 153.276 s - in
org.apache.phoenix.end2end.NonColumnEncodedImmutableTxStatsCollectorIT
[INFO] Tests run: 1, Failures: 0, Errors: 0, Skipped: 0, Time elapsed: 47.293 s - in org.apache.phoenix.end2end.PartialResultServerConfigurationIT
[INFO] Running org.apache.phoenix.end2end.PhoenixDriverIT
[INFO] Tests run: 12, Failures: 0, Errors: 0, Skipped: 0, Time elapsed: 832.601 s - in org.apache.phoenix.end2end.ChangePermissionsIT
[INFO] Tests run: 2, Failures: 0, Errors: 0, Skipped: 0, Time elapsed: 588.045 s - in org.apache.phoenix.end2end.IndexToolForPartialBuildIT
[INFO] Running org.apache.phoenix.end2end.QueryWithLimitIT
[INFO] Running org.apache.phoenix.end2end.QueryTimeoutIT
[INFO] Tests run: 2, Failures: 0, Errors: 0, Skipped: 0, Time elapsed: 590.037 s - in org.apache.phoenix.end2end.IndexToolForPartialBuildWithNamespaceEnabledIT
[INFO] Running org.apache.phoenix.end2end.RebuildIndexConnectionPropsIT
[INFO] Tests run: 1, Failures: 0, Errors: 0, Skipped: 0, Time elapsed: 0.629 s - in org.apache.phoenix.end2end.RebuildIndexConnectionPropsIT
[INFO] Tests run: 2, Failures: 0, Errors: 0, Skipped: 0, Time elapsed: 9.925 s - in org.apache.phoenix.end2end.QueryWithLimitIT
[INFO] Tests run: 2, Failures: 0, Errors: 0, Skipped: 0, Time elapsed: 9.242 s - in org.apache.phoenix.end2end.QueryTimeoutIT
[INFO] Running org.apache.phoenix.end2end.RegexBulkLoadToolIT
[INFO] Running org.apache.phoenix.end2end.SystemTablePermissionsIT
[INFO] Running org.apache.phoenix.end2end.TableDDLPermissionsIT
[INFO] Tests run: 4, Failures: 0, Errors: 0, Skipped: 0, Time elapsed: 71.73 s - in org.apache.phoenix.end2end.PhoenixDriverIT
[INFO] Running org.apache.phoenix.end2end.RenewLeaseIT
[INFO] Running org.apache.phoenix.end2end.SpillableGroupByIT
[INFO] Running org.apache.phoenix.end2end.SysTableNamespaceMappedStatsCollectorIT
[INFO] Tests run: 2, Failures: 0, Errors: 0, Skipped: 0, Time elapsed: 10.085 s - in org.apache.phoenix.end2end.SpillableGroupByIT
[INFO] Tests run: 1, Failures: 0, Errors: 0, Skipped: 0, Time elapsed: 28.464 s - in org.apache.phoenix.end2end.RenewLeaseIT
[INFO] Running org.apache.phoenix.end2end.TableSnapshotReadsMapReduceIT
[INFO] Tests run: 3, Failures: 0, Errors: 0, Skipped: 0, Time elapsed: 27.509 s - in org.apache.phoenix.end2end.TableSnapshotReadsMapReduceIT
[INFO] Tests run: 10, Failures: 0, Errors: 0, Skipped: 0, Time elapsed: 95.311 s - in org.apache.phoenix.end2end.RegexBulkLoadToolIT
[INFO] Running org.apache.phoenix.end2end.UpdateCacheAcrossDifferentClientsIT
[INFO] Tests run: 2, Failures: 0, Errors: 0, Skipped: 0, Time elapsed: 122.316 s - in org.apache.phoenix.end2end.SystemTablePermissionsIT
[INFO] Running org.apache.phoenix.end2end.UserDefinedFunctionsIT
[INFO] Running org.apache.phoenix.end2end.index.ImmutableIndexIT
[INFO] Running org.apache.phoenix.end2end.index.LocalIndexIT
[INFO] Tests run: 6, Failures: 0, Errors: 0, Skipped: 0, Time elapsed: 56.588 s - in org.apache.phoenix.end2end.UpdateCacheAcrossDifferentClientsIT
[INFO] Running org.apache.phoenix.end2end.index.MutableIndexFailureIT
[WARNING] Tests run: 26, Failures: 0, Errors: 0, Skipped: 4, Time elapsed: 170.601 s - in
org.apache.phoenix.end2end.SysTableNamespaceMappedStatsCollectorIT
[INFO] Tests run: 14, Failures: 0, Errors: 0, Skipped: 0, Time elapsed: 96.753 s - in org.apache.phoenix.end2end.UserDefinedFunctionsIT
[INFO] Running org.apache.phoenix.end2end.index.MutableIndexReplicationIT
[INFO] Running org.apache.phoenix.end2end.index.PartialIndexRebuilderIT
[INFO] Tests run: 1, Failures: 0, Errors: 0, Skipped: 0, Time elapsed: 41.805 s - in org.apache.phoenix.end2end.index.MutableIndexReplicationIT
[INFO] Running org.apache.phoenix.end2end.index.txn.TxWriteFailureIT
[INFO] Tests run: 8, Failures: 0, Errors: 0, Skipped: 0, Time elapsed: 85.063 s - in org.apache.phoenix.end2end.index.txn.TxWriteFailureIT
[INFO] Running org.apache.phoenix.execute.PartialCommitIT
[INFO] Tests run: 12, Failures: 0, Errors: 0, Skipped: 0, Time elapsed: 0.85 s - in org.apache.phoenix.execute.PartialCommitIT
[INFO] Running org.apache.phoenix.hbase.index.FailForUnsupportedHBaseVersionsIT
[INFO] Tests run: 2, Failures: 0, Errors: 0, Skipped: 0, Time elapsed: 23.005 s - in org.apache.phoenix.hbase.index.FailForUnsupportedHBaseVersionsIT
[INFO] Running org.apache.phoenix.execute.UpsertSelectOverlappingBatchesIT
[INFO] Tests run: 64, Failures: 0, Errors: 0, Skipped: 0, Time elapsed: 1,010.78 s - in org.apache.phoenix.end2end.IndexToolIT
[INFO] Running org.apache.phoenix.iterate.RoundRobinResultIteratorWithStatsIT
[INFO] Tests run: 1, Failures: 0, Errors: 0, Skipped: 0, Time elapsed: 12.675 s - in org.apache.phoenix.iterate.RoundRobinResultIteratorWithStatsIT
[INFO] Tests run: 4, Failures: 0, Errors: 0, Skipped: 0, Time elapsed: 484.053 s - in org.apache.phoenix.end2end.TableDDLPermissionsIT
[INFO] Running org.apache.phoenix.iterate.ScannerLeaseRenewalIT
[INFO] Tests run: 3, Failures: 0, Errors: 0, Skipped: 0, Time elapsed: 81.59 s - in org.apache.phoenix.execute.UpsertSelectOverlappingBatchesIT
[INFO] Running org.apache.phoenix.monitoring.PhoenixMetricsIT
[INFO] Running org.apache.phoenix.rpc.PhoenixClientRpcIT
[INFO] Tests run: 2, Failures: 0, Errors: 0, Skipped: 0, Time elapsed: 11.509 s - in org.apache.phoenix.rpc.PhoenixClientRpcIT
[INFO] Running org.apache.phoenix.rpc.PhoenixServerRpcIT
[INFO] Tests run: 2, Failures: 0, Errors: 0, Skipped: 0, Time elapsed: 24.588 s - in org.apache.phoenix.rpc.PhoenixServerRpcIT
[WARNING] Tests run: 40, Failures: 0, Errors: 0, Skipped: 16, Time elapsed: 434.628 s - in
org.apache.phoenix.end2end.index.ImmutableIndexIT
[INFO] Tests run: 21, Failures: 0, Errors: 0, Skipped: 0, Time elapsed: 442.514 s - in org.apache.phoenix.end2end.index.MutableIndexFailureIT
[INFO] Tests run: 22, Failures: 0, Errors: 0, Skipped: 0, Time elapsed: 114.067 s - in org.apache.phoenix.monitoring.PhoenixMetricsIT
[INFO] Tests run: 36, Failures: 0, Errors: 0, Skipped: 0, Time elapsed: 491.156 s - in org.apache.phoenix.end2end.index.LocalIndexIT
[INFO] Tests run: 2, Failures: 0, Errors: 0, Skipped: 0, Time elapsed: 165.187 s - in org.apache.phoenix.iterate.ScannerLeaseRenewalIT
[INFO] Tests run: 26, Failures: 0, Errors: 0, Skipped: 0, Time elapsed: 399.773 s - in org.apache.phoenix.end2end.index.PartialIndexRebuilderIT
[INFO] 
[INFO] Results:
[INFO] 
[WARNING] Tests run: 616, Failures: 0, Errors: 0, Skipped: 44
[INFO] 
[INFO] 
[INFO] --- maven-failsafe-plugin:2.20:verify (ParallelStatsEnabledTest) @ phoenix-core ---
[INFO] ------------------------------------------------------------------------
[INFO] Reactor Summary:
[INFO] 
[INFO] Apache Phoenix ..................................... SUCCESS [  1.935 s]
[INFO] Phoenix Core ....................................... FAILURE [  01:50 h]
[INFO] Phoenix - Flume .................................... SKIPPED
[INFO] Phoenix - Kafka .................................... SKIPPED
[INFO] Phoenix - Pig ...................................... SKIPPED
[INFO] Phoenix Query Server Client ........................ SKIPPED
[INFO] Phoenix Query Server ............................... SKIPPED
[INFO] Phoenix - Pherf .................................... SKIPPED
[INFO] Phoenix - Spark .................................... SKIPPED
[INFO] Phoenix - Hive ..................................... SKIPPED
[INFO] Phoenix Client ..................................... SKIPPED
[INFO] Phoenix Server ..................................... SKIPPED
[INFO] Phoenix Assembly ................................... SKIPPED
[INFO] Phoenix - Tracing Web Application .................. SKIPPED
[INFO] Phoenix Load Balancer .............................. SKIPPED
[INFO] ------------------------------------------------------------------------
[INFO] BUILD FAILURE
[INFO] ------------------------------------------------------------------------
[INFO] Total time: 01:50 h
[INFO] Finished at: 2018-02-15T05:20:40Z
[INFO] Final Memory: 63M/978M
[INFO] ------------------------------------------------------------------------
[ERROR] Failed to execute goal org.apache.maven.plugins:maven-failsafe-plugin:2.20:verify
(ParallelStatsEnabledTest) on project phoenix-core: There are test failures.
[ERROR] 
[ERROR] Please refer to <https://builds.apache.org/job/Phoenix-4.x-HBase-1.2/ws/phoenix-core/target/failsafe-reports>
for the individual test results.
[ERROR] Please refer to dump files (if any exist) [date]-jvmRun[N].dump, [date].dumpstream
and [date]-jvmRun[N].dumpstream.
[ERROR] -> [Help 1]
[ERROR] 
[ERROR] To see the full stack trace of the errors, re-run Maven with the -e switch.
[ERROR] Re-run Maven using the -X switch to enable full debug logging.
[ERROR] 
[ERROR] For more information about the errors and possible solutions, please read the following
articles:
[ERROR] [Help 1] http://cwiki.apache.org/confluence/display/MAVEN/MojoFailureException
[ERROR] 
[ERROR] After correcting the problems, you can resume the build with the command
[ERROR]   mvn <goals> -rf :phoenix-core
Build step 'Invoke top-level Maven targets' marked build as failure
Archiving artifacts
[Fast Archiver] Compressed -533982455 B of artifacts by 383.7% relative to #268
Recording test results

Mime
View raw message