phoenix-commits mailing list archives

Site index · List index
Message view « Date » · « Thread »
Top « Date » · « Thread »
From Apache Jenkins Server <jenk...@builds.apache.org>
Subject Build failed in Jenkins: Phoenix | 4.x-HBase-0.98 #1813
Date Fri, 09 Feb 2018 22:07:34 GMT
See <https://builds.apache.org/job/Phoenix-4.x-HBase-0.98/1813/display/redirect?page=changes>

Changes:

[jmahonin] PHOENIX-4056 Spark 2.2 empty path fix (Stepan Migunov)

------------------------------------------
[...truncated 110.25 KB...]
org.apache.hadoop.hbase.client.RetriesExhaustedWithDetailsException: Failed 1 action: org.apache.hadoop.hbase.DoNotRetryIOException:
Failed 1 action: NotServingRegionException: 1 time, servers with issues: asf931.gq1.ygridcore.net,35502,1518211039016,

	at org.apache.phoenix.util.ServerUtil.createIOException(ServerUtil.java:80)
	at org.apache.phoenix.util.ServerUtil.throwIOException(ServerUtil.java:62)
	at org.apache.phoenix.index.PhoenixTransactionalIndexer.postBatchMutateIndispensably(PhoenixTransactionalIndexer.java:240)
	at org.apache.hadoop.hbase.regionserver.RegionCoprocessorHost$37.call(RegionCoprocessorHost.java:1040)
	at org.apache.hadoop.hbase.regionserver.RegionCoprocessorHost$RegionOperation.call(RegionCoprocessorHost.java:1656)
	at org.apache.hadoop.hbase.regionserver.RegionCoprocessorHost.execOperation(RegionCoprocessorHost.java:1733)
	at org.apache.hadoop.hbase.regionserver.RegionCoprocessorHost.execOperation(RegionCoprocessorHost.java:1688)
	at org.apache.hadoop.hbase.regionserver.RegionCoprocessorHost.postBatchMutateIndispensably(RegionCoprocessorHost.java:1036)
	at org.apache.hadoop.hbase.regionserver.HRegion.doMiniBatchMutation(HRegion.java:2767)
	at org.apache.hadoop.hbase.regionserver.HRegion.batchMutate(HRegion.java:2359)
	at org.apache.hadoop.hbase.regionserver.HRegion.batchMutate(HRegion.java:2314)
	at org.apache.hadoop.hbase.regionserver.HRegion.batchMutate(HRegion.java:2318)
	at org.apache.hadoop.hbase.regionserver.HRegionServer.doBatchOp(HRegionServer.java:4678)
	at org.apache.hadoop.hbase.regionserver.HRegionServer.doNonAtomicRegionMutation(HRegionServer.java:3835)
	at org.apache.hadoop.hbase.regionserver.HRegionServer.multi(HRegionServer.java:3680)
	at org.apache.hadoop.hbase.protobuf.generated.ClientProtos$ClientService$2.callBlockingMethod(ClientProtos.java:32500)
	at org.apache.hadoop.hbase.ipc.RpcServer.call(RpcServer.java:2195)
	at org.apache.hadoop.hbase.ipc.CallRunner.run(CallRunner.java:104)
	at org.apache.hadoop.hbase.ipc.RpcExecutor.consumerLoop(RpcExecutor.java:133)
	at org.apache.hadoop.hbase.ipc.RpcExecutor$1.run(RpcExecutor.java:108)
	at java.lang.Thread.run(Thread.java:745)
Caused by: org.apache.hadoop.hbase.client.RetriesExhaustedWithDetailsException: Failed 1 action:
NotServingRegionException: 1 time, servers with issues: asf931.gq1.ygridcore.net,35502,1518211039016,

	at org.apache.hadoop.hbase.client.AsyncProcess$BatchErrors.makeException(AsyncProcess.java:211)
	at org.apache.hadoop.hbase.client.AsyncProcess$BatchErrors.access$500(AsyncProcess.java:195)
	at org.apache.hadoop.hbase.client.AsyncProcess.getErrors(AsyncProcess.java:1082)
	at org.apache.hadoop.hbase.client.HConnectionManager$HConnectionImplementation.processBatchCallback(HConnectionManager.java:2479)
	at org.apache.hadoop.hbase.client.HTable.batchCallback(HTable.java:898)
	at org.apache.hadoop.hbase.client.HTable.batchCallback(HTable.java:913)
	at org.apache.hadoop.hbase.client.HTable.batch(HTable.java:888)
	at org.apache.phoenix.hbase.index.write.ParallelWriterIndexCommitter$1.call(ParallelWriterIndexCommitter.java:170)
	at org.apache.phoenix.hbase.index.write.ParallelWriterIndexCommitter$1.call(ParallelWriterIndexCommitter.java:133)
	at java.util.concurrent.FutureTask.run(FutureTask.java:262)
	at java.util.concurrent.ThreadPoolExecutor.runWorker(ThreadPoolExecutor.java:1145)
	at java.util.concurrent.ThreadPoolExecutor$Worker.run(ThreadPoolExecutor.java:615)
	... 1 more
: 1 time, servers with issues: asf931.gq1.ygridcore.net,35502,1518211039016, 
	at org.apache.phoenix.tx.ParameterizedTransactionIT.testNonTxToTxTable(ParameterizedTransactionIT.java:288)
Caused by: org.apache.hadoop.hbase.client.RetriesExhaustedWithDetailsException: 
Failed 1 action: org.apache.hadoop.hbase.DoNotRetryIOException: Failed 1 action: NotServingRegionException:
1 time, servers with issues: asf931.gq1.ygridcore.net,35502,1518211039016, 
	at org.apache.phoenix.util.ServerUtil.createIOException(ServerUtil.java:80)
	at org.apache.phoenix.util.ServerUtil.throwIOException(ServerUtil.java:62)
	at org.apache.phoenix.index.PhoenixTransactionalIndexer.postBatchMutateIndispensably(PhoenixTransactionalIndexer.java:240)
	at org.apache.hadoop.hbase.regionserver.RegionCoprocessorHost$37.call(RegionCoprocessorHost.java:1040)
	at org.apache.hadoop.hbase.regionserver.RegionCoprocessorHost$RegionOperation.call(RegionCoprocessorHost.java:1656)
	at org.apache.hadoop.hbase.regionserver.RegionCoprocessorHost.execOperation(RegionCoprocessorHost.java:1733)
	at org.apache.hadoop.hbase.regionserver.RegionCoprocessorHost.execOperation(RegionCoprocessorHost.java:1688)
	at org.apache.hadoop.hbase.regionserver.RegionCoprocessorHost.postBatchMutateIndispensably(RegionCoprocessorHost.java:1036)
	at org.apache.hadoop.hbase.regionserver.HRegion.doMiniBatchMutation(HRegion.java:2767)
	at org.apache.hadoop.hbase.regionserver.HRegion.batchMutate(HRegion.java:2359)
	at org.apache.hadoop.hbase.regionserver.HRegion.batchMutate(HRegion.java:2314)
	at org.apache.hadoop.hbase.regionserver.HRegion.batchMutate(HRegion.java:2318)
	at org.apache.hadoop.hbase.regionserver.HRegionServer.doBatchOp(HRegionServer.java:4678)
	at org.apache.hadoop.hbase.regionserver.HRegionServer.doNonAtomicRegionMutation(HRegionServer.java:3835)
	at org.apache.hadoop.hbase.regionserver.HRegionServer.multi(HRegionServer.java:3680)
	at org.apache.hadoop.hbase.protobuf.generated.ClientProtos$ClientService$2.callBlockingMethod(ClientProtos.java:32500)
	at org.apache.hadoop.hbase.ipc.RpcServer.call(RpcServer.java:2195)
	at org.apache.hadoop.hbase.ipc.CallRunner.run(CallRunner.java:104)
	at org.apache.hadoop.hbase.ipc.RpcExecutor.consumerLoop(RpcExecutor.java:133)
	at org.apache.hadoop.hbase.ipc.RpcExecutor$1.run(RpcExecutor.java:108)
	at java.lang.Thread.run(Thread.java:745)
Caused by: org.apache.hadoop.hbase.client.RetriesExhaustedWithDetailsException: Failed 1 action:
NotServingRegionException: 1 time, servers with issues: asf931.gq1.ygridcore.net,35502,1518211039016,

	at org.apache.hadoop.hbase.client.AsyncProcess$BatchErrors.makeException(AsyncProcess.java:211)
	at org.apache.hadoop.hbase.client.AsyncProcess$BatchErrors.access$500(AsyncProcess.java:195)
	at org.apache.hadoop.hbase.client.AsyncProcess.getErrors(AsyncProcess.java:1082)
	at org.apache.hadoop.hbase.client.HConnectionManager$HConnectionImplementation.processBatchCallback(HConnectionManager.java:2479)
	at org.apache.hadoop.hbase.client.HTable.batchCallback(HTable.java:898)
	at org.apache.hadoop.hbase.client.HTable.batchCallback(HTable.java:913)
	at org.apache.hadoop.hbase.client.HTable.batch(HTable.java:888)
	at org.apache.phoenix.hbase.index.write.ParallelWriterIndexCommitter$1.call(ParallelWriterIndexCommitter.java:170)
	at org.apache.phoenix.hbase.index.write.ParallelWriterIndexCommitter$1.call(ParallelWriterIndexCommitter.java:133)
	at java.util.concurrent.FutureTask.run(FutureTask.java:262)
	at java.util.concurrent.ThreadPoolExecutor.runWorker(ThreadPoolExecutor.java:1145)
	at java.util.concurrent.ThreadPoolExecutor$Worker.run(ThreadPoolExecutor.java:615)
	... 1 more
: 1 time, servers with issues: asf931.gq1.ygridcore.net,35502,1518211039016, 
	at org.apache.phoenix.tx.ParameterizedTransactionIT.testNonTxToTxTable(ParameterizedTransactionIT.java:288)

[INFO] Tests run: 34, Failures: 0, Errors: 0, Skipped: 0, Time elapsed: 481.501 s - in org.apache.phoenix.end2end.join.SortMergeJoinLocalIndexIT
[INFO] Tests run: 40, Failures: 0, Errors: 0, Skipped: 0, Time elapsed: 239.005 s - in org.apache.phoenix.tx.TxCheckpointIT
[INFO] 
[INFO] Results:
[INFO] 
[ERROR] Errors: 
[ERROR]   ParameterizedTransactionIT.testNonTxToTxTable:288 ยป Commit org.apache.hadoop.h...
[INFO] 
[ERROR] Tests run: 3377, Failures: 0, Errors: 1, Skipped: 7
[INFO] 
[INFO] 
[INFO] --- maven-failsafe-plugin:2.20:integration-test (HBaseManagedTimeTests) @ phoenix-core
---
[INFO] 
[INFO] -------------------------------------------------------
[INFO]  T E S T S
[INFO] -------------------------------------------------------
[INFO] 
[INFO] Results:
[INFO] 
[INFO] Tests run: 0, Failures: 0, Errors: 0, Skipped: 0
[INFO] 
[INFO] 
[INFO] --- maven-failsafe-plugin:2.20:integration-test (NeedTheirOwnClusterTests) @ phoenix-core
---
[INFO] 
[INFO] -------------------------------------------------------
[INFO]  T E S T S
[INFO] -------------------------------------------------------
[INFO] Running org.apache.hadoop.hbase.regionserver.wal.WALReplayWithIndexWritesAndCompressedWALIT
[INFO] Running org.apache.hadoop.hbase.regionserver.wal.WALRecoveryRegionPostOpenIT
[INFO] Tests run: 1, Failures: 0, Errors: 0, Skipped: 0, Time elapsed: 33.166 s - in org.apache.hadoop.hbase.regionserver.wal.WALReplayWithIndexWritesAndCompressedWALIT
[INFO] Tests run: 1, Failures: 0, Errors: 0, Skipped: 0, Time elapsed: 3.663 s - in org.apache.hadoop.hbase.regionserver.wal.WALRecoveryRegionPostOpenIT
[INFO] Running org.apache.phoenix.end2end.ColumnEncodedImmutableNonTxStatsCollectorIT
[INFO] Running org.apache.phoenix.end2end.ColumnEncodedImmutableTxStatsCollectorIT
[INFO] Running org.apache.phoenix.end2end.ColumnEncodedMutableNonTxStatsCollectorIT
[INFO] Running org.apache.phoenix.end2end.ConnectionUtilIT
[INFO] Running org.apache.phoenix.end2end.ColumnEncodedMutableTxStatsCollectorIT
[INFO] Tests run: 1, Failures: 0, Errors: 0, Skipped: 0, Time elapsed: 22.301 s - in org.apache.phoenix.end2end.ConnectionUtilIT
[INFO] Running org.apache.phoenix.end2end.ContextClassloaderIT
[WARNING] Tests run: 26, Failures: 0, Errors: 0, Skipped: 4, Time elapsed: 77.63 s - in org.apache.phoenix.end2end.ColumnEncodedImmutableNonTxStatsCollectorIT
[INFO] Tests run: 3, Failures: 0, Errors: 0, Skipped: 0, Time elapsed: 1.864 s - in org.apache.phoenix.end2end.ContextClassloaderIT
[WARNING] Tests run: 26, Failures: 0, Errors: 0, Skipped: 4, Time elapsed: 78.31 s - in org.apache.phoenix.end2end.ColumnEncodedMutableNonTxStatsCollectorIT
[WARNING] Tests run: 26, Failures: 0, Errors: 0, Skipped: 4, Time elapsed: 80.046 s - in org.apache.phoenix.end2end.ColumnEncodedImmutableTxStatsCollectorIT
[WARNING] Tests run: 26, Failures: 0, Errors: 0, Skipped: 4, Time elapsed: 82.183 s - in org.apache.phoenix.end2end.ColumnEncodedMutableTxStatsCollectorIT
[INFO] Running org.apache.phoenix.end2end.CountDistinctCompressionIT
[INFO] Running org.apache.phoenix.end2end.CsvBulkLoadToolIT
[INFO] Tests run: 1, Failures: 0, Errors: 0, Skipped: 0, Time elapsed: 2.856 s - in org.apache.phoenix.end2end.CountDistinctCompressionIT
[INFO] Running org.apache.phoenix.end2end.DropSchemaIT
[INFO] Tests run: 2, Failures: 0, Errors: 0, Skipped: 0, Time elapsed: 8.407 s - in org.apache.phoenix.end2end.DropSchemaIT
[INFO] Running org.apache.phoenix.end2end.FlappingLocalIndexIT
[INFO] Running org.apache.phoenix.end2end.IndexExtendedIT
[INFO] Running org.apache.phoenix.end2end.IndexScrutinyToolIT
[INFO] Running org.apache.phoenix.end2end.IndexToolForPartialBuildIT
[INFO] Tests run: 12, Failures: 0, Errors: 0, Skipped: 0, Time elapsed: 79.11 s - in org.apache.phoenix.end2end.CsvBulkLoadToolIT
[INFO] Tests run: 32, Failures: 0, Errors: 0, Skipped: 0, Time elapsed: 77.66 s - in org.apache.phoenix.end2end.IndexExtendedIT
[INFO] Running org.apache.phoenix.end2end.IndexToolForPartialBuildWithNamespaceEnabledIT
[INFO] Tests run: 12, Failures: 0, Errors: 0, Skipped: 0, Time elapsed: 124.911 s - in org.apache.phoenix.end2end.FlappingLocalIndexIT
[INFO] Running org.apache.phoenix.end2end.IndexToolIT
[INFO] Running org.apache.phoenix.end2end.LocalIndexSplitMergeIT
[WARNING] Tests run: 2, Failures: 0, Errors: 0, Skipped: 2, Time elapsed: 0.002 s - in org.apache.phoenix.end2end.LocalIndexSplitMergeIT
[INFO] Running org.apache.phoenix.end2end.MigrateSystemTablesToSystemNamespaceIT
[INFO] Tests run: 33, Failures: 0, Errors: 0, Skipped: 0, Time elapsed: 321.979 s - in org.apache.phoenix.end2end.IndexScrutinyToolIT
[INFO] Tests run: 4, Failures: 0, Errors: 0, Skipped: 0, Time elapsed: 219.061 s - in org.apache.phoenix.end2end.MigrateSystemTablesToSystemNamespaceIT
[INFO] Running org.apache.phoenix.end2end.NonColumnEncodedImmutableNonTxStatsCollectorIT
[INFO] Running org.apache.phoenix.end2end.NonColumnEncodedImmutableTxStatsCollectorIT
[WARNING] Tests run: 26, Failures: 0, Errors: 0, Skipped: 4, Time elapsed: 88.701 s - in org.apache.phoenix.end2end.NonColumnEncodedImmutableNonTxStatsCollectorIT
[INFO] Tests run: 32, Failures: 0, Errors: 0, Skipped: 0, Time elapsed: 365.283 s - in org.apache.phoenix.end2end.IndexToolIT
[WARNING] Tests run: 26, Failures: 0, Errors: 0, Skipped: 4, Time elapsed: 87.561 s - in org.apache.phoenix.end2end.NonColumnEncodedImmutableTxStatsCollectorIT
[INFO] Running org.apache.phoenix.end2end.PhoenixDriverIT
[INFO] Running org.apache.phoenix.end2end.QueryTimeoutIT
[INFO] Running org.apache.phoenix.end2end.QueryWithLimitIT
[INFO] Tests run: 2, Failures: 0, Errors: 0, Skipped: 0, Time elapsed: 5.342 s - in org.apache.phoenix.end2end.QueryWithLimitIT
[INFO] Tests run: 2, Failures: 0, Errors: 0, Skipped: 0, Time elapsed: 11.986 s - in org.apache.phoenix.end2end.QueryTimeoutIT
[INFO] Tests run: 4, Failures: 0, Errors: 0, Skipped: 0, Time elapsed: 51.041 s - in org.apache.phoenix.end2end.PhoenixDriverIT
[INFO] Running org.apache.phoenix.end2end.RegexBulkLoadToolIT
[INFO] Running org.apache.phoenix.end2end.RebuildIndexConnectionPropsIT
[INFO] Tests run: 1, Failures: 0, Errors: 0, Skipped: 0, Time elapsed: 1.262 s - in org.apache.phoenix.end2end.RebuildIndexConnectionPropsIT
[INFO] Tests run: 2, Failures: 0, Errors: 0, Skipped: 0, Time elapsed: 581.802 s - in org.apache.phoenix.end2end.IndexToolForPartialBuildIT
[INFO] Running org.apache.phoenix.end2end.RenewLeaseIT
[INFO] Tests run: 1, Failures: 0, Errors: 0, Skipped: 0, Time elapsed: 26.752 s - in org.apache.phoenix.end2end.RenewLeaseIT
[INFO] Running org.apache.phoenix.end2end.SystemTablePermissionsIT
[INFO] Running org.apache.phoenix.end2end.SpillableGroupByIT
[INFO] Tests run: 2, Failures: 0, Errors: 0, Skipped: 0, Time elapsed: 580.395 s - in org.apache.phoenix.end2end.IndexToolForPartialBuildWithNamespaceEnabledIT
[INFO] Tests run: 2, Failures: 0, Errors: 0, Skipped: 0, Time elapsed: 7.896 s - in org.apache.phoenix.end2end.SpillableGroupByIT
[INFO] Tests run: 10, Failures: 0, Errors: 0, Skipped: 0, Time elapsed: 64.085 s - in org.apache.phoenix.end2end.RegexBulkLoadToolIT
[INFO] Running org.apache.phoenix.end2end.SysTableNamespaceMappedStatsCollectorIT
[INFO] Running org.apache.phoenix.end2end.TableSnapshotReadsMapReduceIT
[INFO] Running org.apache.phoenix.end2end.UpdateCacheAcrossDifferentClientsIT
[INFO] Tests run: 3, Failures: 0, Errors: 0, Skipped: 0, Time elapsed: 21.925 s - in org.apache.phoenix.end2end.TableSnapshotReadsMapReduceIT
[INFO] Running org.apache.phoenix.end2end.UserDefinedFunctionsIT
[INFO] Tests run: 2, Failures: 0, Errors: 0, Skipped: 0, Time elapsed: 80.557 s - in org.apache.phoenix.end2end.SystemTablePermissionsIT
[INFO] Tests run: 6, Failures: 0, Errors: 0, Skipped: 0, Time elapsed: 21.87 s - in org.apache.phoenix.end2end.UpdateCacheAcrossDifferentClientsIT
[WARNING] Tests run: 26, Failures: 0, Errors: 0, Skipped: 4, Time elapsed: 81.38 s - in org.apache.phoenix.end2end.SysTableNamespaceMappedStatsCollectorIT
[INFO] Tests run: 14, Failures: 0, Errors: 0, Skipped: 0, Time elapsed: 34.836 s - in org.apache.phoenix.end2end.UserDefinedFunctionsIT
[INFO] Running org.apache.phoenix.end2end.index.ImmutableIndexIT
[INFO] Running org.apache.phoenix.end2end.index.LocalIndexIT
[INFO] Running org.apache.phoenix.end2end.index.MutableIndexFailureIT
[INFO] Running org.apache.phoenix.end2end.index.MutableIndexReplicationIT
[INFO] Running org.apache.phoenix.end2end.index.PartialIndexRebuilderIT
[INFO] Tests run: 1, Failures: 0, Errors: 0, Skipped: 0, Time elapsed: 16.483 s - in org.apache.phoenix.end2end.index.MutableIndexReplicationIT
[INFO] Running org.apache.phoenix.end2end.index.txn.TxWriteFailureIT
[INFO] Tests run: 8, Failures: 0, Errors: 0, Skipped: 0, Time elapsed: 46.725 s - in org.apache.phoenix.end2end.index.txn.TxWriteFailureIT
[INFO] Running org.apache.phoenix.execute.PartialCommitIT
[INFO] Tests run: 12, Failures: 0, Errors: 0, Skipped: 0, Time elapsed: 1.271 s - in org.apache.phoenix.execute.PartialCommitIT
[INFO] Running org.apache.phoenix.execute.UpsertSelectOverlappingBatchesIT
[INFO] Tests run: 21, Failures: 0, Errors: 0, Skipped: 0, Time elapsed: 244.728 s - in org.apache.phoenix.end2end.index.MutableIndexFailureIT
[INFO] Tests run: 26, Failures: 0, Errors: 0, Skipped: 0, Time elapsed: 239.584 s - in org.apache.phoenix.end2end.index.PartialIndexRebuilderIT
[INFO] Running org.apache.phoenix.hbase.index.FailForUnsupportedHBaseVersionsIT
[INFO] Tests run: 2, Failures: 0, Errors: 0, Skipped: 0, Time elapsed: 22.03 s - in org.apache.phoenix.hbase.index.FailForUnsupportedHBaseVersionsIT
[WARNING] Tests run: 40, Failures: 0, Errors: 0, Skipped: 16, Time elapsed: 305.632 s - in
org.apache.phoenix.end2end.index.ImmutableIndexIT
[INFO] Tests run: 36, Failures: 0, Errors: 0, Skipped: 0, Time elapsed: 309.035 s - in org.apache.phoenix.end2end.index.LocalIndexIT
[INFO] Running org.apache.phoenix.iterate.RoundRobinResultIteratorWithStatsIT
[INFO] Tests run: 1, Failures: 0, Errors: 0, Skipped: 0, Time elapsed: 8.197 s - in org.apache.phoenix.iterate.RoundRobinResultIteratorWithStatsIT
[INFO] Running org.apache.phoenix.iterate.ScannerLeaseRenewalIT
[INFO] Running org.apache.phoenix.monitoring.PhoenixMetricsIT
[INFO] Running org.apache.phoenix.rpc.PhoenixClientRpcIT
[INFO] Running org.apache.phoenix.rpc.PhoenixServerRpcIT
[INFO] Tests run: 2, Failures: 0, Errors: 0, Skipped: 0, Time elapsed: 3.028 s - in org.apache.phoenix.rpc.PhoenixClientRpcIT
[INFO] Tests run: 2, Failures: 0, Errors: 0, Skipped: 0, Time elapsed: 11.867 s - in org.apache.phoenix.rpc.PhoenixServerRpcIT
[INFO] Tests run: 3, Failures: 0, Errors: 0, Skipped: 0, Time elapsed: 150.827 s - in org.apache.phoenix.execute.UpsertSelectOverlappingBatchesIT
[INFO] Tests run: 22, Failures: 0, Errors: 0, Skipped: 0, Time elapsed: 55.174 s - in org.apache.phoenix.monitoring.PhoenixMetricsIT
[INFO] Tests run: 2, Failures: 0, Errors: 0, Skipped: 0, Time elapsed: 162.004 s - in org.apache.phoenix.iterate.ScannerLeaseRenewalIT
[INFO] 
[INFO] Results:
[INFO] 
[WARNING] Tests run: 547, Failures: 0, Errors: 0, Skipped: 46
[INFO] 
[INFO] 
[INFO] --- maven-failsafe-plugin:2.20:verify (ParallelStatsEnabledTest) @ phoenix-core ---
[INFO] ------------------------------------------------------------------------
[INFO] Reactor Summary:
[INFO] 
[INFO] Apache Phoenix ..................................... SUCCESS [  3.617 s]
[INFO] Phoenix Core ....................................... FAILURE [  01:32 h]
[INFO] Phoenix - Flume .................................... SKIPPED
[INFO] Phoenix - Kafka .................................... SKIPPED
[INFO] Phoenix - Pig ...................................... SKIPPED
[INFO] Phoenix Query Server Client ........................ SKIPPED
[INFO] Phoenix Query Server ............................... SKIPPED
[INFO] Phoenix - Pherf .................................... SKIPPED
[INFO] Phoenix - Spark .................................... SKIPPED
[INFO] Phoenix - Hive ..................................... SKIPPED
[INFO] Phoenix Client ..................................... SKIPPED
[INFO] Phoenix Server ..................................... SKIPPED
[INFO] Phoenix Assembly ................................... SKIPPED
[INFO] Phoenix - Tracing Web Application .................. SKIPPED
[INFO] Phoenix Load Balancer .............................. SKIPPED
[INFO] ------------------------------------------------------------------------
[INFO] BUILD FAILURE
[INFO] ------------------------------------------------------------------------
[INFO] Total time: 01:33 h
[INFO] Finished at: 2018-02-09T21:47:28Z
[INFO] Final Memory: 61M/959M
[INFO] ------------------------------------------------------------------------
[ERROR] Failed to execute goal org.apache.maven.plugins:maven-failsafe-plugin:2.20:verify
(ParallelStatsEnabledTest) on project phoenix-core: There are test failures.
[ERROR] 
[ERROR] Please refer to <https://builds.apache.org/job/Phoenix-4.x-HBase-0.98/ws/phoenix-core/target/failsafe-reports>
for the individual test results.
[ERROR] Please refer to dump files (if any exist) [date]-jvmRun[N].dump, [date].dumpstream
and [date]-jvmRun[N].dumpstream.
[ERROR] -> [Help 1]
[ERROR] 
[ERROR] To see the full stack trace of the errors, re-run Maven with the -e switch.
[ERROR] Re-run Maven using the -X switch to enable full debug logging.
[ERROR] 
[ERROR] For more information about the errors and possible solutions, please read the following
articles:
[ERROR] [Help 1] http://cwiki.apache.org/confluence/display/MAVEN/MojoFailureException
[ERROR] 
[ERROR] After correcting the problems, you can resume the build with the command
[ERROR]   mvn <goals> -rf :phoenix-core
Build step 'Invoke top-level Maven targets' marked build as failure
Archiving artifacts
[Fast Archiver] Compressed 1.32 GB of artifacts by 23.5% relative to #1812
Recording test results

Mime
View raw message