phoenix-commits mailing list archives

Site index · List index
Message view « Date » · « Thread »
Top « Date » · « Thread »
From Apache Jenkins Server <jenk...@builds.apache.org>
Subject Build failed in Jenkins: Phoenix | 4.x-HBase-0.98 #1819
Date Sat, 17 Feb 2018 00:05:48 GMT
See <https://builds.apache.org/job/Phoenix-4.x-HBase-0.98/1819/display/redirect>

------------------------------------------
[...truncated 456.24 KB...]
	at org.apache.hadoop.hbase.regionserver.HRegionServer.multi(HRegionServer.java:3680)
	at org.apache.hadoop.hbase.protobuf.generated.ClientProtos$ClientService$2.callBlockingMethod(ClientProtos.java:32500)
	at org.apache.hadoop.hbase.ipc.RpcServer.call(RpcServer.java:2195)
	at org.apache.hadoop.hbase.ipc.CallRunner.run(CallRunner.java:104)
	at org.apache.hadoop.hbase.ipc.RpcExecutor.consumerLoop(RpcExecutor.java:133)
	at org.apache.hadoop.hbase.ipc.RpcExecutor$1.run(RpcExecutor.java:108)
	at java.lang.Thread.run(Thread.java:745)
Caused by: org.apache.hadoop.hbase.client.RetriesExhaustedWithDetailsException: Failed 1 action:
RegionOpeningException: 1 time, servers with issues: asf934.gq1.ygridcore.net,36751,1518823889058,

	at org.apache.hadoop.hbase.client.AsyncProcess$BatchErrors.makeException(AsyncProcess.java:211)
	at org.apache.hadoop.hbase.client.AsyncProcess$BatchErrors.access$500(AsyncProcess.java:195)
	at org.apache.hadoop.hbase.client.AsyncProcess.getErrors(AsyncProcess.java:1082)
	at org.apache.hadoop.hbase.client.HConnectionManager$HConnectionImplementation.processBatchCallback(HConnectionManager.java:2479)
	at org.apache.hadoop.hbase.client.HTable.batchCallback(HTable.java:898)
	at org.apache.hadoop.hbase.client.HTable.batchCallback(HTable.java:913)
	at org.apache.hadoop.hbase.client.HTable.batch(HTable.java:888)
	at org.apache.phoenix.hbase.index.write.ParallelWriterIndexCommitter$1.call(ParallelWriterIndexCommitter.java:170)
	at org.apache.phoenix.hbase.index.write.ParallelWriterIndexCommitter$1.call(ParallelWriterIndexCommitter.java:133)
	at java.util.concurrent.FutureTask.run(FutureTask.java:262)
	at java.util.concurrent.ThreadPoolExecutor.runWorker(ThreadPoolExecutor.java:1145)
	at java.util.concurrent.ThreadPoolExecutor$Worker.run(ThreadPoolExecutor.java:615)
	... 1 more
: 1 time, servers with issues: asf934.gq1.ygridcore.net,36751,1518823889058, 
	at org.apache.phoenix.tx.ParameterizedTransactionIT.testNonTxToTxTable(ParameterizedTransactionIT.java:288)
Caused by: org.apache.hadoop.hbase.client.RetriesExhaustedWithDetailsException: 
Failed 1 action: org.apache.hadoop.hbase.DoNotRetryIOException: Failed 1 action: RegionOpeningException:
1 time, servers with issues: asf934.gq1.ygridcore.net,36751,1518823889058, 
	at org.apache.phoenix.util.ServerUtil.createIOException(ServerUtil.java:80)
	at org.apache.phoenix.util.ServerUtil.throwIOException(ServerUtil.java:62)
	at org.apache.phoenix.index.PhoenixTransactionalIndexer.postBatchMutateIndispensably(PhoenixTransactionalIndexer.java:240)
	at org.apache.hadoop.hbase.regionserver.RegionCoprocessorHost$37.call(RegionCoprocessorHost.java:1040)
	at org.apache.hadoop.hbase.regionserver.RegionCoprocessorHost$RegionOperation.call(RegionCoprocessorHost.java:1656)
	at org.apache.hadoop.hbase.regionserver.RegionCoprocessorHost.execOperation(RegionCoprocessorHost.java:1733)
	at org.apache.hadoop.hbase.regionserver.RegionCoprocessorHost.execOperation(RegionCoprocessorHost.java:1688)
	at org.apache.hadoop.hbase.regionserver.RegionCoprocessorHost.postBatchMutateIndispensably(RegionCoprocessorHost.java:1036)
	at org.apache.hadoop.hbase.regionserver.HRegion.doMiniBatchMutation(HRegion.java:2767)
	at org.apache.hadoop.hbase.regionserver.HRegion.batchMutate(HRegion.java:2359)
	at org.apache.hadoop.hbase.regionserver.HRegion.batchMutate(HRegion.java:2314)
	at org.apache.hadoop.hbase.regionserver.HRegion.batchMutate(HRegion.java:2318)
	at org.apache.hadoop.hbase.regionserver.HRegionServer.doBatchOp(HRegionServer.java:4678)
	at org.apache.hadoop.hbase.regionserver.HRegionServer.doNonAtomicRegionMutation(HRegionServer.java:3835)
	at org.apache.hadoop.hbase.regionserver.HRegionServer.multi(HRegionServer.java:3680)
	at org.apache.hadoop.hbase.protobuf.generated.ClientProtos$ClientService$2.callBlockingMethod(ClientProtos.java:32500)
	at org.apache.hadoop.hbase.ipc.RpcServer.call(RpcServer.java:2195)
	at org.apache.hadoop.hbase.ipc.CallRunner.run(CallRunner.java:104)
	at org.apache.hadoop.hbase.ipc.RpcExecutor.consumerLoop(RpcExecutor.java:133)
	at org.apache.hadoop.hbase.ipc.RpcExecutor$1.run(RpcExecutor.java:108)
	at java.lang.Thread.run(Thread.java:745)
Caused by: org.apache.hadoop.hbase.client.RetriesExhaustedWithDetailsException: Failed 1 action:
RegionOpeningException: 1 time, servers with issues: asf934.gq1.ygridcore.net,36751,1518823889058,

	at org.apache.hadoop.hbase.client.AsyncProcess$BatchErrors.makeException(AsyncProcess.java:211)
	at org.apache.hadoop.hbase.client.AsyncProcess$BatchErrors.access$500(AsyncProcess.java:195)
	at org.apache.hadoop.hbase.client.AsyncProcess.getErrors(AsyncProcess.java:1082)
	at org.apache.hadoop.hbase.client.HConnectionManager$HConnectionImplementation.processBatchCallback(HConnectionManager.java:2479)
	at org.apache.hadoop.hbase.client.HTable.batchCallback(HTable.java:898)
	at org.apache.hadoop.hbase.client.HTable.batchCallback(HTable.java:913)
	at org.apache.hadoop.hbase.client.HTable.batch(HTable.java:888)
	at org.apache.phoenix.hbase.index.write.ParallelWriterIndexCommitter$1.call(ParallelWriterIndexCommitter.java:170)
	at org.apache.phoenix.hbase.index.write.ParallelWriterIndexCommitter$1.call(ParallelWriterIndexCommitter.java:133)
	at java.util.concurrent.FutureTask.run(FutureTask.java:262)
	at java.util.concurrent.ThreadPoolExecutor.runWorker(ThreadPoolExecutor.java:1145)
	at java.util.concurrent.ThreadPoolExecutor$Worker.run(ThreadPoolExecutor.java:615)
	... 1 more
: 1 time, servers with issues: asf934.gq1.ygridcore.net,36751,1518823889058, 
	at org.apache.phoenix.tx.ParameterizedTransactionIT.testNonTxToTxTable(ParameterizedTransactionIT.java:288)

[INFO] Tests run: 40, Failures: 0, Errors: 0, Skipped: 0, Time elapsed: 219.429 s - in org.apache.phoenix.tx.TxCheckpointIT
[INFO] 
[INFO] Results:
[INFO] 
[ERROR] Errors: 
[ERROR]   ParameterizedTransactionIT.testNonTxToTxTable:288 » Commit org.apache.hadoop.h...
[ERROR]   ParameterizedTransactionIT.testNonTxToTxTable:288 » Commit org.apache.hadoop.h...
[INFO] 
[ERROR] Tests run: 3378, Failures: 0, Errors: 2, Skipped: 7
[INFO] 
[INFO] 
[INFO] --- maven-failsafe-plugin:2.20:integration-test (HBaseManagedTimeTests) @ phoenix-core
---
[INFO] 
[INFO] -------------------------------------------------------
[INFO]  T E S T S
[INFO] -------------------------------------------------------
[INFO] 
[INFO] Results:
[INFO] 
[INFO] Tests run: 0, Failures: 0, Errors: 0, Skipped: 0
[INFO] 
[INFO] 
[INFO] --- maven-failsafe-plugin:2.20:integration-test (NeedTheirOwnClusterTests) @ phoenix-core
---
[INFO] 
[INFO] -------------------------------------------------------
[INFO]  T E S T S
[INFO] -------------------------------------------------------
[INFO] Running org.apache.hadoop.hbase.regionserver.wal.WALReplayWithIndexWritesAndCompressedWALIT
[INFO] Tests run: 1, Failures: 0, Errors: 0, Skipped: 0, Time elapsed: 21.553 s - in org.apache.hadoop.hbase.regionserver.wal.WALReplayWithIndexWritesAndCompressedWALIT
[INFO] Running org.apache.hadoop.hbase.regionserver.wal.WALRecoveryRegionPostOpenIT
[INFO] Tests run: 1, Failures: 0, Errors: 0, Skipped: 0, Time elapsed: 6.082 s - in org.apache.hadoop.hbase.regionserver.wal.WALRecoveryRegionPostOpenIT
[INFO] Running org.apache.phoenix.end2end.ColumnEncodedMutableNonTxStatsCollectorIT
[INFO] Running org.apache.phoenix.end2end.ColumnEncodedImmutableNonTxStatsCollectorIT
[INFO] Running org.apache.phoenix.end2end.ColumnEncodedImmutableTxStatsCollectorIT
[INFO] Running org.apache.phoenix.end2end.ColumnEncodedMutableTxStatsCollectorIT
[INFO] Running org.apache.phoenix.end2end.ConnectionUtilIT
[INFO] Tests run: 1, Failures: 0, Errors: 0, Skipped: 0, Time elapsed: 19.139 s - in org.apache.phoenix.end2end.ConnectionUtilIT
[WARNING] Tests run: 26, Failures: 0, Errors: 0, Skipped: 4, Time elapsed: 75.981 s - in org.apache.phoenix.end2end.ColumnEncodedImmutableTxStatsCollectorIT
[WARNING] Tests run: 26, Failures: 0, Errors: 0, Skipped: 4, Time elapsed: 77.959 s - in org.apache.phoenix.end2end.ColumnEncodedImmutableNonTxStatsCollectorIT
[WARNING] Tests run: 26, Failures: 0, Errors: 0, Skipped: 4, Time elapsed: 79.748 s - in org.apache.phoenix.end2end.ColumnEncodedMutableNonTxStatsCollectorIT
[INFO] Running org.apache.phoenix.end2end.ContextClassloaderIT
[INFO] Tests run: 3, Failures: 0, Errors: 0, Skipped: 0, Time elapsed: 2.332 s - in org.apache.phoenix.end2end.ContextClassloaderIT
[WARNING] Tests run: 26, Failures: 0, Errors: 0, Skipped: 4, Time elapsed: 78.783 s - in org.apache.phoenix.end2end.ColumnEncodedMutableTxStatsCollectorIT
[INFO] Running org.apache.phoenix.end2end.CsvBulkLoadToolIT
[INFO] Running org.apache.phoenix.end2end.CountDistinctCompressionIT
[INFO] Tests run: 1, Failures: 0, Errors: 0, Skipped: 0, Time elapsed: 2.808 s - in org.apache.phoenix.end2end.CountDistinctCompressionIT
[INFO] Running org.apache.phoenix.end2end.DropSchemaIT
[INFO] Tests run: 2, Failures: 0, Errors: 0, Skipped: 0, Time elapsed: 7.011 s - in org.apache.phoenix.end2end.DropSchemaIT
[INFO] Running org.apache.phoenix.end2end.FlappingLocalIndexIT
[INFO] Running org.apache.phoenix.end2end.IndexExtendedIT
[INFO] Running org.apache.phoenix.end2end.IndexScrutinyToolIT
[INFO] Running org.apache.phoenix.end2end.IndexToolForPartialBuildIT
[INFO] Tests run: 12, Failures: 0, Errors: 0, Skipped: 0, Time elapsed: 75.077 s - in org.apache.phoenix.end2end.CsvBulkLoadToolIT
[INFO] Tests run: 32, Failures: 0, Errors: 0, Skipped: 0, Time elapsed: 74.474 s - in org.apache.phoenix.end2end.IndexExtendedIT
[INFO] Running org.apache.phoenix.end2end.IndexToolForPartialBuildWithNamespaceEnabledIT
[INFO] Tests run: 12, Failures: 0, Errors: 0, Skipped: 0, Time elapsed: 108.753 s - in org.apache.phoenix.end2end.FlappingLocalIndexIT
[INFO] Running org.apache.phoenix.end2end.IndexToolIT
[INFO] Running org.apache.phoenix.end2end.LocalIndexSplitMergeIT
[WARNING] Tests run: 2, Failures: 0, Errors: 0, Skipped: 2, Time elapsed: 0.002 s - in org.apache.phoenix.end2end.LocalIndexSplitMergeIT
[INFO] Running org.apache.phoenix.end2end.MigrateSystemTablesToSystemNamespaceIT
[INFO] Tests run: 4, Failures: 0, Errors: 0, Skipped: 0, Time elapsed: 184.634 s - in org.apache.phoenix.end2end.MigrateSystemTablesToSystemNamespaceIT
[INFO] Tests run: 33, Failures: 0, Errors: 0, Skipped: 0, Time elapsed: 301.302 s - in org.apache.phoenix.end2end.IndexScrutinyToolIT
[INFO] Running org.apache.phoenix.end2end.NonColumnEncodedImmutableNonTxStatsCollectorIT
[INFO] Running org.apache.phoenix.end2end.NonColumnEncodedImmutableTxStatsCollectorIT
[WARNING] Tests run: 26, Failures: 0, Errors: 0, Skipped: 4, Time elapsed: 74.718 s - in org.apache.phoenix.end2end.NonColumnEncodedImmutableNonTxStatsCollectorIT
[WARNING] Tests run: 26, Failures: 0, Errors: 0, Skipped: 4, Time elapsed: 77.185 s - in org.apache.phoenix.end2end.NonColumnEncodedImmutableTxStatsCollectorIT
[INFO] Tests run: 32, Failures: 0, Errors: 0, Skipped: 0, Time elapsed: 333.505 s - in org.apache.phoenix.end2end.IndexToolIT
[INFO] Running org.apache.phoenix.end2end.PhoenixDriverIT
[INFO] Running org.apache.phoenix.end2end.QueryWithLimitIT
[INFO] Running org.apache.phoenix.end2end.QueryTimeoutIT
[INFO] Tests run: 2, Failures: 0, Errors: 0, Skipped: 0, Time elapsed: 3.644 s - in org.apache.phoenix.end2end.QueryWithLimitIT
[INFO] Tests run: 2, Failures: 0, Errors: 0, Skipped: 0, Time elapsed: 10.4 s - in org.apache.phoenix.end2end.QueryTimeoutIT
[INFO] Tests run: 4, Failures: 0, Errors: 0, Skipped: 0, Time elapsed: 46.51 s - in org.apache.phoenix.end2end.PhoenixDriverIT
[INFO] Running org.apache.phoenix.end2end.RebuildIndexConnectionPropsIT
[INFO] Tests run: 1, Failures: 0, Errors: 0, Skipped: 0, Time elapsed: 1.104 s - in org.apache.phoenix.end2end.RebuildIndexConnectionPropsIT
[INFO] Running org.apache.phoenix.end2end.RegexBulkLoadToolIT
[INFO] Running org.apache.phoenix.end2end.RenewLeaseIT
[INFO] Tests run: 1, Failures: 0, Errors: 0, Skipped: 0, Time elapsed: 25.678 s - in org.apache.phoenix.end2end.RenewLeaseIT
[INFO] Tests run: 2, Failures: 0, Errors: 0, Skipped: 0, Time elapsed: 579.716 s - in org.apache.phoenix.end2end.IndexToolForPartialBuildIT
[INFO] Running org.apache.phoenix.end2end.SystemTablePermissionsIT
[INFO] Tests run: 10, Failures: 0, Errors: 0, Skipped: 0, Time elapsed: 60.787 s - in org.apache.phoenix.end2end.RegexBulkLoadToolIT
[INFO] Running org.apache.phoenix.end2end.SpillableGroupByIT
[INFO] Tests run: 2, Failures: 0, Errors: 0, Skipped: 0, Time elapsed: 6.297 s - in org.apache.phoenix.end2end.SpillableGroupByIT
[INFO] Running org.apache.phoenix.end2end.SysTableNamespaceMappedStatsCollectorIT
[INFO] Running org.apache.phoenix.end2end.TableSnapshotReadsMapReduceIT
[INFO] Tests run: 2, Failures: 0, Errors: 0, Skipped: 0, Time elapsed: 577.278 s - in org.apache.phoenix.end2end.IndexToolForPartialBuildWithNamespaceEnabledIT
[INFO] Tests run: 3, Failures: 0, Errors: 0, Skipped: 0, Time elapsed: 18.976 s - in org.apache.phoenix.end2end.TableSnapshotReadsMapReduceIT
[INFO] Running org.apache.phoenix.end2end.UpdateCacheAcrossDifferentClientsIT
[ERROR] Tests run: 2, Failures: 0, Errors: 2, Skipped: 0, Time elapsed: 73.844 s <<<
FAILURE! - in org.apache.phoenix.end2end.SystemTablePermissionsIT
[ERROR] testNamespaceMappedSystemTables(org.apache.phoenix.end2end.SystemTablePermissionsIT)
 Time elapsed: 40.609 s  <<< ERROR!
java.io.IOException: Shutting down
	at org.apache.phoenix.end2end.SystemTablePermissionsIT.testNamespaceMappedSystemTables(SystemTablePermissionsIT.java:162)
Caused by: java.lang.RuntimeException: Master not active after 30000 seconds
	at org.apache.phoenix.end2end.SystemTablePermissionsIT.testNamespaceMappedSystemTables(SystemTablePermissionsIT.java:162)

[ERROR] testSystemTablePermissions(org.apache.phoenix.end2end.SystemTablePermissionsIT)  Time
elapsed: 33.233 s  <<< ERROR!
java.io.IOException: Shutting down
	at org.apache.phoenix.end2end.SystemTablePermissionsIT.testSystemTablePermissions(SystemTablePermissionsIT.java:104)
Caused by: java.lang.RuntimeException: Master not active after 30000 seconds
	at org.apache.phoenix.end2end.SystemTablePermissionsIT.testSystemTablePermissions(SystemTablePermissionsIT.java:104)

[INFO] Tests run: 6, Failures: 0, Errors: 0, Skipped: 0, Time elapsed: 23.888 s - in org.apache.phoenix.end2end.UpdateCacheAcrossDifferentClientsIT
[WARNING] Tests run: 26, Failures: 0, Errors: 0, Skipped: 4, Time elapsed: 78.645 s - in org.apache.phoenix.end2end.SysTableNamespaceMappedStatsCollectorIT
[INFO] Running org.apache.phoenix.end2end.index.ImmutableIndexIT
[INFO] Running org.apache.phoenix.end2end.UserDefinedFunctionsIT
[INFO] Running org.apache.phoenix.end2end.index.LocalIndexIT
[INFO] Running org.apache.phoenix.end2end.index.MutableIndexFailureIT
[INFO] Running org.apache.phoenix.end2end.index.MutableIndexReplicationIT
[INFO] Tests run: 14, Failures: 0, Errors: 0, Skipped: 0, Time elapsed: 33.032 s - in org.apache.phoenix.end2end.UserDefinedFunctionsIT
[INFO] Tests run: 1, Failures: 0, Errors: 0, Skipped: 0, Time elapsed: 17.386 s - in org.apache.phoenix.end2end.index.MutableIndexReplicationIT
[INFO] Running org.apache.phoenix.end2end.index.PartialIndexRebuilderIT
[INFO] Running org.apache.phoenix.end2end.index.txn.TxWriteFailureIT
[INFO] Tests run: 8, Failures: 0, Errors: 0, Skipped: 0, Time elapsed: 46.986 s - in org.apache.phoenix.end2end.index.txn.TxWriteFailureIT
[INFO] Running org.apache.phoenix.execute.PartialCommitIT
[INFO] Tests run: 12, Failures: 0, Errors: 0, Skipped: 0, Time elapsed: 1.241 s - in org.apache.phoenix.execute.PartialCommitIT
[INFO] Running org.apache.phoenix.execute.UpsertSelectOverlappingBatchesIT
[WARNING] Tests run: 40, Failures: 0, Errors: 0, Skipped: 16, Time elapsed: 305.092 s - in
org.apache.phoenix.end2end.index.ImmutableIndexIT
[INFO] Tests run: 26, Failures: 0, Errors: 0, Skipped: 0, Time elapsed: 242.916 s - in org.apache.phoenix.end2end.index.PartialIndexRebuilderIT
[INFO] Running org.apache.phoenix.hbase.index.FailForUnsupportedHBaseVersionsIT
[INFO] Tests run: 36, Failures: 0, Errors: 0, Skipped: 0, Time elapsed: 303.801 s - in org.apache.phoenix.end2end.index.LocalIndexIT
[INFO] Tests run: 2, Failures: 0, Errors: 0, Skipped: 0, Time elapsed: 21.722 s - in org.apache.phoenix.hbase.index.FailForUnsupportedHBaseVersionsIT
[INFO] Running org.apache.phoenix.iterate.RoundRobinResultIteratorWithStatsIT
[INFO] Tests run: 1, Failures: 0, Errors: 0, Skipped: 0, Time elapsed: 7.341 s - in org.apache.phoenix.iterate.RoundRobinResultIteratorWithStatsIT
[INFO] Running org.apache.phoenix.iterate.ScannerLeaseRenewalIT
[INFO] Running org.apache.phoenix.monitoring.PhoenixMetricsIT
[INFO] Running org.apache.phoenix.rpc.PhoenixClientRpcIT
[INFO] Tests run: 2, Failures: 0, Errors: 0, Skipped: 0, Time elapsed: 2.475 s - in org.apache.phoenix.rpc.PhoenixClientRpcIT
[INFO] Tests run: 22, Failures: 0, Errors: 0, Skipped: 0, Time elapsed: 59.96 s - in org.apache.phoenix.monitoring.PhoenixMetricsIT
[INFO] Running org.apache.phoenix.rpc.PhoenixServerRpcIT
[INFO] Tests run: 2, Failures: 0, Errors: 0, Skipped: 0, Time elapsed: 11.874 s - in org.apache.phoenix.rpc.PhoenixServerRpcIT
[INFO] Tests run: 3, Failures: 0, Errors: 0, Skipped: 0, Time elapsed: 220.593 s - in org.apache.phoenix.execute.UpsertSelectOverlappingBatchesIT
[INFO] Tests run: 2, Failures: 0, Errors: 0, Skipped: 0, Time elapsed: 160.747 s - in org.apache.phoenix.iterate.ScannerLeaseRenewalIT
[INFO] Tests run: 21, Failures: 0, Errors: 0, Skipped: 0, Time elapsed: 548.199 s - in org.apache.phoenix.end2end.index.MutableIndexFailureIT
[INFO] 
[INFO] Results:
[INFO] 
[ERROR] Errors: 
[ERROR]   SystemTablePermissionsIT.testNamespaceMappedSystemTables:162 » IO Shutting dow...
[ERROR]   SystemTablePermissionsIT.testSystemTablePermissions:104 » IO Shutting down
[INFO] 
[ERROR] Tests run: 547, Failures: 0, Errors: 2, Skipped: 46
[INFO] 
[INFO] 
[INFO] --- maven-failsafe-plugin:2.20:verify (ParallelStatsEnabledTest) @ phoenix-core ---
[INFO] ------------------------------------------------------------------------
[INFO] Reactor Summary:
[INFO] 
[INFO] Apache Phoenix ..................................... SUCCESS [  4.100 s]
[INFO] Phoenix Core ....................................... FAILURE [  01:30 h]
[INFO] Phoenix - Flume .................................... SKIPPED
[INFO] Phoenix - Kafka .................................... SKIPPED
[INFO] Phoenix - Pig ...................................... SKIPPED
[INFO] Phoenix Query Server Client ........................ SKIPPED
[INFO] Phoenix Query Server ............................... SKIPPED
[INFO] Phoenix - Pherf .................................... SKIPPED
[INFO] Phoenix - Spark .................................... SKIPPED
[INFO] Phoenix - Hive ..................................... SKIPPED
[INFO] Phoenix Client ..................................... SKIPPED
[INFO] Phoenix Server ..................................... SKIPPED
[INFO] Phoenix Assembly ................................... SKIPPED
[INFO] Phoenix - Tracing Web Application .................. SKIPPED
[INFO] Phoenix Load Balancer .............................. SKIPPED
[INFO] ------------------------------------------------------------------------
[INFO] BUILD FAILURE
[INFO] ------------------------------------------------------------------------
[INFO] Total time: 01:31 h
[INFO] Finished at: 2018-02-17T00:00:33Z
[INFO] Final Memory: 64M/931M
[INFO] ------------------------------------------------------------------------
[ERROR] Failed to execute goal org.apache.maven.plugins:maven-failsafe-plugin:2.20:verify
(ParallelStatsEnabledTest) on project phoenix-core: There are test failures.
[ERROR] 
[ERROR] Please refer to <https://builds.apache.org/job/Phoenix-4.x-HBase-0.98/ws/phoenix-core/target/failsafe-reports>
for the individual test results.
[ERROR] Please refer to dump files (if any exist) [date]-jvmRun[N].dump, [date].dumpstream
and [date]-jvmRun[N].dumpstream.
[ERROR] -> [Help 1]
[ERROR] 
[ERROR] To see the full stack trace of the errors, re-run Maven with the -e switch.
[ERROR] Re-run Maven using the -X switch to enable full debug logging.
[ERROR] 
[ERROR] For more information about the errors and possible solutions, please read the following
articles:
[ERROR] [Help 1] http://cwiki.apache.org/confluence/display/MAVEN/MojoFailureException
[ERROR] 
[ERROR] After correcting the problems, you can resume the build with the command
[ERROR]   mvn <goals> -rf :phoenix-core
Build step 'Invoke top-level Maven targets' marked build as failure
Archiving artifacts
Recording test results

Mime
View raw message