phoenix-commits mailing list archives

Site index · List index
Message view « Date » · « Thread »
Top « Date » · « Thread »
From Apache Jenkins Server <jenk...@builds.apache.org>
Subject Build failed in Jenkins: Phoenix | Master #1889
Date Thu, 07 Dec 2017 19:54:41 GMT
See <https://builds.apache.org/job/Phoenix-master/1889/display/redirect?page=changes>

Changes:

[castives] PHOENIX-3837 Feature enabling to set property on an index with Alter

------------------------------------------
[...truncated 49.56 KB...]
[INFO] Tests run: 4, Failures: 0, Errors: 0, Skipped: 0, Time elapsed: 0.053 s - in org.apache.phoenix.util.MetaDataUtilTest
[INFO] Running org.apache.phoenix.util.TenantIdByteConversionTest
[INFO] Tests run: 18, Failures: 0, Errors: 0, Skipped: 0, Time elapsed: 0.043 s - in org.apache.phoenix.util.TenantIdByteConversionTest
[INFO] Running org.apache.phoenix.util.ByteUtilTest
[INFO] Tests run: 4, Failures: 0, Errors: 0, Skipped: 0, Time elapsed: 0.517 s - in org.apache.phoenix.util.PhoenixEncodeDecodeTest
[INFO] Running org.apache.phoenix.util.ScanUtilTest
[INFO] Tests run: 20, Failures: 0, Errors: 0, Skipped: 0, Time elapsed: 0.032 s - in org.apache.phoenix.util.ScanUtilTest
[INFO] Running org.apache.phoenix.util.SequenceUtilTest
[INFO] Tests run: 18, Failures: 0, Errors: 0, Skipped: 0, Time elapsed: 0.011 s - in org.apache.phoenix.util.SequenceUtilTest
[INFO] Running org.apache.phoenix.util.PhoenixContextExecutorTest
[INFO] Tests run: 1, Failures: 0, Errors: 0, Skipped: 0, Time elapsed: 0.002 s - in org.apache.phoenix.util.PhoenixContextExecutorTest
[INFO] Running org.apache.phoenix.util.QueryUtilTest
[INFO] Tests run: 3, Failures: 0, Errors: 0, Skipped: 0, Time elapsed: 0.072 s - in org.apache.phoenix.util.ByteUtilTest
[INFO] Running org.apache.phoenix.util.json.JsonUpsertExecutorTest
[INFO] Tests run: 11, Failures: 0, Errors: 0, Skipped: 0, Time elapsed: 0.016 s - in org.apache.phoenix.util.QueryUtilTest
[INFO] Running org.apache.phoenix.util.PropertiesUtilTest
[INFO] Tests run: 4, Failures: 0, Errors: 0, Skipped: 0, Time elapsed: 0.062 s - in org.apache.phoenix.util.PropertiesUtilTest
[INFO] Running org.apache.phoenix.util.QualifierEncodingSchemeTest
[INFO] Tests run: 4, Failures: 0, Errors: 0, Skipped: 0, Time elapsed: 0.009 s - in org.apache.phoenix.util.QualifierEncodingSchemeTest
[INFO] Running org.apache.phoenix.util.LikeExpressionTest
[INFO] Tests run: 1, Failures: 0, Errors: 0, Skipped: 0, Time elapsed: 0.002 s - in org.apache.phoenix.util.LikeExpressionTest
[INFO] Running org.apache.phoenix.util.PrefixByteEncoderDecoderTest
[INFO] Tests run: 3, Failures: 0, Errors: 0, Skipped: 0, Time elapsed: 0.003 s - in org.apache.phoenix.util.PrefixByteEncoderDecoderTest
[INFO] Running org.apache.phoenix.util.IndexUtilTest
[INFO] Tests run: 2, Failures: 0, Errors: 0, Skipped: 0, Time elapsed: 0.004 s - in org.apache.phoenix.util.IndexUtilTest
[INFO] Running org.apache.phoenix.util.JDBCUtilTest
[INFO] Tests run: 8, Failures: 0, Errors: 0, Skipped: 0, Time elapsed: 0.785 s - in org.apache.phoenix.util.csv.CsvUpsertExecutorTest
[INFO] Running org.apache.phoenix.util.Base62EncoderTest
[INFO] Tests run: 3, Failures: 0, Errors: 0, Skipped: 0, Time elapsed: 0.279 s - in org.apache.phoenix.util.LogUtilTest
[INFO] Running org.apache.phoenix.util.ColumnInfoTest
[INFO] Tests run: 13, Failures: 0, Errors: 0, Skipped: 0, Time elapsed: 0.01 s - in org.apache.phoenix.util.JDBCUtilTest
[INFO] Running org.apache.phoenix.util.DateUtilTest
[INFO] Tests run: 5, Failures: 0, Errors: 0, Skipped: 0, Time elapsed: 0.01 s - in org.apache.phoenix.util.ColumnInfoTest
[INFO] Running org.apache.phoenix.util.StringUtilTest
[INFO] Tests run: 1, Failures: 0, Errors: 0, Skipped: 0, Time elapsed: 0.018 s - in org.apache.phoenix.util.Base62EncoderTest
[INFO] Running org.apache.phoenix.util.PhoenixRuntimeTest
[INFO] Tests run: 5, Failures: 0, Errors: 0, Skipped: 0, Time elapsed: 0.022 s - in org.apache.phoenix.util.StringUtilTest
[INFO] Running org.apache.phoenix.compile.WhereOptimizerTest
[INFO] Tests run: 22, Failures: 0, Errors: 0, Skipped: 0, Time elapsed: 0.043 s - in org.apache.phoenix.util.DateUtilTest
[INFO] Running org.apache.phoenix.compile.ScanRangesIntersectTest
[INFO] Tests run: 1, Failures: 0, Errors: 0, Skipped: 0, Time elapsed: 0.003 s - in org.apache.phoenix.compile.ScanRangesIntersectTest
[INFO] Running org.apache.phoenix.compile.QueryOptimizerTest
[INFO] Tests run: 24, Failures: 0, Errors: 0, Skipped: 0, Time elapsed: 1.331 s - in org.apache.phoenix.index.IndexMaintainerTest
[INFO] Running org.apache.phoenix.compile.SaltedScanRangesTest
[INFO] Tests run: 9, Failures: 0, Errors: 0, Skipped: 0, Time elapsed: 0.036 s - in org.apache.phoenix.compile.SaltedScanRangesTest
[INFO] Running org.apache.phoenix.compile.HavingCompilerTest
[INFO] Tests run: 2, Failures: 0, Errors: 0, Skipped: 0, Time elapsed: 1.304 s - in org.apache.phoenix.filter.SkipScanBigFilterTest
[INFO] Running org.apache.phoenix.compile.QueryMetaDataTest
[INFO] Tests run: 11, Failures: 0, Errors: 0, Skipped: 0, Time elapsed: 0.381 s - in org.apache.phoenix.compile.HavingCompilerTest
[INFO] Running org.apache.phoenix.compile.QueryCompilerTest
[INFO] Tests run: 8, Failures: 0, Errors: 0, Skipped: 0, Time elapsed: 1.084 s - in org.apache.phoenix.util.json.JsonUpsertExecutorTest
[INFO] Running org.apache.phoenix.compile.ScanRangesTest
[INFO] Tests run: 2, Failures: 0, Errors: 0, Skipped: 0, Time elapsed: 4.469 s - in org.apache.phoenix.query.ScannerLeaseRenewalTest
[INFO] Running org.apache.phoenix.compile.LimitCompilerTest
[INFO] Tests run: 34, Failures: 0, Errors: 0, Skipped: 0, Time elapsed: 0.066 s - in org.apache.phoenix.compile.ScanRangesTest
[INFO] Running org.apache.phoenix.compile.TenantSpecificViewIndexCompileTest
[INFO] Tests run: 32, Failures: 0, Errors: 0, Skipped: 0, Time elapsed: 0.635 s - in org.apache.phoenix.compile.QueryMetaDataTest
[INFO] Running org.apache.phoenix.compile.StatementHintsCompilationTest
[INFO] Tests run: 12, Failures: 0, Errors: 0, Skipped: 0, Time elapsed: 1.225 s - in org.apache.phoenix.util.PhoenixRuntimeTest
[INFO] Running org.apache.phoenix.compile.ViewCompilerTest
[INFO] Tests run: 109, Failures: 0, Errors: 0, Skipped: 0, Time elapsed: 1.374 s - in org.apache.phoenix.compile.WhereOptimizerTest
[INFO] Running org.apache.phoenix.compile.CursorCompilerTest
[INFO] Tests run: 4, Failures: 0, Errors: 0, Skipped: 0, Time elapsed: 0.432 s - in org.apache.phoenix.compile.StatementHintsCompilationTest
[INFO] Running org.apache.phoenix.compile.JoinQueryCompilerTest
[INFO] Tests run: 3, Failures: 0, Errors: 0, Skipped: 0, Time elapsed: 0.458 s - in org.apache.phoenix.compile.ViewCompilerTest
[INFO] Running org.apache.phoenix.compile.WhereCompilerTest
[INFO] Tests run: 6, Failures: 0, Errors: 0, Skipped: 0, Time elapsed: 0.741 s - in org.apache.phoenix.compile.LimitCompilerTest
[INFO] Running org.apache.phoenix.compile.SelectStatementRewriterTest
[INFO] Tests run: 1, Failures: 0, Errors: 0, Skipped: 0, Time elapsed: 0.507 s - in org.apache.phoenix.compile.CursorCompilerTest
[INFO] Running org.apache.phoenix.compile.CreateTableCompilerTest
[INFO] Tests run: 2, Failures: 0, Errors: 0, Skipped: 0, Time elapsed: 0.415 s - in org.apache.phoenix.compile.JoinQueryCompilerTest
[INFO] Running org.apache.phoenix.trace.TraceSpanReceiverTest
[INFO] Tests run: 5, Failures: 0, Errors: 0, Skipped: 0, Time elapsed: 0.465 s - in org.apache.phoenix.compile.SelectStatementRewriterTest
[INFO] Running org.apache.phoenix.schema.ImmutableStorageSchemeTest
[INFO] Tests run: 2, Failures: 0, Errors: 0, Skipped: 0, Time elapsed: 0.287 s - in org.apache.phoenix.trace.TraceSpanReceiverTest
[INFO] Running org.apache.phoenix.schema.RowKeyValueAccessorTest
[WARNING] Tests run: 45, Failures: 0, Errors: 0, Skipped: 1, Time elapsed: 0.597 s - in org.apache.phoenix.compile.WhereCompilerTest
[INFO] Running org.apache.phoenix.schema.MutationTest
[INFO] Tests run: 1, Failures: 0, Errors: 0, Skipped: 0, Time elapsed: 0.383 s - in org.apache.phoenix.compile.CreateTableCompilerTest
[INFO] Running org.apache.phoenix.schema.SchemaUtilTest
[INFO] Tests run: 6, Failures: 0, Errors: 0, Skipped: 0, Time elapsed: 0.007 s - in org.apache.phoenix.schema.SchemaUtilTest
[INFO] Running org.apache.phoenix.schema.stats.StatisticsScannerTest
[INFO] Tests run: 4, Failures: 0, Errors: 0, Skipped: 0, Time elapsed: 0.213 s - in org.apache.phoenix.schema.ImmutableStorageSchemeTest
[INFO] Running org.apache.phoenix.schema.PCharPadTest
[INFO] Tests run: 9, Failures: 0, Errors: 0, Skipped: 0, Time elapsed: 0.012 s - in org.apache.phoenix.schema.PCharPadTest
[INFO] Running org.apache.phoenix.schema.RowKeySchemaTest
[INFO] Tests run: 1, Failures: 0, Errors: 0, Skipped: 0, Time elapsed: 0.365 s - in org.apache.phoenix.schema.RowKeyValueAccessorTest
[INFO] Running org.apache.phoenix.schema.types.PrimitiveBooleanPhoenixArrayToStringTest
[INFO] Tests run: 6, Failures: 0, Errors: 0, Skipped: 0, Time elapsed: 0.009 s - in org.apache.phoenix.schema.types.PrimitiveBooleanPhoenixArrayToStringTest
[INFO] Running org.apache.phoenix.schema.types.PrimitiveDoublePhoenixArrayToStringTest
[INFO] Tests run: 6, Failures: 0, Errors: 0, Skipped: 0, Time elapsed: 0.014 s - in org.apache.phoenix.schema.types.PrimitiveDoublePhoenixArrayToStringTest
[INFO] Running org.apache.phoenix.schema.types.PDataTypeForArraysTest
[INFO] Tests run: 2, Failures: 0, Errors: 0, Skipped: 0, Time elapsed: 0.336 s - in org.apache.phoenix.schema.MutationTest
[INFO] Running org.apache.phoenix.schema.types.PrimitiveShortPhoenixArrayToStringTest
[INFO] Tests run: 6, Failures: 0, Errors: 0, Skipped: 0, Time elapsed: 0.007 s - in org.apache.phoenix.schema.types.PrimitiveShortPhoenixArrayToStringTest
[INFO] Running org.apache.phoenix.schema.types.PDateArrayToStringTest
[INFO] Tests run: 6, Failures: 0, Errors: 0, Skipped: 0, Time elapsed: 0.008 s - in org.apache.phoenix.schema.types.PDateArrayToStringTest
[INFO] Running org.apache.phoenix.schema.types.PVarcharArrayToStringTest
[INFO] Tests run: 8, Failures: 0, Errors: 0, Skipped: 0, Time elapsed: 0.005 s - in org.apache.phoenix.schema.types.PVarcharArrayToStringTest
[INFO] Running org.apache.phoenix.schema.types.PrimitiveLongPhoenixArrayToStringTest
[INFO] Tests run: 6, Failures: 0, Errors: 0, Skipped: 0, Time elapsed: 0.005 s - in org.apache.phoenix.schema.types.PrimitiveLongPhoenixArrayToStringTest
[INFO] Running org.apache.phoenix.schema.types.PrimitiveIntPhoenixArrayToStringTest
[INFO] Tests run: 6, Failures: 0, Errors: 0, Skipped: 0, Time elapsed: 0.005 s - in org.apache.phoenix.schema.types.PrimitiveIntPhoenixArrayToStringTest
[INFO] Running org.apache.phoenix.schema.types.PrimitiveFloatPhoenixArrayToStringTest
[INFO] Tests run: 6, Failures: 0, Errors: 0, Skipped: 0, Time elapsed: 0.005 s - in org.apache.phoenix.schema.types.PrimitiveFloatPhoenixArrayToStringTest
[INFO] Running org.apache.phoenix.schema.types.PrimitiveBytePhoenixArrayToStringTest
[INFO] Tests run: 6, Failures: 0, Errors: 0, Skipped: 0, Time elapsed: 0.006 s - in org.apache.phoenix.schema.types.PrimitiveBytePhoenixArrayToStringTest
[INFO] Running org.apache.phoenix.schema.types.PDataTypeTest
[INFO] Tests run: 69, Failures: 0, Errors: 0, Skipped: 0, Time elapsed: 0.109 s - in org.apache.phoenix.schema.types.PDataTypeForArraysTest
[INFO] Tests run: 4, Failures: 0, Errors: 0, Skipped: 0, Time elapsed: 0.421 s - in org.apache.phoenix.schema.stats.StatisticsScannerTest
[INFO] Running org.apache.phoenix.schema.ValueBitSetTest
[INFO] Tests run: 4, Failures: 0, Errors: 0, Skipped: 0, Time elapsed: 0 s - in org.apache.phoenix.schema.ValueBitSetTest
[INFO] Running org.apache.phoenix.schema.SaltingUtilTest
[INFO] Tests run: 2, Failures: 0, Errors: 0, Skipped: 0, Time elapsed: 0.003 s - in org.apache.phoenix.schema.SaltingUtilTest
[INFO] Running org.apache.phoenix.schema.PMetaDataImplTest
[INFO] Running org.apache.phoenix.schema.SequenceAllocationTest
[INFO] Tests run: 2, Failures: 0, Errors: 0, Skipped: 0, Time elapsed: 0.003 s - in org.apache.phoenix.schema.SequenceAllocationTest
[INFO] Running org.apache.phoenix.schema.SortOrderTest
[INFO] Tests run: 5, Failures: 0, Errors: 0, Skipped: 0, Time elapsed: 0.006 s - in org.apache.phoenix.schema.PMetaDataImplTest
[INFO] Running org.apache.phoenix.metrics.MetricTypeTest
[INFO] Tests run: 1, Failures: 0, Errors: 0, Skipped: 0, Time elapsed: 0.002 s - in org.apache.phoenix.metrics.MetricTypeTest
[INFO] Tests run: 8, Failures: 0, Errors: 0, Skipped: 0, Time elapsed: 0.005 s - in org.apache.phoenix.schema.SortOrderTest
[INFO] Running org.apache.phoenix.hbase.index.parallel.TestThreadPoolBuilder
[INFO] Running org.apache.phoenix.memory.MemoryManagerTest
[INFO] Tests run: 2, Failures: 0, Errors: 0, Skipped: 0, Time elapsed: 0.019 s - in org.apache.phoenix.hbase.index.parallel.TestThreadPoolBuilder
[INFO] Running org.apache.phoenix.hbase.index.parallel.TestThreadPoolManager
[INFO] Tests run: 6, Failures: 0, Errors: 0, Skipped: 0, Time elapsed: 1.769 s - in org.apache.phoenix.compile.TenantSpecificViewIndexCompileTest
[INFO] Running org.apache.phoenix.hbase.index.write.TestIndexWriter
[INFO] Tests run: 3, Failures: 0, Errors: 0, Skipped: 0, Time elapsed: 0.011 s - in org.apache.phoenix.hbase.index.parallel.TestThreadPoolManager
[INFO] Running org.apache.phoenix.hbase.index.write.TestParalleIndexWriter
[INFO] Tests run: 6, Failures: 0, Errors: 0, Skipped: 0, Time elapsed: 0.532 s - in org.apache.phoenix.schema.RowKeySchemaTest
[INFO] Running org.apache.phoenix.hbase.index.write.TestParalleWriterIndexCommitter
[INFO] Tests run: 36, Failures: 0, Errors: 0, Skipped: 0, Time elapsed: 0.254 s - in org.apache.phoenix.schema.types.PDataTypeTest
[INFO] Running org.apache.phoenix.hbase.index.write.TestWALRecoveryCaching
[WARNING] Tests run: 1, Failures: 0, Errors: 0, Skipped: 1, Time elapsed: 0.008 s - in org.apache.phoenix.hbase.index.write.TestWALRecoveryCaching
[INFO] Running org.apache.phoenix.hbase.index.write.recovery.TestPerRegionIndexWriteCache
[INFO] Tests run: 4, Failures: 0, Errors: 0, Skipped: 0, Time elapsed: 0.207 s - in org.apache.phoenix.memory.MemoryManagerTest
[INFO] Running org.apache.phoenix.hbase.index.covered.CoveredColumnsTest
[INFO] Tests run: 1, Failures: 0, Errors: 0, Skipped: 0, Time elapsed: 0.004 s - in org.apache.phoenix.hbase.index.covered.CoveredColumnsTest
[INFO] Running org.apache.phoenix.hbase.index.covered.TestCoveredColumnIndexCodec
[INFO] Tests run: 4, Failures: 0, Errors: 0, Skipped: 0, Time elapsed: 0.235 s - in org.apache.phoenix.hbase.index.write.TestIndexWriter
[INFO] Running org.apache.phoenix.hbase.index.covered.update.TestIndexUpdateManager
[INFO] Tests run: 47, Failures: 0, Errors: 0, Skipped: 0, Time elapsed: 2.992 s - in org.apache.phoenix.compile.QueryOptimizerTest
[INFO] Running org.apache.phoenix.hbase.index.covered.data.TestIndexMemStore
[INFO] Tests run: 3, Failures: 0, Errors: 0, Skipped: 0, Time elapsed: 0.052 s - in org.apache.phoenix.hbase.index.covered.TestCoveredColumnIndexCodec
[INFO] Running org.apache.phoenix.hbase.index.covered.data.TestLocalTable
[INFO] Tests run: 1, Failures: 0, Errors: 0, Skipped: 0, Time elapsed: 0 s - in org.apache.phoenix.hbase.index.covered.data.TestLocalTable
[INFO] Running org.apache.phoenix.hbase.index.covered.filter.TestNewerTimestampFilter
[INFO] Tests run: 2, Failures: 0, Errors: 0, Skipped: 0, Time elapsed: 0.011 s - in org.apache.phoenix.hbase.index.covered.data.TestIndexMemStore
[INFO] Running org.apache.phoenix.hbase.index.covered.filter.TestApplyAndFilterDeletesFilter
[INFO] Tests run: 1, Failures: 0, Errors: 0, Skipped: 0, Time elapsed: 0.003 s - in org.apache.phoenix.hbase.index.covered.filter.TestNewerTimestampFilter
[INFO] Running org.apache.phoenix.hbase.index.covered.TestColumnTracker
[INFO] Tests run: 2, Failures: 0, Errors: 0, Skipped: 0, Time elapsed: 0.023 s - in org.apache.phoenix.hbase.index.covered.update.TestIndexUpdateManager
[INFO] Tests run: 3, Failures: 0, Errors: 0, Skipped: 0, Time elapsed: 0.003 s - in org.apache.phoenix.hbase.index.covered.TestColumnTracker
[INFO] Running org.apache.phoenix.hbase.index.covered.LocalTableStateTest
[INFO] Running org.apache.phoenix.hbase.index.covered.TestCoveredIndexSpecifierBuilder
[INFO] Tests run: 6, Failures: 0, Errors: 0, Skipped: 0, Time elapsed: 0.01 s - in org.apache.phoenix.hbase.index.covered.filter.TestApplyAndFilterDeletesFilter
[INFO] Tests run: 1, Failures: 0, Errors: 0, Skipped: 0, Time elapsed: 0.004 s - in org.apache.phoenix.hbase.index.covered.TestCoveredIndexSpecifierBuilder
[INFO] Running org.apache.phoenix.hbase.index.covered.NonTxIndexBuilderTest
[INFO] Running org.apache.phoenix.hbase.index.util.TestIndexManagementUtil
[INFO] Tests run: 3, Failures: 0, Errors: 0, Skipped: 0, Time elapsed: 0.024 s - in org.apache.phoenix.hbase.index.util.TestIndexManagementUtil
[INFO] Tests run: 5, Failures: 0, Errors: 0, Skipped: 0, Time elapsed: 0.074 s - in org.apache.phoenix.hbase.index.covered.LocalTableStateTest
[INFO] Tests run: 2, Failures: 0, Errors: 0, Skipped: 0, Time elapsed: 0.264 s - in org.apache.phoenix.hbase.index.write.TestParalleWriterIndexCommitter
[INFO] Tests run: 2, Failures: 0, Errors: 0, Skipped: 0, Time elapsed: 0.418 s - in org.apache.phoenix.hbase.index.write.TestParalleIndexWriter
[INFO] Tests run: 3, Failures: 0, Errors: 0, Skipped: 0, Time elapsed: 0.65 s - in org.apache.phoenix.hbase.index.write.recovery.TestPerRegionIndexWriteCache
[INFO] Tests run: 3, Failures: 0, Errors: 0, Skipped: 0, Time elapsed: 1.829 s - in org.apache.phoenix.hbase.index.covered.NonTxIndexBuilderTest
[INFO] Tests run: 156, Failures: 0, Errors: 0, Skipped: 0, Time elapsed: 4.487 s - in org.apache.phoenix.compile.QueryCompilerTest
[INFO] Tests run: 8, Failures: 0, Errors: 0, Skipped: 0, Time elapsed: 20.767 s - in org.apache.phoenix.jdbc.SecureUserConnectionsTest
[INFO] 
[INFO] Results:
[INFO] 
[WARNING] Tests run: 1554, Failures: 0, Errors: 0, Skipped: 3
[INFO] 
[INFO] 
[INFO] --- maven-source-plugin:2.2.1:jar-no-fork (attach-sources) @ phoenix-core ---
[INFO] Building jar: <https://builds.apache.org/job/Phoenix-master/1889/artifact/phoenix-core/target/phoenix-core-4.14.0-HBase-1.3-SNAPSHOT-sources.jar>
[INFO] 
[INFO] --- maven-jar-plugin:2.4:test-jar (default) @ phoenix-core ---
[INFO] Building jar: <https://builds.apache.org/job/Phoenix-master/1889/artifact/phoenix-core/target/phoenix-core-4.14.0-HBase-1.3-SNAPSHOT-tests.jar>
[INFO] 
[INFO] --- maven-jar-plugin:2.4:jar (default-jar) @ phoenix-core ---
[INFO] Building jar: <https://builds.apache.org/job/Phoenix-master/1889/artifact/phoenix-core/target/phoenix-core-4.14.0-HBase-1.3-SNAPSHOT.jar>
[INFO] 
[INFO] --- maven-site-plugin:3.2:attach-descriptor (attach-descriptor) @ phoenix-core ---
[INFO] 
[INFO] --- maven-assembly-plugin:2.5.2:single (core) @ phoenix-core ---
[INFO] Reading assembly descriptor: src/build/phoenix-core.xml
[WARNING] Artifact: org.apache.phoenix:phoenix-core:jar:4.14.0-HBase-1.3-SNAPSHOT references
the same file as the assembly destination file. Moving it to a temporary location for inclusion.
[INFO] Building jar: <https://builds.apache.org/job/Phoenix-master/1889/artifact/phoenix-core/target/phoenix-core-4.14.0-HBase-1.3-SNAPSHOT.jar>
[INFO] 
[INFO] --- maven-failsafe-plugin:2.20:integration-test (ParallelStatsEnabledTest) @ phoenix-core
---
Downloading from central: https://repo.maven.apache.org/maven2/org/apache/maven/surefire/common-java5/2.20/common-java5-2.20.pom
[WARNING] Failed to create parent directories for tracking file /home/jenkins/.m2/repository/org/apache/maven/surefire/common-java5/2.20/common-java5-2.20.pom.lastUpdated
Downloading from central: https://repo.maven.apache.org/maven2/org/apache/maven/surefire/surefire-grouper/2.20/surefire-grouper-2.20.pom
[WARNING] Failed to create parent directories for tracking file /home/jenkins/.m2/repository/org/apache/maven/surefire/surefire-grouper/2.20/surefire-grouper-2.20.pom.lastUpdated
[INFO] Failure detected.
[INFO] ------------------------------------------------------------------------
[INFO] Reactor Summary:
[INFO] 
[INFO] Apache Phoenix ..................................... SUCCESS [  2.442 s]
[INFO] Phoenix Core ....................................... FAILURE [01:22 min]
[INFO] Phoenix - Flume .................................... SKIPPED
[INFO] Phoenix - Kafka .................................... SKIPPED
[INFO] Phoenix - Pig ...................................... SKIPPED
[INFO] Phoenix Query Server Client ........................ SKIPPED
[INFO] Phoenix Query Server ............................... SKIPPED
[INFO] Phoenix - Pherf .................................... SKIPPED
[INFO] Phoenix - Spark .................................... SKIPPED
[INFO] Phoenix - Hive ..................................... SKIPPED
[INFO] Phoenix Client ..................................... SKIPPED
[INFO] Phoenix Server ..................................... SKIPPED
[INFO] Phoenix Assembly ................................... SKIPPED
[INFO] Phoenix - Tracing Web Application .................. SKIPPED
[INFO] Phoenix Load Balancer .............................. SKIPPED
[INFO] ------------------------------------------------------------------------
[INFO] BUILD FAILURE
[INFO] ------------------------------------------------------------------------
[INFO] Total time: 01:26 min
[INFO] Finished at: 2017-12-07T19:53:17Z
[INFO] Final Memory: 101M/1815M
[INFO] ------------------------------------------------------------------------
[ERROR] Failed to execute goal org.apache.maven.plugins:maven-failsafe-plugin:2.20:integration-test
(ParallelStatsEnabledTest) on project phoenix-core: Unable to generate classpath: org.apache.maven.artifact.resolver.ArtifactResolutionException:
Unable to get dependency information for org.apache.maven.surefire:common-java5:jar:2.20:
Failed to retrieve POM for org.apache.maven.surefire:common-java5:jar:2.20: Could not transfer
artifact org.apache.maven.surefire:common-java5:pom:2.20 from/to central (https://repo.maven.apache.org/maven2):
/home/jenkins/.m2/repository/org/apache/maven/surefire/common-java5/2.20/common-java5-2.20.pom.part.lock
(No such file or directory)
[ERROR]   org.apache.maven.surefire:common-java5:jar:2.20
[ERROR] 
[ERROR] from the specified remote repositories:
[ERROR]   central (https://repo.maven.apache.org/maven2, releases=true, snapshots=false),
[ERROR]   Nexus (http://repository.apache.org/snapshots, releases=false, snapshots=true)
[ERROR] Path to dependency: 
[ERROR] 	1) dummy:dummy:jar:1.0
[ERROR] 	2) org.apache.maven.surefire:surefire-junit47:jar:2.20
[ERROR] 	3) org.apache.maven.surefire:common-junit48:jar:2.20
[ERROR] 	4) org.apache.maven.surefire:common-junit4:jar:2.20
[ERROR] 
[ERROR] 
[ERROR] -> [Help 1]
[ERROR] 
[ERROR] To see the full stack trace of the errors, re-run Maven with the -e switch.
[ERROR] Re-run Maven using the -X switch to enable full debug logging.
[ERROR] 
[ERROR] For more information about the errors and possible solutions, please read the following
articles:
[ERROR] [Help 1] http://cwiki.apache.org/confluence/display/MAVEN/MojoExecutionException
[ERROR] 
[ERROR] After correcting the problems, you can resume the build with the command
[ERROR]   mvn <goals> -rf :phoenix-core
Build step 'Invoke top-level Maven targets' marked build as failure
Archiving artifacts
[JIRA] Updating issue PHOENIX-3837
Recording test results
Not sending mail to unregistered user castives@gmail.com

Mime
View raw message