phoenix-commits mailing list archives

Site index · List index
Message view « Date » · « Thread »
Top « Date » · « Thread »
From Apache Jenkins Server <jenk...@builds.apache.org>
Subject Build failed in Jenkins: Phoenix Compile Compatibility with HBase #465
Date Mon, 20 Nov 2017 09:23:30 GMT
See <https://builds.apache.org/job/Phoenix_Compile_Compat_wHBase/465/display/redirect>

------------------------------------------
Started by timer
[EnvInject] - Loading node environment variables.
Building remotely on H25 (ubuntu xenial) in workspace <https://builds.apache.org/job/Phoenix_Compile_Compat_wHBase/ws/>
[Phoenix_Compile_Compat_wHBase] $ /bin/bash /tmp/jenkins7374534702946981275.sh
core file size          (blocks, -c) 0
data seg size           (kbytes, -d) unlimited
scheduling priority             (-e) 0
file size               (blocks, -f) unlimited
pending signals                 (-i) 386417
max locked memory       (kbytes, -l) 64
max memory size         (kbytes, -m) unlimited
open files                      (-n) 60000
pipe size            (512 bytes, -p) 8
POSIX message queues     (bytes, -q) 819200
real-time priority              (-r) 0
stack size              (kbytes, -s) 8192
cpu time               (seconds, -t) unlimited
max user processes              (-u) 10240
virtual memory          (kbytes, -v) unlimited
file locks                      (-x) unlimited
core id		: 0
core id		: 1
core id		: 2
core id		: 3
core id		: 4
core id		: 5
physical id	: 0
physical id	: 1
MemTotal:       98958120 kB
MemFree:        49718440 kB
Filesystem      Size  Used Avail Use% Mounted on
udev             48G     0   48G   0% /dev
tmpfs           9.5G  994M  8.5G  11% /run
/dev/sda1       364G  230G  117G  67% /
tmpfs            48G  1.1M   48G   1% /dev/shm
tmpfs           5.0M     0  5.0M   0% /run/lock
tmpfs            48G     0   48G   0% /sys/fs/cgroup
tmpfs           9.5G     0  9.5G   0% /run/user/910
apache-maven-2.2.1
apache-maven-3.0.4
apache-maven-3.0.5
apache-maven-3.2.1
apache-maven-3.2.5
apache-maven-3.3.3
apache-maven-3.3.9
apache-maven-3.5.0
apache-maven-3.5.2
latest
latest2
latest3


===========================================================================================
Verifying compile level compatibility with HBase 0.98 with Phoenix 4.x-HBase-0.98
===========================================================================================

Cloning into 'hbase'...
Switched to a new branch '0.98'
Branch 0.98 set up to track remote branch 0.98 from origin.

main:
     [exec] ~/jenkins-slave/workspace/Phoenix_Compile_Compat_wHBase/hbase/hbase-common ~/jenkins-slave/workspace/Phoenix_Compile_Compat_wHBase/hbase/hbase-common
     [exec] ~/jenkins-slave/workspace/Phoenix_Compile_Compat_wHBase/hbase/hbase-common

main:
    [mkdir] Created dir: <https://builds.apache.org/job/Phoenix_Compile_Compat_wHBase/ws/hbase/hbase-common/target/nativelib>
     [exec] tar: hadoop-snappy-nativelibs.tar: Cannot open: No such file or directory
     [exec] tar: Error is not recoverable: exiting now
     [exec] Result: 2

main:
    [mkdir] Created dir: <https://builds.apache.org/job/Phoenix_Compile_Compat_wHBase/ws/hbase/hbase-server/target/hbase-webapps>
     [copy] Copying 20 files to <https://builds.apache.org/job/Phoenix_Compile_Compat_wHBase/ws/hbase/hbase-server/target/hbase-webapps>
    [mkdir] Created dir: <https://builds.apache.org/job/Phoenix_Compile_Compat_wHBase/ws/hbase/hbase-server/target/hbase-webapps/master/WEB-INF>
    [mkdir] Created dir: <https://builds.apache.org/job/Phoenix_Compile_Compat_wHBase/ws/hbase/hbase-server/target/hbase-webapps/regionserver/WEB-INF>

main:
    [mkdir] Created dir: <https://builds.apache.org/job/Phoenix_Compile_Compat_wHBase/ws/hbase/hbase-thrift/target/hbase-webapps>
     [copy] Copying 17 files to <https://builds.apache.org/job/Phoenix_Compile_Compat_wHBase/ws/hbase/hbase-thrift/target/hbase-webapps>
    [mkdir] Created dir: <https://builds.apache.org/job/Phoenix_Compile_Compat_wHBase/ws/hbase/hbase-thrift/target/hbase-webapps/thrift/WEB-INF>

main:
    [mkdir] Created dir: <https://builds.apache.org/job/Phoenix_Compile_Compat_wHBase/ws/hbase/hbase-rest/target/hbase-webapps>
     [copy] Copying 1 file to <https://builds.apache.org/job/Phoenix_Compile_Compat_wHBase/ws/hbase/hbase-rest/target/hbase-webapps>
    [mkdir] Created dir: <https://builds.apache.org/job/Phoenix_Compile_Compat_wHBase/ws/hbase/hbase-rest/target/hbase-webapps/rest/WEB-INF>

HBase pom.xml:

Got HBase version as 0.98.25-SNAPSHOT
Cloning into 'phoenix'...
Switched to a new branch '4.x-HBase-0.98'
Branch 4.x-HBase-0.98 set up to track remote branch 4.x-HBase-0.98 from origin.
ANTLR Parser Generator  Version 3.5.2
Output file <https://builds.apache.org/job/Phoenix_Compile_Compat_wHBase/ws/phoenix/phoenix-core/target/generated-sources/antlr3/org/apache/phoenix/parse/PhoenixSQLParser.java>
does not exist: must build <https://builds.apache.org/job/Phoenix_Compile_Compat_wHBase/ws/phoenix/phoenix-core/src/main/antlr3/PhoenixSQL.g>
PhoenixSQL.g


===========================================================================================
Verifying compile level compatibility with HBase branch-1.3 with Phoenix master
===========================================================================================

Cloning into 'hbase'...
Switched to a new branch 'branch-1.3'
Branch branch-1.3 set up to track remote branch branch-1.3 from origin.

main:
     [exec] ~/jenkins-slave/workspace/Phoenix_Compile_Compat_wHBase/phoenix/hbase/hbase-common
~/jenkins-slave/workspace/Phoenix_Compile_Compat_wHBase/phoenix/hbase/hbase-common
     [exec] ~/jenkins-slave/workspace/Phoenix_Compile_Compat_wHBase/phoenix/hbase/hbase-common

main:

main:
    [mkdir] Created dir: <https://builds.apache.org/job/Phoenix_Compile_Compat_wHBase/ws/phoenix/hbase/hbase-server/target/hbase-webapps>
     [copy] Copying 20 files to <https://builds.apache.org/job/Phoenix_Compile_Compat_wHBase/ws/phoenix/hbase/hbase-server/target/hbase-webapps>
    [mkdir] Created dir: <https://builds.apache.org/job/Phoenix_Compile_Compat_wHBase/ws/phoenix/hbase/hbase-server/target/hbase-webapps/master/WEB-INF>
    [mkdir] Created dir: <https://builds.apache.org/job/Phoenix_Compile_Compat_wHBase/ws/phoenix/hbase/hbase-server/target/hbase-webapps/regionserver/WEB-INF>

main:
log4j:WARN No appenders could be found for logger (org.apache.jasper.JspC).
log4j:WARN Please initialize the log4j system properly.
log4j:WARN See http://logging.apache.org/log4j/1.2/faq.html#noconfig for more info.
java.util.MissingResourceException: Can't find bundle for base name org.apache.jasper.resources.LocalStrings,
locale en_US
	at java.util.ResourceBundle.throwMissingResourceException(ResourceBundle.java:1499)
	at java.util.ResourceBundle.getBundleImpl(ResourceBundle.java:1322)
	at java.util.ResourceBundle.getBundle(ResourceBundle.java:721)
	at org.apache.jasper.compiler.Localizer.<clinit>(Localizer.java:36)
	at org.apache.jasper.compiler.JspRuntimeContext.<init>(JspRuntimeContext.java:103)
	at org.apache.jasper.JspC.initServletContext(JspC.java:1242)
	at org.apache.jasper.JspC.execute(JspC.java:1103)
	at sun.reflect.NativeMethodAccessorImpl.invoke0(Native Method)
	at sun.reflect.NativeMethodAccessorImpl.invoke(NativeMethodAccessorImpl.java:57)
	at sun.reflect.DelegatingMethodAccessorImpl.invoke(DelegatingMethodAccessorImpl.java:43)
	at java.lang.reflect.Method.invoke(Method.java:606)
	at org.apache.tools.ant.dispatch.DispatchUtils.execute(DispatchUtils.java:106)
	at org.apache.tools.ant.TaskAdapter.execute(TaskAdapter.java:154)
	at org.apache.tools.ant.UnknownElement.execute(UnknownElement.java:291)
	at sun.reflect.GeneratedMethodAccessor131.invoke(Unknown Source)
	at sun.reflect.DelegatingMethodAccessorImpl.invoke(DelegatingMethodAccessorImpl.java:43)
	at java.lang.reflect.Method.invoke(Method.java:606)
	at org.apache.tools.ant.dispatch.DispatchUtils.execute(DispatchUtils.java:106)
	at org.apache.tools.ant.Task.perform(Task.java:348)
	at org.apache.tools.ant.Target.execute(Target.java:390)
	at org.apache.tools.ant.Target.performTasks(Target.java:411)
	at org.apache.tools.ant.Project.executeSortedTargets(Project.java:1397)
	at org.apache.tools.ant.Project.executeTarget(Project.java:1366)
	at org.apache.maven.plugin.antrun.AntRunMojo.execute(AntRunMojo.java:270)
	at org.apache.maven.plugin.DefaultBuildPluginManager.executeMojo(DefaultBuildPluginManager.java:134)
	at org.apache.maven.lifecycle.internal.MojoExecutor.execute(MojoExecutor.java:208)
	at org.apache.maven.lifecycle.internal.MojoExecutor.execute(MojoExecutor.java:154)
	at org.apache.maven.lifecycle.internal.MojoExecutor.execute(MojoExecutor.java:146)
	at org.apache.maven.lifecycle.internal.MojoExecutor.executeForkedExecutions(MojoExecutor.java:353)
	at org.apache.maven.lifecycle.internal.MojoExecutor.execute(MojoExecutor.java:198)
	at org.apache.maven.lifecycle.internal.MojoExecutor.execute(MojoExecutor.java:154)
	at org.apache.maven.lifecycle.internal.MojoExecutor.execute(MojoExecutor.java:146)
	at org.apache.maven.lifecycle.internal.LifecycleModuleBuilder.buildProject(LifecycleModuleBuilder.java:117)
	at org.apache.maven.lifecycle.internal.LifecycleModuleBuilder.buildProject(LifecycleModuleBuilder.java:81)
	at org.apache.maven.lifecycle.internal.builder.singlethreaded.SingleThreadedBuilder.build(SingleThreadedBuilder.java:51)
	at org.apache.maven.lifecycle.internal.LifecycleStarter.execute(LifecycleStarter.java:128)
	at org.apache.maven.DefaultMaven.doExecute(DefaultMaven.java:309)
	at org.apache.maven.DefaultMaven.doExecute(DefaultMaven.java:194)
	at org.apache.maven.DefaultMaven.execute(DefaultMaven.java:107)
	at org.apache.maven.cli.MavenCli.execute(MavenCli.java:955)
	at org.apache.maven.cli.MavenCli.doMain(MavenCli.java:290)
	at org.apache.maven.cli.MavenCli.main(MavenCli.java:194)
	at sun.reflect.NativeMethodAccessorImpl.invoke0(Native Method)
	at sun.reflect.NativeMethodAccessorImpl.invoke(NativeMethodAccessorImpl.java:57)
	at sun.reflect.DelegatingMethodAccessorImpl.invoke(DelegatingMethodAccessorImpl.java:43)
	at java.lang.reflect.Method.invoke(Method.java:606)
	at org.codehaus.plexus.classworlds.launcher.Launcher.launchEnhanced(Launcher.java:289)
	at org.codehaus.plexus.classworlds.launcher.Launcher.launch(Launcher.java:229)
	at org.codehaus.plexus.classworlds.launcher.Launcher.mainWithExitCode(Launcher.java:415)
	at org.codehaus.plexus.classworlds.launcher.Launcher.main(Launcher.java:356)
[ERROR] Failed to execute goal org.apache.maven.plugins:maven-antrun-plugin:1.6:run (generate)
on project hbase-server: An Ant BuildException has occured: java.lang.NullPointerException
-> [Help 1]
[ERROR] 
[ERROR] To see the full stack trace of the errors, re-run Maven with the -e switch.
[ERROR] Re-run Maven using the -X switch to enable full debug logging.
[ERROR] 
[ERROR] For more information about the errors and possible solutions, please read the following
articles:
[ERROR] [Help 1] http://cwiki.apache.org/confluence/display/MAVEN/MojoExecutionException
[ERROR] 
[ERROR] After correcting the problems, you can resume the build with the command
[ERROR]   mvn <goals> -rf :hbase-server
Build step 'Execute shell' marked build as failure

Mime
View raw message