phoenix-commits mailing list archives

Site index · List index
Message view « Date » · « Thread »
Top « Date » · « Thread »
From Apache Jenkins Server <jenk...@builds.apache.org>
Subject Build failed in Jenkins: Phoenix Compile Compatibility with HBase #462
Date Fri, 17 Nov 2017 09:17:46 GMT
See <https://builds.apache.org/job/Phoenix_Compile_Compat_wHBase/462/display/redirect>

------------------------------------------
Started by timer
[EnvInject] - Loading node environment variables.
Building remotely on H33 (ubuntu xenial) in workspace <https://builds.apache.org/job/Phoenix_Compile_Compat_wHBase/ws/>
[Phoenix_Compile_Compat_wHBase] $ /bin/bash /tmp/jenkins4122134075418232062.sh
core file size          (blocks, -c) 0
data seg size           (kbytes, -d) unlimited
scheduling priority             (-e) 0
file size               (blocks, -f) unlimited
pending signals                 (-i) 386525
max locked memory       (kbytes, -l) 64
max memory size         (kbytes, -m) unlimited
open files                      (-n) 60000
pipe size            (512 bytes, -p) 8
POSIX message queues     (bytes, -q) 819200
real-time priority              (-r) 0
stack size              (kbytes, -s) 8192
cpu time               (seconds, -t) unlimited
max user processes              (-u) 10240
virtual memory          (kbytes, -v) unlimited
file locks                      (-x) unlimited
core id		: 0
core id		: 1
core id		: 2
core id		: 3
core id		: 4
core id		: 5
physical id	: 0
physical id	: 1
MemTotal:       98986032 kB
MemFree:        29462804 kB
Filesystem      Size  Used Avail Use% Mounted on
udev             48G     0   48G   0% /dev
tmpfs           9.5G  218M  9.3G   3% /run
/dev/sda1       364G   66G  280G  19% /
tmpfs            48G  784K   48G   1% /dev/shm
tmpfs           5.0M     0  5.0M   0% /run/lock
tmpfs            48G     0   48G   0% /sys/fs/cgroup
tmpfs           9.5G     0  9.5G   0% /run/user/910
apache-maven-2.2.1
apache-maven-3.0.4
apache-maven-3.0.5
apache-maven-3.2.1
apache-maven-3.2.5
apache-maven-3.3.3
apache-maven-3.3.9
apache-maven-3.5.0
apache-maven-3.5.2
latest
latest2
latest3


===========================================================================================
Verifying compile level compatibility with HBase 0.98 with Phoenix 4.x-HBase-0.98
===========================================================================================

Cloning into 'hbase'...
Switched to a new branch '0.98'
Branch 0.98 set up to track remote branch 0.98 from origin.
[ERROR] Failed to execute goal on project hbase-common: Could not resolve dependencies for
project org.apache.hbase:hbase-common:jar:0.98.25-SNAPSHOT: Failed to collect dependencies
at org.apache.hadoop:hadoop-mapreduce-client-core:jar:2.2.0 -> org.apache.hadoop:hadoop-yarn-common:jar:2.2.0
-> org.apache.hadoop:hadoop-yarn-api:jar:2.2.0 -> com.sun.jersey.jersey-test-framework:jersey-test-framework-grizzly2:jar:1.9
-> com.sun.jersey:jersey-grizzly2:jar:1.9 -> org.glassfish.grizzly:grizzly-http:jar:2.1.2
-> org.glassfish.grizzly:grizzly-framework:jar:2.1.2 -> org.glassfish.gmbal:gmbal-api-only:jar:3.0.0-b023
-> org.glassfish.external:management-api:jar:3.0.0-b012: Failed to read artifact descriptor
for org.glassfish.external:management-api:jar:3.0.0-b012: Could not transfer artifact org.glassfish.external:management-api:pom:3.0.0-b012
from/to apache release (https://repository.apache.org/content/repositories/releases/): /home/jenkins/.m2/repository/org/glassfish/external/management-api/3.0.0-b012/management-api-3.0.0-b012.pom.part.lock
(No such file or directory) -> [Help 1]
[ERROR] 
[ERROR] To see the full stack trace of the errors, re-run Maven with the -e switch.
[ERROR] Re-run Maven using the -X switch to enable full debug logging.
[ERROR] 
[ERROR] For more information about the errors and possible solutions, please read the following
articles:
[ERROR] [Help 1] http://cwiki.apache.org/confluence/display/MAVEN/DependencyResolutionException
[ERROR] 
[ERROR] After correcting the problems, you can resume the build with the command
[ERROR]   mvn <goals> -rf :hbase-common
Build step 'Execute shell' marked build as failure

Mime
View raw message