phoenix-commits mailing list archives

Site index · List index
Message view « Date » · « Thread »
Top « Date » · « Thread »
From Apache Jenkins Server <jenk...@builds.apache.org>
Subject Build failed in Jenkins: Phoenix | Master #1815
Date Wed, 27 Sep 2017 20:42:19 GMT
See <https://builds.apache.org/job/Phoenix-master/1815/display/redirect?page=changes>

Changes:

[ssa] PHOENIX-4225 Using Google cache may lead to lock up on RS side.

------------------------------------------
[...truncated 130.97 KB...]
java.lang.AssertionError: The following tables are not deleted that should be: TESTAUTOMATICALLYSETTINGROWTIMESTAMP

[ERROR] testUpsertValuesWithDescDecimal(org.apache.phoenix.end2end.UpsertValuesIT)  Time elapsed:
2.44 s  <<< FAILURE!
java.lang.AssertionError: The following tables are not deleted that should be: TESTAUTOMATICALLYSETTINGROWTIMESTAMP

[ERROR] testUpsertIntoFloat(org.apache.phoenix.end2end.UpsertValuesIT)  Time elapsed: 2.411
s  <<< FAILURE!
java.lang.AssertionError: The following tables are not deleted that should be: TESTAUTOMATICALLYSETTINGROWTIMESTAMP

[ERROR] testUpsertValuesWithExpression(org.apache.phoenix.end2end.UpsertValuesIT)  Time elapsed:
2.429 s  <<< FAILURE!
java.lang.AssertionError: The following tables are not deleted that should be: TESTAUTOMATICALLYSETTINGROWTIMESTAMP

[ERROR] testAutomaticallySettingRowTimestampForImmutableTableAndIndexes_desc(org.apache.phoenix.end2end.UpsertValuesIT)
 Time elapsed: 3.705 s  <<< FAILURE!
java.lang.AssertionError: The following tables are not deleted that should be: TESTAUTOMATICALLYSETTINGROWTIMESTAMP
TESTSETTINGROWTIMESTAMPFORIMMUTABLETABLEANDINDEXES

[ERROR] testGroupByWithLimitOverRowKey(org.apache.phoenix.end2end.UpsertValuesIT)  Time elapsed:
2.475 s  <<< FAILURE!
java.lang.AssertionError: The following tables are not deleted that should be: TESTAUTOMATICALLYSETTINGROWTIMESTAMP
TESTSETTINGROWTIMESTAMPFORIMMUTABLETABLEANDINDEXES

[ERROR] testWithUpsertingRowTimestampColSpecified_asc(org.apache.phoenix.end2end.UpsertValuesIT)
 Time elapsed: 4.717 s  <<< FAILURE!
java.lang.AssertionError: The following tables are not deleted that should be: TESTAUTOMATICALLYSETTINGROWTIMESTAMP
TESTSETTINGROWTIMESTAMPFORIMMUTABLETABLEANDINDEXES TESTUPSERTINGROWTIMESTAMPCOL

[ERROR] testBatchedUpsert(org.apache.phoenix.end2end.UpsertValuesIT)  Time elapsed: 2.465
s  <<< FAILURE!
java.lang.AssertionError: The following tables are not deleted that should be: TESTAUTOMATICALLYSETTINGROWTIMESTAMP
TESTSETTINGROWTIMESTAMPFORIMMUTABLETABLEANDINDEXES TESTUPSERTINGROWTIMESTAMPCOL

[ERROR] testUpsertRandomValues(org.apache.phoenix.end2end.UpsertValuesIT)  Time elapsed: 2.433
s  <<< FAILURE!
java.lang.AssertionError: The following tables are not deleted that should be: TESTAUTOMATICALLYSETTINGROWTIMESTAMP
TESTSETTINGROWTIMESTAMPFORIMMUTABLETABLEANDINDEXES TESTUPSERTINGROWTIMESTAMPCOL

[ERROR] testUpsertValuesWithMoreValuesThanNumColsInTable(org.apache.phoenix.end2end.UpsertValuesIT)
 Time elapsed: 0.182 s  <<< FAILURE!
java.lang.AssertionError: The following tables are not deleted that should be: TESTAUTOMATICALLYSETTINGROWTIMESTAMP
TESTSETTINGROWTIMESTAMPFORIMMUTABLETABLEANDINDEXES TESTUPSERTINGROWTIMESTAMPCOL

[ERROR] testUpsertValuesWithDate(org.apache.phoenix.end2end.UpsertValuesIT)  Time elapsed:
2.427 s  <<< FAILURE!
java.lang.AssertionError: The following tables are not deleted that should be: TESTAUTOMATICALLYSETTINGROWTIMESTAMP
TESTSETTINGROWTIMESTAMPFORIMMUTABLETABLEANDINDEXES TESTUPSERTINGROWTIMESTAMPCOL

[ERROR] testDisallowNegativeValuesForRowTsColumn(org.apache.phoenix.end2end.UpsertValuesIT)
 Time elapsed: 1.402 s  <<< FAILURE!
java.lang.AssertionError: The following tables are not deleted that should be: TESTAUTOMATICALLYSETTINGROWTIMESTAMP
TESTSETTINGROWTIMESTAMPFORIMMUTABLETABLEANDINDEXES TESTUPSERTINGROWTIMESTAMPCOL

[ERROR] testUpsertVarCharWithMaxLength(org.apache.phoenix.end2end.UpsertValuesIT)  Time elapsed:
2.546 s  <<< FAILURE!
java.lang.AssertionError: The following tables are not deleted that should be: TESTAUTOMATICALLYSETTINGROWTIMESTAMP
TESTSETTINGROWTIMESTAMPFORIMMUTABLETABLEANDINDEXES TESTUPSERTINGROWTIMESTAMPCOL

[ERROR] testUpsertDateString(org.apache.phoenix.end2end.UpsertValuesIT)  Time elapsed: 2.418
s  <<< FAILURE!
java.lang.AssertionError: The following tables are not deleted that should be: TESTAUTOMATICALLYSETTINGROWTIMESTAMP
TESTSETTINGROWTIMESTAMPFORIMMUTABLETABLEANDINDEXES TESTUPSERTINGROWTIMESTAMPCOL

[ERROR] testUpsertDateValues(org.apache.phoenix.end2end.UpsertValuesIT)  Time elapsed: 0.18
s  <<< FAILURE!
java.lang.AssertionError: The following tables are not deleted that should be: TESTAUTOMATICALLYSETTINGROWTIMESTAMP
TESTSETTINGROWTIMESTAMPFORIMMUTABLETABLEANDINDEXES TESTUPSERTINGROWTIMESTAMPCOL

[ERROR] testAutomaticallySettingRowTimestampForImmutableTableAndIndexes_asc(org.apache.phoenix.end2end.UpsertValuesIT)
 Time elapsed: 0.078 s  <<< ERROR!
java.sql.SQLException: ERROR 1010 (42M01): Not allowed to mutate table. tableName=TESTSETTINGROWTIMESTAMPFORIMMUTABLETABLEANDINDEXES
	at org.apache.phoenix.end2end.UpsertValuesIT.testAutomaticallySettingRowTimestampForImmutableTableAndIndexes(UpsertValuesIT.java:830)
	at org.apache.phoenix.end2end.UpsertValuesIT.testAutomaticallySettingRowTimestampForImmutableTableAndIndexes_asc(UpsertValuesIT.java:822)

[ERROR] testAutomaticallySettingRowTimestampForImmutableTableAndIndexes_asc(org.apache.phoenix.end2end.UpsertValuesIT)
 Time elapsed: 0.078 s  <<< FAILURE!
java.lang.AssertionError: The following tables are not deleted that should be: TESTAUTOMATICALLYSETTINGROWTIMESTAMP
TESTSETTINGROWTIMESTAMPFORIMMUTABLETABLEANDINDEXES TESTUPSERTINGROWTIMESTAMPCOL

[ERROR] testTimestampAddSubtractArithmetic(org.apache.phoenix.end2end.UpsertValuesIT)  Time
elapsed: 0.189 s  <<< FAILURE!
java.lang.AssertionError: The following tables are not deleted that should be: TESTAUTOMATICALLYSETTINGROWTIMESTAMP
TESTSETTINGROWTIMESTAMPFORIMMUTABLETABLEANDINDEXES TESTUPSERTINGROWTIMESTAMPCOL

[ERROR] testWithUpsertingRowTimestampColSpecified_desc(org.apache.phoenix.end2end.UpsertValuesIT)
 Time elapsed: 0.073 s  <<< ERROR!
java.sql.SQLException: ERROR 1010 (42M01): Not allowed to mutate table. tableName=TESTUPSERTINGROWTIMESTAMPCOL
	at org.apache.phoenix.end2end.UpsertValuesIT.testWithUpsertingRowTimestampColSpecified(UpsertValuesIT.java:696)
	at org.apache.phoenix.end2end.UpsertValuesIT.testWithUpsertingRowTimestampColSpecified_desc(UpsertValuesIT.java:682)

[ERROR] testWithUpsertingRowTimestampColSpecified_desc(org.apache.phoenix.end2end.UpsertValuesIT)
 Time elapsed: 0.073 s  <<< FAILURE!
java.lang.AssertionError: The following tables are not deleted that should be: TESTAUTOMATICALLYSETTINGROWTIMESTAMP
TESTSETTINGROWTIMESTAMPFORIMMUTABLETABLEANDINDEXES TESTUPSERTINGROWTIMESTAMPCOL

[INFO] 
[INFO] Results:
[INFO] 
[ERROR] Failures: 
[ERROR]   UpsertValuesIT>BaseClientManagedTimeIT.cleanUpAfterTest:59->BaseTest.deletePriorMetaData:839->BaseTest.deletePriorTables:847->BaseTest.deletePriorTables:868
The following tables are not deleted that should be: TESTAUTOMATICALLYSETTINGROWTIMESTAMP
TESTSETTINGROWTIMESTAMPFORIMMUTABLETABLEANDINDEXES
[ERROR]   UpsertValuesIT>BaseClientManagedTimeIT.cleanUpAfterTest:59->BaseTest.deletePriorMetaData:839->BaseTest.deletePriorTables:847->BaseTest.deletePriorTables:868
The following tables are not deleted that should be: TESTAUTOMATICALLYSETTINGROWTIMESTAMP
[ERROR]   UpsertValuesIT>BaseClientManagedTimeIT.cleanUpAfterTest:59->BaseTest.deletePriorMetaData:839->BaseTest.deletePriorTables:847->BaseTest.deletePriorTables:868
The following tables are not deleted that should be: TESTAUTOMATICALLYSETTINGROWTIMESTAMP
TESTSETTINGROWTIMESTAMPFORIMMUTABLETABLEANDINDEXES TESTUPSERTINGROWTIMESTAMPCOL
[ERROR]   UpsertValuesIT>BaseClientManagedTimeIT.cleanUpAfterTest:59->BaseTest.deletePriorMetaData:839->BaseTest.deletePriorTables:847->BaseTest.deletePriorTables:868
The following tables are not deleted that should be: TESTAUTOMATICALLYSETTINGROWTIMESTAMP
[ERROR]   UpsertValuesIT>BaseClientManagedTimeIT.cleanUpAfterTest:59->BaseTest.deletePriorMetaData:839->BaseTest.deletePriorTables:847->BaseTest.deletePriorTables:868
The following tables are not deleted that should be: TESTAUTOMATICALLYSETTINGROWTIMESTAMP
TESTSETTINGROWTIMESTAMPFORIMMUTABLETABLEANDINDEXES TESTUPSERTINGROWTIMESTAMPCOL
[ERROR]   UpsertValuesIT>BaseClientManagedTimeIT.cleanUpAfterTest:59->BaseTest.deletePriorMetaData:839->BaseTest.deletePriorTables:847->BaseTest.deletePriorTables:868
The following tables are not deleted that should be: TESTAUTOMATICALLYSETTINGROWTIMESTAMP
TESTSETTINGROWTIMESTAMPFORIMMUTABLETABLEANDINDEXES
[ERROR]   UpsertValuesIT>BaseClientManagedTimeIT.cleanUpAfterTest:59->BaseTest.deletePriorMetaData:839->BaseTest.deletePriorTables:847->BaseTest.deletePriorTables:868
The following tables are not deleted that should be: TESTAUTOMATICALLYSETTINGROWTIMESTAMP
TESTSETTINGROWTIMESTAMPFORIMMUTABLETABLEANDINDEXES TESTUPSERTINGROWTIMESTAMPCOL
[ERROR]   UpsertValuesIT>BaseClientManagedTimeIT.cleanUpAfterTest:59->BaseTest.deletePriorMetaData:839->BaseTest.deletePriorTables:847->BaseTest.deletePriorTables:868
The following tables are not deleted that should be: TESTAUTOMATICALLYSETTINGROWTIMESTAMP
[ERROR]   UpsertValuesIT>BaseClientManagedTimeIT.cleanUpAfterTest:59->BaseTest.deletePriorMetaData:839->BaseTest.deletePriorTables:847->BaseTest.deletePriorTables:868
The following tables are not deleted that should be: TESTAUTOMATICALLYSETTINGROWTIMESTAMP
TESTSETTINGROWTIMESTAMPFORIMMUTABLETABLEANDINDEXES TESTUPSERTINGROWTIMESTAMPCOL
[ERROR]   UpsertValuesIT>BaseClientManagedTimeIT.cleanUpAfterTest:59->BaseTest.deletePriorMetaData:839->BaseTest.deletePriorTables:847->BaseTest.deletePriorTables:868
The following tables are not deleted that should be: TESTAUTOMATICALLYSETTINGROWTIMESTAMP
TESTSETTINGROWTIMESTAMPFORIMMUTABLETABLEANDINDEXES TESTUPSERTINGROWTIMESTAMPCOL
[ERROR]   UpsertValuesIT>BaseClientManagedTimeIT.cleanUpAfterTest:59->BaseTest.deletePriorMetaData:839->BaseTest.deletePriorTables:847->BaseTest.deletePriorTables:868
The following tables are not deleted that should be: TESTAUTOMATICALLYSETTINGROWTIMESTAMP
[ERROR]   UpsertValuesIT>BaseClientManagedTimeIT.cleanUpAfterTest:59->BaseTest.deletePriorMetaData:839->BaseTest.deletePriorTables:847->BaseTest.deletePriorTables:868
The following tables are not deleted that should be: TESTAUTOMATICALLYSETTINGROWTIMESTAMP
TESTSETTINGROWTIMESTAMPFORIMMUTABLETABLEANDINDEXES TESTUPSERTINGROWTIMESTAMPCOL
[ERROR]   UpsertValuesIT>BaseClientManagedTimeIT.cleanUpAfterTest:59->BaseTest.deletePriorMetaData:839->BaseTest.deletePriorTables:847->BaseTest.deletePriorTables:868
The following tables are not deleted that should be: TESTAUTOMATICALLYSETTINGROWTIMESTAMP
TESTSETTINGROWTIMESTAMPFORIMMUTABLETABLEANDINDEXES TESTUPSERTINGROWTIMESTAMPCOL
[ERROR]   UpsertValuesIT>BaseClientManagedTimeIT.cleanUpAfterTest:59->BaseTest.deletePriorMetaData:839->BaseTest.deletePriorTables:847->BaseTest.deletePriorTables:868
The following tables are not deleted that should be: TESTAUTOMATICALLYSETTINGROWTIMESTAMP
[ERROR]   UpsertValuesIT>BaseClientManagedTimeIT.cleanUpAfterTest:59->BaseTest.deletePriorMetaData:839->BaseTest.deletePriorTables:847->BaseTest.deletePriorTables:868
The following tables are not deleted that should be: TESTAUTOMATICALLYSETTINGROWTIMESTAMP
[ERROR]   UpsertValuesIT>BaseClientManagedTimeIT.cleanUpAfterTest:59->BaseTest.deletePriorMetaData:839->BaseTest.deletePriorTables:847->BaseTest.deletePriorTables:868
The following tables are not deleted that should be: TESTAUTOMATICALLYSETTINGROWTIMESTAMP
[ERROR]   UpsertValuesIT>BaseClientManagedTimeIT.cleanUpAfterTest:59->BaseTest.deletePriorMetaData:839->BaseTest.deletePriorTables:847->BaseTest.deletePriorTables:868
The following tables are not deleted that should be: TESTAUTOMATICALLYSETTINGROWTIMESTAMP
TESTSETTINGROWTIMESTAMPFORIMMUTABLETABLEANDINDEXES TESTUPSERTINGROWTIMESTAMPCOL
[ERROR]   UpsertValuesIT>BaseClientManagedTimeIT.cleanUpAfterTest:59->BaseTest.deletePriorMetaData:839->BaseTest.deletePriorTables:847->BaseTest.deletePriorTables:868
The following tables are not deleted that should be: TESTAUTOMATICALLYSETTINGROWTIMESTAMP
TESTSETTINGROWTIMESTAMPFORIMMUTABLETABLEANDINDEXES TESTUPSERTINGROWTIMESTAMPCOL
[ERROR]   UpsertValuesIT>BaseClientManagedTimeIT.cleanUpAfterTest:59->BaseTest.deletePriorMetaData:839->BaseTest.deletePriorTables:847->BaseTest.deletePriorTables:868
The following tables are not deleted that should be: TESTAUTOMATICALLYSETTINGROWTIMESTAMP
TESTSETTINGROWTIMESTAMPFORIMMUTABLETABLEANDINDEXES TESTUPSERTINGROWTIMESTAMPCOL
[ERROR] Errors: 
[ERROR] org.apache.phoenix.end2end.UpsertValuesIT.testAutomaticallySettingRowTimestampForImmutableTableAndIndexes_asc(org.apache.phoenix.end2end.UpsertValuesIT)
[ERROR]   Run 1: UpsertValuesIT.testAutomaticallySettingRowTimestampForImmutableTableAndIndexes_asc:822->testAutomaticallySettingRowTimestampForImmutableTableAndIndexes:830
» SQL
[ERROR]   Run 2: UpsertValuesIT>BaseClientManagedTimeIT.cleanUpAfterTest:59->BaseTest.deletePriorMetaData:839->BaseTest.deletePriorTables:847->BaseTest.deletePriorTables:868
The following tables are not deleted that should be: TESTAUTOMATICALLYSETTINGROWTIMESTAMP
TESTSETTINGROWTIMESTAMPFORIMMUTABLETABLEANDINDEXES TESTUPSERTINGROWTIMESTAMPCOL
[INFO] 
[ERROR] org.apache.phoenix.end2end.UpsertValuesIT.testAutomaticallySettingRowtimestamp_asc(org.apache.phoenix.end2end.UpsertValuesIT)
[ERROR]   Run 1: UpsertValuesIT.testAutomaticallySettingRowtimestamp_asc:763->testAutomaticallySettingRowtimestamp:771
» SQL
[ERROR]   Run 2: UpsertValuesIT>BaseClientManagedTimeIT.cleanUpAfterTest:59->BaseTest.deletePriorMetaData:839->BaseTest.deletePriorTables:847->BaseTest.deletePriorTables:868
The following tables are not deleted that should be: TESTAUTOMATICALLYSETTINGROWTIMESTAMP
[INFO] 
[ERROR] org.apache.phoenix.end2end.UpsertValuesIT.testWithUpsertingRowTimestampColSpecified_desc(org.apache.phoenix.end2end.UpsertValuesIT)
[ERROR]   Run 1: UpsertValuesIT.testWithUpsertingRowTimestampColSpecified_desc:682->testWithUpsertingRowTimestampColSpecified:696
» SQL
[ERROR]   Run 2: UpsertValuesIT>BaseClientManagedTimeIT.cleanUpAfterTest:59->BaseTest.deletePriorMetaData:839->BaseTest.deletePriorTables:847->BaseTest.deletePriorTables:868
The following tables are not deleted that should be: TESTAUTOMATICALLYSETTINGROWTIMESTAMP
TESTSETTINGROWTIMESTAMPFORIMMUTABLETABLEANDINDEXES TESTUPSERTINGROWTIMESTAMPCOL
[INFO] 
[INFO] 
[ERROR] Tests run: 25, Failures: 19, Errors: 3, Skipped: 0
[INFO] 
[INFO] 
[INFO] --- maven-failsafe-plugin:2.20:integration-test (HBaseManagedTimeTests) @ phoenix-core
---
[INFO] 
[INFO] -------------------------------------------------------
[INFO]  T E S T S
[INFO] -------------------------------------------------------
[INFO] 
[INFO] Results:
[INFO] 
[INFO] Tests run: 0, Failures: 0, Errors: 0, Skipped: 0
[INFO] 
[INFO] 
[INFO] --- maven-failsafe-plugin:2.20:integration-test (NeedTheirOwnClusterTests) @ phoenix-core
---
[INFO] 
[INFO] -------------------------------------------------------
[INFO]  T E S T S
[INFO] -------------------------------------------------------
[INFO] Running org.apache.hadoop.hbase.regionserver.wal.WALReplayWithIndexWritesAndCompressedWALIT
[INFO] Running org.apache.phoenix.end2end.ConnectionUtilIT
[INFO] Running org.apache.hadoop.hbase.regionserver.wal.WALRecoveryRegionPostOpenIT
[INFO] Tests run: 1, Failures: 0, Errors: 0, Skipped: 0, Time elapsed: 28.946 s - in org.apache.hadoop.hbase.regionserver.wal.WALReplayWithIndexWritesAndCompressedWALIT
[INFO] Tests run: 1, Failures: 0, Errors: 0, Skipped: 0, Time elapsed: 5.191 s - in org.apache.hadoop.hbase.regionserver.wal.WALRecoveryRegionPostOpenIT
[INFO] Running org.apache.phoenix.end2end.CountDistinctCompressionIT
[INFO] Running org.apache.phoenix.end2end.CsvBulkLoadToolIT
[INFO] Tests run: 1, Failures: 0, Errors: 0, Skipped: 0, Time elapsed: 2.528 s - in org.apache.phoenix.end2end.CountDistinctCompressionIT
[INFO] Running org.apache.phoenix.end2end.ContextClassloaderIT
[INFO] Tests run: 1, Failures: 0, Errors: 0, Skipped: 0, Time elapsed: 25.675 s - in org.apache.phoenix.end2end.ConnectionUtilIT
[INFO] Tests run: 3, Failures: 0, Errors: 0, Skipped: 0, Time elapsed: 2.488 s - in org.apache.phoenix.end2end.ContextClassloaderIT
[INFO] Running org.apache.phoenix.end2end.DropSchemaIT
[INFO] Running org.apache.phoenix.end2end.FlappingLocalIndexIT
[INFO] Tests run: 2, Failures: 0, Errors: 0, Skipped: 0, Time elapsed: 18.664 s - in org.apache.phoenix.end2end.DropSchemaIT
[INFO] Running org.apache.phoenix.end2end.IndexScrutinyToolIT
[INFO] Running org.apache.phoenix.end2end.IndexExtendedIT
[INFO] Running org.apache.phoenix.end2end.IndexToolForPartialBuildIT
[INFO] Tests run: 1, Failures: 0, Errors: 0, Skipped: 0, Time elapsed: 8.316 s - in org.apache.phoenix.end2end.IndexToolForPartialBuildIT
[INFO] Running org.apache.phoenix.end2end.IndexToolForPartialBuildWithNamespaceEnabledIT
[INFO] Tests run: 2, Failures: 0, Errors: 0, Skipped: 0, Time elapsed: 16.434 s - in org.apache.phoenix.end2end.IndexToolForPartialBuildWithNamespaceEnabledIT
[INFO] Running org.apache.phoenix.end2end.QueryWithLimitIT
[INFO] Running org.apache.phoenix.end2end.QueryTimeoutIT
[INFO] Tests run: 2, Failures: 0, Errors: 0, Skipped: 0, Time elapsed: 4.99 s - in org.apache.phoenix.end2end.QueryWithLimitIT
[INFO] Tests run: 12, Failures: 0, Errors: 0, Skipped: 0, Time elapsed: 79.074 s - in org.apache.phoenix.end2end.CsvBulkLoadToolIT
[INFO] Tests run: 2, Failures: 0, Errors: 0, Skipped: 0, Time elapsed: 12.78 s - in org.apache.phoenix.end2end.QueryTimeoutIT
[INFO] Running org.apache.phoenix.end2end.RebuildIndexConnectionPropsIT
[INFO] Tests run: 1, Failures: 0, Errors: 0, Skipped: 0, Time elapsed: 0.519 s - in org.apache.phoenix.end2end.RebuildIndexConnectionPropsIT
[INFO] Tests run: 10, Failures: 0, Errors: 0, Skipped: 0, Time elapsed: 77.213 s - in org.apache.phoenix.end2end.IndexScrutinyToolIT
[INFO] Running org.apache.phoenix.end2end.RegexBulkLoadToolIT
[INFO] Running org.apache.phoenix.end2end.RenewLeaseIT
[INFO] Running org.apache.phoenix.end2end.SystemTablePermissionsIT
[INFO] Running org.apache.phoenix.end2end.SpillableGroupByIT
[INFO] Running org.apache.phoenix.end2end.StatsCollectorIT
[INFO] Tests run: 2, Failures: 0, Errors: 0, Skipped: 0, Time elapsed: 7.123 s - in org.apache.phoenix.end2end.SpillableGroupByIT
[INFO] Running org.apache.phoenix.end2end.SysTableNamespaceMappedStatsCollectorIT
[INFO] Tests run: 1, Failures: 0, Errors: 0, Skipped: 0, Time elapsed: 26.423 s - in org.apache.phoenix.end2end.RenewLeaseIT
[INFO] Tests run: 12, Failures: 0, Errors: 0, Skipped: 0, Time elapsed: 139.247 s - in org.apache.phoenix.end2end.FlappingLocalIndexIT
[INFO] Running org.apache.phoenix.end2end.TableSnapshotReadsMapReduceIT
[INFO] Tests run: 10, Failures: 0, Errors: 0, Skipped: 0, Time elapsed: 66.847 s - in org.apache.phoenix.end2end.RegexBulkLoadToolIT
[INFO] Tests run: 3, Failures: 0, Errors: 0, Skipped: 0, Time elapsed: 18.393 s - in org.apache.phoenix.end2end.TableSnapshotReadsMapReduceIT
[INFO] Running org.apache.phoenix.end2end.UpdateCacheAcrossDifferentClientsIT
[INFO] Tests run: 2, Failures: 0, Errors: 0, Skipped: 0, Time elapsed: 76.467 s - in org.apache.phoenix.end2end.SystemTablePermissionsIT
[INFO] Running org.apache.phoenix.end2end.UserDefinedFunctionsIT
[INFO] Running org.apache.phoenix.end2end.index.ImmutableIndexIT
[INFO] Tests run: 6, Failures: 0, Errors: 0, Skipped: 0, Time elapsed: 32.886 s - in org.apache.phoenix.end2end.UpdateCacheAcrossDifferentClientsIT
[INFO] Running org.apache.phoenix.end2end.index.MutableIndexFailureIT
[INFO] Running org.apache.phoenix.end2end.index.LocalIndexIT
[INFO] Tests run: 14, Failures: 0, Errors: 0, Skipped: 0, Time elapsed: 53.695 s - in org.apache.phoenix.end2end.UserDefinedFunctionsIT
[INFO] Running org.apache.phoenix.end2end.index.MutableIndexReplicationIT
[INFO] Tests run: 1, Failures: 0, Errors: 0, Skipped: 0, Time elapsed: 23.843 s - in org.apache.phoenix.end2end.index.MutableIndexReplicationIT
[INFO] Running org.apache.phoenix.end2end.index.PartialIndexRebuilderIT
[WARNING] Tests run: 24, Failures: 0, Errors: 0, Skipped: 16, Time elapsed: 116.332 s - in
org.apache.phoenix.end2end.index.ImmutableIndexIT
[INFO] Running org.apache.phoenix.end2end.index.txn.TxWriteFailureIT
[INFO] Tests run: 8, Failures: 0, Errors: 0, Skipped: 0, Time elapsed: 57.113 s - in org.apache.phoenix.end2end.index.txn.TxWriteFailureIT
[INFO] Running org.apache.phoenix.execute.PartialCommitIT
[INFO] Tests run: 12, Failures: 0, Errors: 0, Skipped: 0, Time elapsed: 0.824 s - in org.apache.phoenix.execute.PartialCommitIT
[INFO] Running org.apache.phoenix.hbase.index.FailForUnsupportedHBaseVersionsIT
[INFO] Tests run: 2, Failures: 0, Errors: 0, Skipped: 0, Time elapsed: 18.924 s - in org.apache.phoenix.hbase.index.FailForUnsupportedHBaseVersionsIT
[INFO] Running org.apache.phoenix.execute.UpsertSelectOverlappingBatchesIT
[INFO] Running org.apache.phoenix.hbase.index.covered.EndToEndCoveredColumnsIndexBuilderIT
[INFO] Tests run: 2, Failures: 0, Errors: 0, Skipped: 0, Time elapsed: 11.715 s - in org.apache.phoenix.hbase.index.covered.EndToEndCoveredColumnsIndexBuilderIT
[INFO] Running org.apache.phoenix.hbase.index.covered.FailWithoutRetriesIT
[INFO] Tests run: 1, Failures: 0, Errors: 0, Skipped: 0, Time elapsed: 2.347 s - in org.apache.phoenix.hbase.index.covered.FailWithoutRetriesIT
[INFO] Tests run: 3, Failures: 0, Errors: 0, Skipped: 0, Time elapsed: 65.794 s - in org.apache.phoenix.execute.UpsertSelectOverlappingBatchesIT
[INFO] Tests run: 21, Failures: 0, Errors: 0, Skipped: 0, Time elapsed: 279.084 s - in org.apache.phoenix.end2end.index.MutableIndexFailureIT
[INFO] Running org.apache.phoenix.iterate.RoundRobinResultIteratorWithStatsIT
[INFO] Tests run: 1, Failures: 0, Errors: 0, Skipped: 0, Time elapsed: 7.6 s - in org.apache.phoenix.iterate.RoundRobinResultIteratorWithStatsIT
[INFO] Running org.apache.phoenix.iterate.ScannerLeaseRenewalIT
[INFO] Running org.apache.phoenix.monitoring.PhoenixMetricsIT
[INFO] Tests run: 24, Failures: 0, Errors: 0, Skipped: 0, Time elapsed: 264.703 s - in org.apache.phoenix.end2end.index.PartialIndexRebuilderIT
[INFO] Running org.apache.phoenix.rpc.PhoenixClientRpcIT
[INFO] Tests run: 2, Failures: 0, Errors: 0, Skipped: 0, Time elapsed: 5.028 s - in org.apache.phoenix.rpc.PhoenixClientRpcIT
[INFO] Tests run: 34, Failures: 0, Errors: 0, Skipped: 0, Time elapsed: 341.984 s - in org.apache.phoenix.end2end.index.LocalIndexIT
[WARNING] Tests run: 144, Failures: 0, Errors: 0, Skipped: 24, Time elapsed: 448.722 s - in
org.apache.phoenix.end2end.StatsCollectorIT
[WARNING] Tests run: 144, Failures: 0, Errors: 0, Skipped: 24, Time elapsed: 446.272 s - in
org.apache.phoenix.end2end.SysTableNamespaceMappedStatsCollectorIT
[INFO] Running org.apache.phoenix.rpc.PhoenixServerRpcIT
[INFO] Tests run: 2, Failures: 0, Errors: 0, Skipped: 0, Time elapsed: 13.361 s - in org.apache.phoenix.rpc.PhoenixServerRpcIT
[INFO] Tests run: 22, Failures: 0, Errors: 0, Skipped: 0, Time elapsed: 62.42 s - in org.apache.phoenix.monitoring.PhoenixMetricsIT
[INFO] Tests run: 2, Failures: 0, Errors: 0, Skipped: 0, Time elapsed: 165.006 s - in org.apache.phoenix.iterate.ScannerLeaseRenewalIT
[INFO] Tests run: 140, Failures: 0, Errors: 0, Skipped: 0, Time elapsed: 853.438 s - in org.apache.phoenix.end2end.IndexExtendedIT
[INFO] 
[INFO] Results:
[INFO] 
[WARNING] Tests run: 678, Failures: 0, Errors: 0, Skipped: 64
[INFO] 
[INFO] 
[INFO] --- maven-failsafe-plugin:2.20:verify (ParallelStatsEnabledTest) @ phoenix-core ---
[INFO] ------------------------------------------------------------------------
[INFO] Reactor Summary:
[INFO] 
[INFO] Apache Phoenix ..................................... SUCCESS [  2.097 s]
[INFO] Phoenix Core ....................................... FAILURE [  01:37 h]
[INFO] Phoenix - Flume .................................... SKIPPED
[INFO] Phoenix - Kafka .................................... SKIPPED
[INFO] Phoenix - Pig ...................................... SKIPPED
[INFO] Phoenix Query Server Client ........................ SKIPPED
[INFO] Phoenix Query Server ............................... SKIPPED
[INFO] Phoenix - Pherf .................................... SKIPPED
[INFO] Phoenix - Spark .................................... SKIPPED
[INFO] Phoenix - Hive ..................................... SKIPPED
[INFO] Phoenix Client ..................................... SKIPPED
[INFO] Phoenix Server ..................................... SKIPPED
[INFO] Phoenix Assembly ................................... SKIPPED
[INFO] Phoenix - Tracing Web Application .................. SKIPPED
[INFO] Phoenix Load Balancer .............................. SKIPPED
[INFO] ------------------------------------------------------------------------
[INFO] BUILD FAILURE
[INFO] ------------------------------------------------------------------------
[INFO] Total time: 01:37 h
[INFO] Finished at: 2017-09-27T20:38:01Z
[INFO] Final Memory: 64M/1538M
[INFO] ------------------------------------------------------------------------
[ERROR] Failed to execute goal org.apache.maven.plugins:maven-failsafe-plugin:2.20:verify
(ParallelStatsEnabledTest) on project phoenix-core: There are test failures.
[ERROR] 
[ERROR] Please refer to <https://builds.apache.org/job/Phoenix-master/ws/phoenix-core/target/failsafe-reports>
for the individual test results.
[ERROR] Please refer to dump files (if any exist) [date]-jvmRun[N].dump, [date].dumpstream
and [date]-jvmRun[N].dumpstream.
[ERROR] -> [Help 1]
[ERROR] 
[ERROR] To see the full stack trace of the errors, re-run Maven with the -e switch.
[ERROR] Re-run Maven using the -X switch to enable full debug logging.
[ERROR] 
[ERROR] For more information about the errors and possible solutions, please read the following
articles:
[ERROR] [Help 1] http://cwiki.apache.org/confluence/display/MAVEN/MojoFailureException
[ERROR] 
[ERROR] After correcting the problems, you can resume the build with the command
[ERROR]   mvn <goals> -rf :phoenix-core
Build step 'Invoke top-level Maven targets' marked build as failure
Archiving artifacts
[JIRA] Updating issue PHOENIX-4225
Recording test results

Mime
View raw message