phoenix-commits mailing list archives

Site index · List index
Message view « Date » · « Thread »
Top « Date » · « Thread »
From Apache Jenkins Server <jenk...@builds.apache.org>
Subject Build failed in Jenkins: Phoenix | Master #1827
Date Sat, 30 Sep 2017 01:34:18 GMT
See <https://builds.apache.org/job/Phoenix-master/1827/display/redirect?page=changes>

Changes:

[jamestaylor] PHOENIX-4257 Breakup GroupByIT,MutableQueryIT, and QueryIT into several

------------------------------------------
[...truncated 393.33 KB...]
[ERROR]   RangeScanIT.testIntEqualityFilter[RangeScanIT_3] » IllegalArgument
[ERROR]   RangeScanIT.testIntEqualityFilter[RangeScanIT_4] » IllegalArgument
[ERROR]   RangeScanIT.testIntEqualityFilter[RangeScanIT_5] » IllegalArgument
[ERROR]   RangeScanIT.testIntEqualityFilter[RangeScanIT_6] » IllegalArgument
[ERROR]   RangeScanIT.testIntRangeFilter[RangeScanIT_0] » IllegalArgument wrong number o...
[ERROR]   RangeScanIT.testIntRangeFilter[RangeScanIT_1] » IllegalArgument wrong number o...
[ERROR]   RangeScanIT.testIntRangeFilter[RangeScanIT_2] » IllegalArgument
[ERROR]   RangeScanIT.testIntRangeFilter[RangeScanIT_3] » IllegalArgument
[ERROR]   RangeScanIT.testIntRangeFilter[RangeScanIT_4] » IllegalArgument
[ERROR]   RangeScanIT.testIntRangeFilter[RangeScanIT_5] » IllegalArgument
[ERROR]   RangeScanIT.testIntRangeFilter[RangeScanIT_6] » IllegalArgument
[ERROR]   RangeScanIT.testLowerBoundRangeScan[RangeScanIT_0] » IllegalArgument wrong num...
[ERROR]   RangeScanIT.testLowerBoundRangeScan[RangeScanIT_1] » IllegalArgument wrong num...
[ERROR]   RangeScanIT.testLowerBoundRangeScan[RangeScanIT_2] » IllegalArgument
[ERROR]   RangeScanIT.testLowerBoundRangeScan[RangeScanIT_3] » IllegalArgument
[ERROR]   RangeScanIT.testLowerBoundRangeScan[RangeScanIT_4] » IllegalArgument
[ERROR]   RangeScanIT.testLowerBoundRangeScan[RangeScanIT_5] » IllegalArgument
[ERROR]   RangeScanIT.testLowerBoundRangeScan[RangeScanIT_6] » IllegalArgument
[ERROR]   RangeScanIT.testNegateExpression[RangeScanIT_0] » IllegalArgument wrong number...
[ERROR]   RangeScanIT.testNegateExpression[RangeScanIT_1] » IllegalArgument wrong number...
[ERROR]   RangeScanIT.testNegateExpression[RangeScanIT_2] » IllegalArgument
[ERROR]   RangeScanIT.testNegateExpression[RangeScanIT_3] » IllegalArgument
[ERROR]   RangeScanIT.testNegateExpression[RangeScanIT_4] » IllegalArgument
[ERROR]   RangeScanIT.testNegateExpression[RangeScanIT_5] » IllegalArgument
[ERROR]   RangeScanIT.testNegateExpression[RangeScanIT_6] » IllegalArgument
[ERROR]   RangeScanIT.testUnboundRangeScan1[RangeScanIT_0] » IllegalArgument wrong numbe...
[ERROR]   RangeScanIT.testUnboundRangeScan1[RangeScanIT_1] » IllegalArgument wrong numbe...
[ERROR]   RangeScanIT.testUnboundRangeScan1[RangeScanIT_2] » IllegalArgument
[ERROR]   RangeScanIT.testUnboundRangeScan1[RangeScanIT_3] » IllegalArgument
[ERROR]   RangeScanIT.testUnboundRangeScan1[RangeScanIT_4] » IllegalArgument
[ERROR]   RangeScanIT.testUnboundRangeScan1[RangeScanIT_5] » IllegalArgument
[ERROR]   RangeScanIT.testUnboundRangeScan1[RangeScanIT_6] » IllegalArgument
[ERROR]   RangeScanIT.testUnboundRangeScan2[RangeScanIT_0] » IllegalArgument wrong numbe...
[ERROR]   RangeScanIT.testUnboundRangeScan2[RangeScanIT_1] » IllegalArgument wrong numbe...
[ERROR]   RangeScanIT.testUnboundRangeScan2[RangeScanIT_2] » IllegalArgument
[ERROR]   RangeScanIT.testUnboundRangeScan2[RangeScanIT_3] » IllegalArgument
[ERROR]   RangeScanIT.testUnboundRangeScan2[RangeScanIT_4] » IllegalArgument
[ERROR]   RangeScanIT.testUnboundRangeScan2[RangeScanIT_5] » IllegalArgument
[ERROR]   RangeScanIT.testUnboundRangeScan2[RangeScanIT_6] » IllegalArgument
[ERROR]   RangeScanIT.testUpperBoundRangeScan[RangeScanIT_0] » IllegalArgument wrong num...
[ERROR]   RangeScanIT.testUpperBoundRangeScan[RangeScanIT_1] » IllegalArgument wrong num...
[ERROR]   RangeScanIT.testUpperBoundRangeScan[RangeScanIT_2] » IllegalArgument
[ERROR]   RangeScanIT.testUpperBoundRangeScan[RangeScanIT_3] » IllegalArgument
[ERROR]   RangeScanIT.testUpperBoundRangeScan[RangeScanIT_4] » IllegalArgument
[ERROR]   RangeScanIT.testUpperBoundRangeScan[RangeScanIT_5] » IllegalArgument
[ERROR]   RangeScanIT.testUpperBoundRangeScan[RangeScanIT_6] » IllegalArgument
[ERROR]   RangeScanIT.testUpperLowerBoundRangeScan[RangeScanIT_0] » IllegalArgument wron...
[ERROR]   RangeScanIT.testUpperLowerBoundRangeScan[RangeScanIT_1] » IllegalArgument wron...
[ERROR]   RangeScanIT.testUpperLowerBoundRangeScan[RangeScanIT_2] » IllegalArgument
[ERROR]   RangeScanIT.testUpperLowerBoundRangeScan[RangeScanIT_3] » IllegalArgument
[ERROR]   RangeScanIT.testUpperLowerBoundRangeScan[RangeScanIT_4] » IllegalArgument
[ERROR]   RangeScanIT.testUpperLowerBoundRangeScan[RangeScanIT_5] » IllegalArgument
[ERROR]   RangeScanIT.testUpperLowerBoundRangeScan[RangeScanIT_6] » IllegalArgument
[ERROR]   UngroupedIT.testPointInTimeUngroupedAggregation[UngroupedIT_0] » IllegalArgument
[ERROR]   UngroupedIT.testPointInTimeUngroupedAggregation[UngroupedIT_1] » IllegalArgument
[ERROR]   UngroupedIT.testPointInTimeUngroupedAggregation[UngroupedIT_2] » IllegalArgument
[ERROR]   UngroupedIT.testPointInTimeUngroupedAggregation[UngroupedIT_3] » IllegalArgument
[ERROR]   UngroupedIT.testPointInTimeUngroupedAggregation[UngroupedIT_4] » IllegalArgument
[ERROR]   UngroupedIT.testPointInTimeUngroupedAggregation[UngroupedIT_5] » IllegalArgument
[ERROR]   UngroupedIT.testPointInTimeUngroupedAggregation[UngroupedIT_6] » IllegalArgument
[ERROR]   UngroupedIT.testPointInTimeUngroupedLimitedAggregation[UngroupedIT_0] » IllegalArgument
[ERROR]   UngroupedIT.testPointInTimeUngroupedLimitedAggregation[UngroupedIT_1] » IllegalArgument
[ERROR]   UngroupedIT.testPointInTimeUngroupedLimitedAggregation[UngroupedIT_2] » IllegalArgument
[ERROR]   UngroupedIT.testPointInTimeUngroupedLimitedAggregation[UngroupedIT_3] » IllegalArgument
[ERROR]   UngroupedIT.testPointInTimeUngroupedLimitedAggregation[UngroupedIT_4] » IllegalArgument
[ERROR]   UngroupedIT.testPointInTimeUngroupedLimitedAggregation[UngroupedIT_5] » IllegalArgument
[ERROR]   UngroupedIT.testPointInTimeUngroupedLimitedAggregation[UngroupedIT_6] » IllegalArgument
[ERROR]   UngroupedIT.testSumOverNullIntegerColumn[UngroupedIT_0] » IllegalArgument wron...
[ERROR]   UngroupedIT.testSumOverNullIntegerColumn[UngroupedIT_1] » IllegalArgument wron...
[ERROR]   UngroupedIT.testSumOverNullIntegerColumn[UngroupedIT_2] » IllegalArgument wron...
[ERROR]   UngroupedIT.testSumOverNullIntegerColumn[UngroupedIT_3] » IllegalArgument
[ERROR]   UngroupedIT.testSumOverNullIntegerColumn[UngroupedIT_4] » IllegalArgument
[ERROR]   UngroupedIT.testSumOverNullIntegerColumn[UngroupedIT_5] » IllegalArgument
[ERROR]   UngroupedIT.testSumOverNullIntegerColumn[UngroupedIT_6] » IllegalArgument
[ERROR]   UngroupedIT.testUngroupedAggregationNoWhere[UngroupedIT_0] » IllegalArgument w...
[ERROR]   UngroupedIT.testUngroupedAggregationNoWhere[UngroupedIT_1] » IllegalArgument w...
[ERROR]   UngroupedIT.testUngroupedAggregationNoWhere[UngroupedIT_2] » IllegalArgument w...
[ERROR]   UngroupedIT.testUngroupedAggregationNoWhere[UngroupedIT_3] » IllegalArgument
[ERROR]   UngroupedIT.testUngroupedAggregationNoWhere[UngroupedIT_4] » IllegalArgument
[ERROR]   UngroupedIT.testUngroupedAggregationNoWhere[UngroupedIT_5] » IllegalArgument
[ERROR]   UngroupedIT.testUngroupedAggregationNoWhere[UngroupedIT_6] » IllegalArgument
[ERROR]   UngroupedIT.testUngroupedAggregation[UngroupedIT_0] » IllegalArgument wrong nu...
[ERROR]   UngroupedIT.testUngroupedAggregation[UngroupedIT_1] » IllegalArgument wrong nu...
[ERROR]   UngroupedIT.testUngroupedAggregation[UngroupedIT_2] » IllegalArgument wrong nu...
[ERROR]   UngroupedIT.testUngroupedAggregation[UngroupedIT_3] » IllegalArgument
[ERROR]   UngroupedIT.testUngroupedAggregation[UngroupedIT_4] » IllegalArgument
[ERROR]   UngroupedIT.testUngroupedAggregation[UngroupedIT_5] » IllegalArgument
[ERROR]   UngroupedIT.testUngroupedAggregation[UngroupedIT_6] » IllegalArgument
[INFO] 
[ERROR] Tests run: 3341, Failures: 0, Errors: 483, Skipped: 5
[INFO] 
[INFO] 
[INFO] --- maven-failsafe-plugin:2.20:integration-test (HBaseManagedTimeTests) @ phoenix-core
---
[INFO] 
[INFO] -------------------------------------------------------
[INFO]  T E S T S
[INFO] -------------------------------------------------------
[INFO] 
[INFO] Results:
[INFO] 
[INFO] Tests run: 0, Failures: 0, Errors: 0, Skipped: 0
[INFO] 
[INFO] 
[INFO] --- maven-failsafe-plugin:2.20:integration-test (NeedTheirOwnClusterTests) @ phoenix-core
---
[INFO] 
[INFO] -------------------------------------------------------
[INFO]  T E S T S
[INFO] -------------------------------------------------------
[INFO] Running org.apache.hadoop.hbase.regionserver.wal.WALReplayWithIndexWritesAndCompressedWALIT
[INFO] Running org.apache.phoenix.end2end.ConnectionUtilIT
[INFO] Tests run: 1, Failures: 0, Errors: 0, Skipped: 0, Time elapsed: 54.975 s - in org.apache.hadoop.hbase.regionserver.wal.WALReplayWithIndexWritesAndCompressedWALIT
[INFO] Running org.apache.hadoop.hbase.regionserver.wal.WALRecoveryRegionPostOpenIT
[INFO] Running org.apache.phoenix.end2end.ColumnEncodedImmutableTxStatsCollectorIT
[INFO] Running org.apache.phoenix.end2end.ColumnEncodedMutableTxStatsCollectorIT
[INFO] Running org.apache.phoenix.end2end.ColumnEncodedImmutableNonTxStatsCollectorIT
[INFO] Tests run: 1, Failures: 0, Errors: 0, Skipped: 0, Time elapsed: 10.322 s - in org.apache.hadoop.hbase.regionserver.wal.WALRecoveryRegionPostOpenIT
[INFO] Running org.apache.phoenix.end2end.ColumnEncodedMutableNonTxStatsCollectorIT
[INFO] Running org.apache.phoenix.end2end.ContextClassloaderIT
[INFO] Tests run: 1, Failures: 0, Errors: 0, Skipped: 0, Time elapsed: 27.413 s - in org.apache.phoenix.end2end.ConnectionUtilIT
[INFO] Tests run: 3, Failures: 0, Errors: 0, Skipped: 0, Time elapsed: 2.993 s - in org.apache.phoenix.end2end.ContextClassloaderIT
[INFO] Running org.apache.phoenix.end2end.CountDistinctCompressionIT
[INFO] Tests run: 1, Failures: 0, Errors: 0, Skipped: 0, Time elapsed: 5.144 s - in org.apache.phoenix.end2end.CountDistinctCompressionIT
[INFO] Running org.apache.phoenix.end2end.CsvBulkLoadToolIT
[INFO] Running org.apache.phoenix.end2end.DropSchemaIT
[WARNING] Tests run: 24, Failures: 0, Errors: 0, Skipped: 4, Time elapsed: 76.304 s - in org.apache.phoenix.end2end.ColumnEncodedMutableNonTxStatsCollectorIT
[WARNING] Tests run: 24, Failures: 0, Errors: 0, Skipped: 4, Time elapsed: 80.791 s - in org.apache.phoenix.end2end.ColumnEncodedImmutableNonTxStatsCollectorIT
[INFO] Tests run: 2, Failures: 0, Errors: 0, Skipped: 0, Time elapsed: 19.906 s - in org.apache.phoenix.end2end.DropSchemaIT
[WARNING] Tests run: 24, Failures: 0, Errors: 0, Skipped: 4, Time elapsed: 97.69 s - in org.apache.phoenix.end2end.ColumnEncodedMutableTxStatsCollectorIT
[INFO] Running org.apache.phoenix.end2end.FlappingLocalIndexIT
[WARNING] Tests run: 24, Failures: 0, Errors: 0, Skipped: 4, Time elapsed: 104.395 s - in
org.apache.phoenix.end2end.ColumnEncodedImmutableTxStatsCollectorIT
[INFO] Running org.apache.phoenix.end2end.IndexExtendedIT
[INFO] Running org.apache.phoenix.end2end.IndexScrutinyToolIT
[INFO] Running org.apache.phoenix.end2end.IndexToolForPartialBuildIT
[INFO] Running org.apache.phoenix.end2end.IndexToolForPartialBuildWithNamespaceEnabledIT
[INFO] Running org.apache.phoenix.end2end.IndexToolIT
[INFO] Tests run: 12, Failures: 0, Errors: 0, Skipped: 0, Time elapsed: 100.71 s - in org.apache.phoenix.end2end.CsvBulkLoadToolIT
[INFO] Tests run: 1, Failures: 0, Errors: 0, Skipped: 0, Time elapsed: 16.259 s - in org.apache.phoenix.end2end.IndexToolForPartialBuildIT
[INFO] Running org.apache.phoenix.end2end.LocalIndexSplitMergeIT
[INFO] Tests run: 2, Failures: 0, Errors: 0, Skipped: 0, Time elapsed: 29.449 s - in org.apache.phoenix.end2end.IndexToolForPartialBuildWithNamespaceEnabledIT
[INFO] Running org.apache.phoenix.end2end.NonColumnEncodedImmutableNonTxStatsCollectorIT
[INFO] Running org.apache.phoenix.end2end.NonColumnEncodedImmutableTxStatsCollectorIT
[INFO] Tests run: 12, Failures: 0, Errors: 0, Skipped: 0, Time elapsed: 151.968 s - in org.apache.phoenix.end2end.FlappingLocalIndexIT
[INFO] Running org.apache.phoenix.end2end.QueryTimeoutIT
[INFO] Tests run: 32, Failures: 0, Errors: 0, Skipped: 0, Time elapsed: 149.914 s - in org.apache.phoenix.end2end.IndexExtendedIT
[WARNING] Tests run: 24, Failures: 0, Errors: 0, Skipped: 4, Time elapsed: 80.727 s - in org.apache.phoenix.end2end.NonColumnEncodedImmutableNonTxStatsCollectorIT
[INFO] Running org.apache.phoenix.end2end.QueryWithLimitIT
[INFO] Tests run: 2, Failures: 0, Errors: 0, Skipped: 0, Time elapsed: 6.28 s - in org.apache.phoenix.end2end.QueryWithLimitIT
[INFO] Tests run: 2, Failures: 0, Errors: 0, Skipped: 0, Time elapsed: 47.446 s - in org.apache.phoenix.end2end.QueryTimeoutIT
[WARNING] Tests run: 24, Failures: 0, Errors: 0, Skipped: 4, Time elapsed: 99.58 s - in org.apache.phoenix.end2end.NonColumnEncodedImmutableTxStatsCollectorIT
[INFO] Running org.apache.phoenix.end2end.RebuildIndexConnectionPropsIT
[INFO] Tests run: 1, Failures: 0, Errors: 0, Skipped: 0, Time elapsed: 1.342 s - in org.apache.phoenix.end2end.RebuildIndexConnectionPropsIT
[INFO] Running org.apache.phoenix.end2end.SystemTablePermissionsIT
[INFO] Running org.apache.phoenix.end2end.RegexBulkLoadToolIT
[INFO] Running org.apache.phoenix.end2end.RenewLeaseIT
[INFO] Tests run: 20, Failures: 0, Errors: 0, Skipped: 0, Time elapsed: 254.619 s - in org.apache.phoenix.end2end.IndexScrutinyToolIT
[INFO] Running org.apache.phoenix.end2end.SpillableGroupByIT
[INFO] Tests run: 1, Failures: 0, Errors: 0, Skipped: 0, Time elapsed: 26.692 s - in org.apache.phoenix.end2end.RenewLeaseIT
[INFO] Tests run: 2, Failures: 0, Errors: 0, Skipped: 0, Time elapsed: 12.376 s - in org.apache.phoenix.end2end.SpillableGroupByIT
[INFO] Running org.apache.phoenix.end2end.SysTableNamespaceMappedStatsCollectorIT
[INFO] Tests run: 10, Failures: 0, Errors: 0, Skipped: 0, Time elapsed: 78.022 s - in org.apache.phoenix.end2end.RegexBulkLoadToolIT
[INFO] Running org.apache.phoenix.end2end.TableSnapshotReadsMapReduceIT
[INFO] Tests run: 2, Failures: 0, Errors: 0, Skipped: 0, Time elapsed: 101.321 s - in org.apache.phoenix.end2end.SystemTablePermissionsIT
[INFO] Tests run: 3, Failures: 0, Errors: 0, Skipped: 0, Time elapsed: 20.572 s - in org.apache.phoenix.end2end.TableSnapshotReadsMapReduceIT
[INFO] Running org.apache.phoenix.end2end.UpdateCacheAcrossDifferentClientsIT
[INFO] Running org.apache.phoenix.end2end.UserDefinedFunctionsIT
[WARNING] Tests run: 24, Failures: 0, Errors: 0, Skipped: 4, Time elapsed: 80.845 s - in org.apache.phoenix.end2end.SysTableNamespaceMappedStatsCollectorIT
[INFO] Tests run: 6, Failures: 0, Errors: 0, Skipped: 0, Time elapsed: 34.886 s - in org.apache.phoenix.end2end.UpdateCacheAcrossDifferentClientsIT
[INFO] Running org.apache.phoenix.end2end.index.ImmutableIndexIT
[INFO] Running org.apache.phoenix.end2end.index.LocalIndexIT
[INFO] Running org.apache.phoenix.end2end.index.MutableIndexFailureIT
[INFO] Tests run: 14, Failures: 0, Errors: 0, Skipped: 0, Time elapsed: 58.903 s - in org.apache.phoenix.end2end.UserDefinedFunctionsIT
[INFO] Tests run: 32, Failures: 0, Errors: 0, Skipped: 0, Time elapsed: 408.499 s - in org.apache.phoenix.end2end.IndexToolIT
[INFO] Running org.apache.phoenix.end2end.index.MutableIndexReplicationIT
[INFO] Running org.apache.phoenix.end2end.index.PartialIndexRebuilderIT
[INFO] Tests run: 1, Failures: 0, Errors: 0, Skipped: 0, Time elapsed: 30.498 s - in org.apache.phoenix.end2end.index.MutableIndexReplicationIT
[INFO] Running org.apache.phoenix.end2end.index.txn.TxWriteFailureIT
[INFO] Tests run: 2, Failures: 0, Errors: 0, Skipped: 0, Time elapsed: 455.32 s - in org.apache.phoenix.end2end.LocalIndexSplitMergeIT
[INFO] Running org.apache.phoenix.hbase.index.FailForUnsupportedHBaseVersionsIT
[WARNING] Tests run: 24, Failures: 0, Errors: 0, Skipped: 16, Time elapsed: 119.463 s - in
org.apache.phoenix.end2end.index.ImmutableIndexIT
[INFO] Running org.apache.phoenix.execute.UpsertSelectOverlappingBatchesIT
[INFO] Tests run: 2, Failures: 0, Errors: 0, Skipped: 0, Time elapsed: 27.344 s - in org.apache.phoenix.hbase.index.FailForUnsupportedHBaseVersionsIT
[INFO] Running org.apache.phoenix.execute.PartialCommitIT
[INFO] Tests run: 12, Failures: 0, Errors: 0, Skipped: 0, Time elapsed: 2.411 s - in org.apache.phoenix.execute.PartialCommitIT
[INFO] Tests run: 8, Failures: 0, Errors: 0, Skipped: 0, Time elapsed: 63.675 s - in org.apache.phoenix.end2end.index.txn.TxWriteFailureIT
[INFO] Running org.apache.phoenix.iterate.RoundRobinResultIteratorWithStatsIT
[INFO] Running org.apache.phoenix.iterate.ScannerLeaseRenewalIT
[INFO] Running org.apache.phoenix.monitoring.PhoenixMetricsIT
[INFO] Tests run: 3, Failures: 0, Errors: 0, Skipped: 0, Time elapsed: 82.171 s - in org.apache.phoenix.execute.UpsertSelectOverlappingBatchesIT
[INFO] Running org.apache.phoenix.rpc.PhoenixClientRpcIT
[INFO] Tests run: 1, Failures: 0, Errors: 0, Skipped: 0, Time elapsed: 28.907 s - in org.apache.phoenix.iterate.RoundRobinResultIteratorWithStatsIT
[INFO] Tests run: 2, Failures: 0, Errors: 0, Skipped: 0, Time elapsed: 7.696 s - in org.apache.phoenix.rpc.PhoenixClientRpcIT
[INFO] Running org.apache.phoenix.rpc.PhoenixServerRpcIT
[INFO] Tests run: 2, Failures: 0, Errors: 0, Skipped: 0, Time elapsed: 20.015 s - in org.apache.phoenix.rpc.PhoenixServerRpcIT
[INFO] Tests run: 22, Failures: 0, Errors: 0, Skipped: 0, Time elapsed: 84.078 s - in org.apache.phoenix.monitoring.PhoenixMetricsIT
[INFO] Tests run: 2, Failures: 0, Errors: 0, Skipped: 0, Time elapsed: 163.444 s - in org.apache.phoenix.iterate.ScannerLeaseRenewalIT
[INFO] Tests run: 21, Failures: 0, Errors: 0, Skipped: 0, Time elapsed: 367.094 s - in org.apache.phoenix.end2end.index.MutableIndexFailureIT
[INFO] Tests run: 34, Failures: 0, Errors: 0, Skipped: 0, Time elapsed: 377.591 s - in org.apache.phoenix.end2end.index.LocalIndexIT
[WARNING] Tests run: 24, Failures: 0, Errors: 0, Skipped: 2, Time elapsed: 346.131 s - in
org.apache.phoenix.end2end.index.PartialIndexRebuilderIT
[INFO] 
[INFO] Results:
[INFO] 
[WARNING] Tests run: 491, Failures: 0, Errors: 0, Skipped: 46
[INFO] 
[INFO] 
[INFO] --- maven-failsafe-plugin:2.20:verify (ParallelStatsEnabledTest) @ phoenix-core ---
[INFO] ------------------------------------------------------------------------
[INFO] Reactor Summary:
[INFO] 
[INFO] Apache Phoenix ..................................... SUCCESS [  4.418 s]
[INFO] Phoenix Core ....................................... FAILURE [  01:07 h]
[INFO] Phoenix - Flume .................................... SKIPPED
[INFO] Phoenix - Kafka .................................... SKIPPED
[INFO] Phoenix - Pig ...................................... SKIPPED
[INFO] Phoenix Query Server Client ........................ SKIPPED
[INFO] Phoenix Query Server ............................... SKIPPED
[INFO] Phoenix - Pherf .................................... SKIPPED
[INFO] Phoenix - Spark .................................... SKIPPED
[INFO] Phoenix - Hive ..................................... SKIPPED
[INFO] Phoenix Client ..................................... SKIPPED
[INFO] Phoenix Server ..................................... SKIPPED
[INFO] Phoenix Assembly ................................... SKIPPED
[INFO] Phoenix - Tracing Web Application .................. SKIPPED
[INFO] Phoenix Load Balancer .............................. SKIPPED
[INFO] ------------------------------------------------------------------------
[INFO] BUILD FAILURE
[INFO] ------------------------------------------------------------------------
[INFO] Total time: 01:07 h
[INFO] Finished at: 2017-09-30T00:51:14Z
[INFO] Final Memory: 60M/859M
[INFO] ------------------------------------------------------------------------
[ERROR] Failed to execute goal org.apache.maven.plugins:maven-failsafe-plugin:2.20:verify
(ParallelStatsEnabledTest) on project phoenix-core: There are test failures.
[ERROR] 
[ERROR] Please refer to <https://builds.apache.org/job/Phoenix-master/ws/phoenix-core/target/failsafe-reports>
for the individual test results.
[ERROR] Please refer to dump files (if any exist) [date]-jvmRun[N].dump, [date].dumpstream
and [date]-jvmRun[N].dumpstream.
[ERROR] -> [Help 1]
[ERROR] 
[ERROR] To see the full stack trace of the errors, re-run Maven with the -e switch.
[ERROR] Re-run Maven using the -X switch to enable full debug logging.
[ERROR] 
[ERROR] For more information about the errors and possible solutions, please read the following
articles:
[ERROR] [Help 1] http://cwiki.apache.org/confluence/display/MAVEN/MojoFailureException
[ERROR] 
[ERROR] After correcting the problems, you can resume the build with the command
[ERROR]   mvn <goals> -rf :phoenix-core
Build step 'Invoke top-level Maven targets' marked build as failure
Archiving artifacts
[Fast Archiver] Compressed 3.12 GB of artifacts by 59.9% relative to #1807
[JIRA] Updating issue PHOENIX-4257
Recording test results

Mime
View raw message