phoenix-commits mailing list archives

Site index · List index
Message view « Date » · « Thread »
Top « Date » · « Thread »
From Apache Jenkins Server <jenk...@builds.apache.org>
Subject Build failed in Jenkins: Phoenix | Master #1824
Date Fri, 29 Sep 2017 20:30:23 GMT
See <https://builds.apache.org/job/Phoenix-master/1824/display/redirect?page=changes>

Changes:

[jtaylor] PHOENIX-4257 Breakup GroupByIT into several integration tests so as not

[jtaylor] PHOENIX-4257 Breakup GroupByIT,MutableQueryIT, and QueryIT into several

------------------------------------------
[...truncated 135.86 KB...]
[INFO] Running org.apache.phoenix.tx.ParameterizedTransactionIT
[INFO] Tests run: 4, Failures: 0, Errors: 0, Skipped: 0, Time elapsed: 9.993 s - in org.apache.phoenix.tx.FlappingTransactionIT
[INFO] Running org.apache.phoenix.tx.TransactionIT
[INFO] Tests run: 7, Failures: 0, Errors: 0, Skipped: 0, Time elapsed: 28.235 s - in org.apache.phoenix.rpc.UpdateCacheIT
[INFO] Running org.apache.phoenix.tx.TxCheckpointIT
[INFO] Tests run: 9, Failures: 0, Errors: 0, Skipped: 0, Time elapsed: 54.684 s - in org.apache.phoenix.iterate.RoundRobinResultIteratorIT
[INFO] Running org.apache.phoenix.util.IndexScrutinyIT
[INFO] Running org.apache.phoenix.trace.PhoenixTracingEndToEndIT
[INFO] Tests run: 3, Failures: 0, Errors: 0, Skipped: 0, Time elapsed: 18.536 s - in org.apache.phoenix.util.IndexScrutinyIT
[INFO] Tests run: 4, Failures: 0, Errors: 0, Skipped: 0, Time elapsed: 699.895 s - in org.apache.phoenix.end2end.index.MutableIndexSplitReverseScanIT
[INFO] Tests run: 8, Failures: 0, Errors: 0, Skipped: 0, Time elapsed: 49.199 s - in org.apache.phoenix.tx.TransactionIT
[INFO] Tests run: 34, Failures: 0, Errors: 0, Skipped: 0, Time elapsed: 553.395 s - in org.apache.phoenix.end2end.join.HashJoinLocalIndexIT
[INFO] Tests run: 8, Failures: 0, Errors: 0, Skipped: 0, Time elapsed: 88.426 s - in org.apache.phoenix.trace.PhoenixTracingEndToEndIT
[INFO] Tests run: 34, Failures: 0, Errors: 0, Skipped: 0, Time elapsed: 555.692 s - in org.apache.phoenix.end2end.join.SortMergeJoinLocalIndexIT
[WARNING] Tests run: 52, Failures: 0, Errors: 0, Skipped: 4, Time elapsed: 192.96 s - in org.apache.phoenix.tx.ParameterizedTransactionIT
[INFO] Tests run: 40, Failures: 0, Errors: 0, Skipped: 0, Time elapsed: 263.99 s - in org.apache.phoenix.tx.TxCheckpointIT
[INFO] 
[INFO] Results:
[INFO] 
[ERROR] Failures: 
[ERROR]   CaseStatementIT.testUnfoundSingleColumnCaseStatement:276
[ERROR]   CaseStatementIT.testUnfoundSingleColumnCaseStatement:276
[ERROR]   CaseStatementIT.testUnfoundSingleColumnCaseStatement:276
[ERROR]   CaseStatementIT.testUnfoundSingleColumnCaseStatement:276
[ERROR]   CaseStatementIT.testUnfoundSingleColumnCaseStatement:276
[ERROR]   CaseStatementIT.testUnfoundSingleColumnCaseStatement:276
[ERROR]   CaseStatementIT.testUnfoundSingleColumnCaseStatement:276
[ERROR]   GroupByIT.testGroupByCondition:359->BaseTest.assertValueEqualsResultSet:1585->BaseTest.assertValuesEqualsResultSet:1609
Could not find [8] in expected results: [[1], [1], [7]] with actual results: [[8]]
[ERROR]   GroupByIT.testGroupByCondition:359->BaseTest.assertValueEqualsResultSet:1585->BaseTest.assertValuesEqualsResultSet:1609
Could not find [8] in expected results: [[1], [1], [7]] with actual results: [[8]]
[ERROR]   GroupByIT.testGroupByCondition:359->BaseTest.assertValueEqualsResultSet:1585->BaseTest.assertValuesEqualsResultSet:1609
Could not find [8] in expected results: [[1], [1], [7]] with actual results: [[8]]
[ERROR]   GroupByIT.testGroupByCondition:359->BaseTest.assertValueEqualsResultSet:1585->BaseTest.assertValuesEqualsResultSet:1609
Could not find [8] in expected results: [[1], [1], [7]] with actual results: [[8]]
[ERROR]   GroupByIT.testGroupByCondition:359->BaseTest.assertValueEqualsResultSet:1585->BaseTest.assertValuesEqualsResultSet:1609
Could not find [8] in expected results: [[1], [1], [7]] with actual results: [[8]]
[ERROR]   GroupByIT.testGroupByCondition:359->BaseTest.assertValueEqualsResultSet:1585->BaseTest.assertValuesEqualsResultSet:1609
Could not find [8] in expected results: [[1], [1], [7]] with actual results: [[8]]
[ERROR]   GroupByIT.testGroupByCondition:359->BaseTest.assertValueEqualsResultSet:1585->BaseTest.assertValuesEqualsResultSet:1609
Could not find [8] in expected results: [[1], [1], [7]] with actual results: [[8]]
[ERROR]   UngroupedIT.testSumOverNullIntegerColumn:222 expected:<42> but was:<45>
[ERROR]   UngroupedIT.testSumOverNullIntegerColumn:222 expected:<42> but was:<45>
[ERROR]   UngroupedIT.testSumOverNullIntegerColumn:222 expected:<42> but was:<45>
[ERROR]   UngroupedIT.testSumOverNullIntegerColumn:222 expected:<42> but was:<45>
[ERROR]   UngroupedIT.testSumOverNullIntegerColumn:222 expected:<42> but was:<45>
[ERROR]   UngroupedIT.testSumOverNullIntegerColumn:222 expected:<42> but was:<45>
[ERROR]   UngroupedIT.testSumOverNullIntegerColumn:222 expected:<42> but was:<45>
[ERROR] Errors: 
[ERROR]   PointInTimeQueryIT.testPointInTimeDeleteUngroupedAggregation[PointInTimeQueryIT_0,mutable=true,columnEncoded=false]
» IllegalArgument
[ERROR]   PointInTimeQueryIT.testPointInTimeDeleteUngroupedAggregation[PointInTimeQueryIT_1,mutable=true,columnEncoded=true]
» IllegalArgument
[ERROR]   PointInTimeQueryIT.testPointInTimeDeleteUngroupedAggregation[PointInTimeQueryIT_10,mutable=true,columnEncoded=false]
» IllegalArgument
[ERROR]   PointInTimeQueryIT.testPointInTimeDeleteUngroupedAggregation[PointInTimeQueryIT_11,mutable=true,columnEncoded=true]
» IllegalArgument
[ERROR]   PointInTimeQueryIT.testPointInTimeDeleteUngroupedAggregation[PointInTimeQueryIT_12,mutable=true,columnEncoded=false]
» IllegalArgument
[ERROR]   PointInTimeQueryIT.testPointInTimeDeleteUngroupedAggregation[PointInTimeQueryIT_13,mutable=true,columnEncoded=true]
» IllegalArgument
[ERROR]   PointInTimeQueryIT.testPointInTimeDeleteUngroupedAggregation[PointInTimeQueryIT_2,mutable=true,columnEncoded=false]
» IllegalArgument
[ERROR]   PointInTimeQueryIT.testPointInTimeDeleteUngroupedAggregation[PointInTimeQueryIT_3,mutable=true,columnEncoded=true]
» IllegalArgument
[ERROR]   PointInTimeQueryIT.testPointInTimeDeleteUngroupedAggregation[PointInTimeQueryIT_4,mutable=true,columnEncoded=false]
» IllegalArgument
[ERROR]   PointInTimeQueryIT.testPointInTimeDeleteUngroupedAggregation[PointInTimeQueryIT_5,mutable=true,columnEncoded=true]
» IllegalArgument
[ERROR]   PointInTimeQueryIT.testPointInTimeDeleteUngroupedAggregation[PointInTimeQueryIT_6,mutable=true,columnEncoded=false]
» IllegalArgument
[ERROR]   PointInTimeQueryIT.testPointInTimeDeleteUngroupedAggregation[PointInTimeQueryIT_7,mutable=true,columnEncoded=true]
» IllegalArgument
[ERROR]   PointInTimeQueryIT.testPointInTimeDeleteUngroupedAggregation[PointInTimeQueryIT_8,mutable=true,columnEncoded=false]
» IllegalArgument
[ERROR]   PointInTimeQueryIT.testPointInTimeDeleteUngroupedAggregation[PointInTimeQueryIT_9,mutable=true,columnEncoded=true]
» IllegalArgument
[ERROR]   PointInTimeQueryIT.testPointInTimeLimitedScan[PointInTimeQueryIT_0,mutable=true,columnEncoded=false]
» IllegalArgument
[ERROR]   PointInTimeQueryIT.testPointInTimeLimitedScan[PointInTimeQueryIT_1,mutable=true,columnEncoded=true]
» IllegalArgument
[ERROR]   PointInTimeQueryIT.testPointInTimeLimitedScan[PointInTimeQueryIT_10,mutable=true,columnEncoded=false]
» IllegalArgument
[ERROR]   PointInTimeQueryIT.testPointInTimeLimitedScan[PointInTimeQueryIT_11,mutable=true,columnEncoded=true]
» IllegalArgument
[ERROR]   PointInTimeQueryIT.testPointInTimeLimitedScan[PointInTimeQueryIT_12,mutable=true,columnEncoded=false]
» IllegalArgument
[ERROR]   PointInTimeQueryIT.testPointInTimeLimitedScan[PointInTimeQueryIT_13,mutable=true,columnEncoded=true]
» IllegalArgument
[ERROR]   PointInTimeQueryIT.testPointInTimeLimitedScan[PointInTimeQueryIT_2,mutable=true,columnEncoded=false]
» IllegalArgument
[ERROR]   PointInTimeQueryIT.testPointInTimeLimitedScan[PointInTimeQueryIT_3,mutable=true,columnEncoded=true]
» IllegalArgument
[ERROR]   PointInTimeQueryIT.testPointInTimeLimitedScan[PointInTimeQueryIT_4,mutable=true,columnEncoded=false]
» IllegalArgument
[ERROR]   PointInTimeQueryIT.testPointInTimeLimitedScan[PointInTimeQueryIT_5,mutable=true,columnEncoded=true]
» IllegalArgument
[ERROR]   PointInTimeQueryIT.testPointInTimeLimitedScan[PointInTimeQueryIT_6,mutable=true,columnEncoded=false]
» IllegalArgument
[ERROR]   PointInTimeQueryIT.testPointInTimeLimitedScan[PointInTimeQueryIT_7,mutable=true,columnEncoded=true]
» IllegalArgument
[ERROR]   PointInTimeQueryIT.testPointInTimeLimitedScan[PointInTimeQueryIT_8,mutable=true,columnEncoded=false]
» IllegalArgument
[ERROR]   PointInTimeQueryIT.testPointInTimeLimitedScan[PointInTimeQueryIT_9,mutable=true,columnEncoded=true]
» IllegalArgument
[ERROR]   PointInTimeQueryIT.testPointInTimeScan[PointInTimeQueryIT_0,mutable=true,columnEncoded=false]
» IllegalArgument
[ERROR]   PointInTimeQueryIT.testPointInTimeScan[PointInTimeQueryIT_1,mutable=true,columnEncoded=true]
» IllegalArgument
[ERROR]   PointInTimeQueryIT.testPointInTimeScan[PointInTimeQueryIT_10,mutable=true,columnEncoded=false]
» IllegalArgument
[ERROR]   PointInTimeQueryIT.testPointInTimeScan[PointInTimeQueryIT_11,mutable=true,columnEncoded=true]
» IllegalArgument
[ERROR]   PointInTimeQueryIT.testPointInTimeScan[PointInTimeQueryIT_12,mutable=true,columnEncoded=false]
» IllegalArgument
[ERROR]   PointInTimeQueryIT.testPointInTimeScan[PointInTimeQueryIT_13,mutable=true,columnEncoded=true]
» IllegalArgument
[ERROR]   PointInTimeQueryIT.testPointInTimeScan[PointInTimeQueryIT_2,mutable=true,columnEncoded=false]
» IllegalArgument
[ERROR]   PointInTimeQueryIT.testPointInTimeScan[PointInTimeQueryIT_3,mutable=true,columnEncoded=true]
» IllegalArgument
[ERROR]   PointInTimeQueryIT.testPointInTimeScan[PointInTimeQueryIT_4,mutable=true,columnEncoded=false]
» IllegalArgument
[ERROR]   PointInTimeQueryIT.testPointInTimeScan[PointInTimeQueryIT_5,mutable=true,columnEncoded=true]
» IllegalArgument
[ERROR]   PointInTimeQueryIT.testPointInTimeScan[PointInTimeQueryIT_6,mutable=true,columnEncoded=false]
» IllegalArgument
[ERROR]   PointInTimeQueryIT.testPointInTimeScan[PointInTimeQueryIT_7,mutable=true,columnEncoded=true]
» IllegalArgument
[ERROR]   PointInTimeQueryIT.testPointInTimeScan[PointInTimeQueryIT_8,mutable=true,columnEncoded=false]
» IllegalArgument
[ERROR]   PointInTimeQueryIT.testPointInTimeScan[PointInTimeQueryIT_9,mutable=true,columnEncoded=true]
» IllegalArgument
[INFO] 
[ERROR] Tests run: 3389, Failures: 21, Errors: 42, Skipped: 5
[INFO] 
[INFO] 
[INFO] --- maven-failsafe-plugin:2.20:integration-test (HBaseManagedTimeTests) @ phoenix-core
---
[INFO] 
[INFO] -------------------------------------------------------
[INFO]  T E S T S
[INFO] -------------------------------------------------------
[INFO] 
[INFO] Results:
[INFO] 
[INFO] Tests run: 0, Failures: 0, Errors: 0, Skipped: 0
[INFO] 
[INFO] 
[INFO] --- maven-failsafe-plugin:2.20:integration-test (NeedTheirOwnClusterTests) @ phoenix-core
---
[INFO] 
[INFO] -------------------------------------------------------
[INFO]  T E S T S
[INFO] -------------------------------------------------------
[INFO] Running org.apache.hadoop.hbase.regionserver.wal.WALReplayWithIndexWritesAndCompressedWALIT
[INFO] Running org.apache.phoenix.end2end.ConnectionUtilIT
[INFO] Tests run: 1, Failures: 0, Errors: 0, Skipped: 0, Time elapsed: 61.869 s - in org.apache.hadoop.hbase.regionserver.wal.WALReplayWithIndexWritesAndCompressedWALIT
[INFO] Running org.apache.hadoop.hbase.regionserver.wal.WALRecoveryRegionPostOpenIT
[INFO] Running org.apache.phoenix.end2end.ColumnEncodedMutableTxStatsCollectorIT
[INFO] Tests run: 1, Failures: 0, Errors: 0, Skipped: 0, Time elapsed: 10.787 s - in org.apache.hadoop.hbase.regionserver.wal.WALRecoveryRegionPostOpenIT
[INFO] Running org.apache.phoenix.end2end.ColumnEncodedImmutableTxStatsCollectorIT
[INFO] Running org.apache.phoenix.end2end.ColumnEncodedImmutableNonTxStatsCollectorIT
[INFO] Running org.apache.phoenix.end2end.ContextClassloaderIT
[INFO] Running org.apache.phoenix.end2end.ColumnEncodedMutableNonTxStatsCollectorIT
[INFO] Tests run: 3, Failures: 0, Errors: 0, Skipped: 0, Time elapsed: 3.357 s - in org.apache.phoenix.end2end.ContextClassloaderIT
[INFO] Tests run: 1, Failures: 0, Errors: 0, Skipped: 0, Time elapsed: 32.495 s - in org.apache.phoenix.end2end.ConnectionUtilIT
[INFO] Running org.apache.phoenix.end2end.CountDistinctCompressionIT
[INFO] Tests run: 1, Failures: 0, Errors: 0, Skipped: 0, Time elapsed: 5.123 s - in org.apache.phoenix.end2end.CountDistinctCompressionIT
[INFO] Running org.apache.phoenix.end2end.CsvBulkLoadToolIT
[INFO] Running org.apache.phoenix.end2end.DropSchemaIT
[WARNING] Tests run: 24, Failures: 0, Errors: 0, Skipped: 4, Time elapsed: 89.731 s - in org.apache.phoenix.end2end.ColumnEncodedImmutableNonTxStatsCollectorIT
[WARNING] Tests run: 24, Failures: 0, Errors: 0, Skipped: 4, Time elapsed: 90.484 s - in org.apache.phoenix.end2end.ColumnEncodedMutableNonTxStatsCollectorIT
[INFO] Tests run: 2, Failures: 0, Errors: 0, Skipped: 0, Time elapsed: 20.013 s - in org.apache.phoenix.end2end.DropSchemaIT
[WARNING] Tests run: 24, Failures: 0, Errors: 0, Skipped: 4, Time elapsed: 113.091 s - in
org.apache.phoenix.end2end.ColumnEncodedImmutableTxStatsCollectorIT
[INFO] Running org.apache.phoenix.end2end.FlappingLocalIndexIT
[WARNING] Tests run: 24, Failures: 0, Errors: 0, Skipped: 4, Time elapsed: 120.839 s - in
org.apache.phoenix.end2end.ColumnEncodedMutableTxStatsCollectorIT
[INFO] Running org.apache.phoenix.end2end.IndexExtendedIT
[INFO] Running org.apache.phoenix.end2end.IndexScrutinyToolIT
[INFO] Running org.apache.phoenix.end2end.IndexToolForPartialBuildIT
[INFO] Running org.apache.phoenix.end2end.IndexToolForPartialBuildWithNamespaceEnabledIT
[INFO] Tests run: 1, Failures: 0, Errors: 0, Skipped: 0, Time elapsed: 22.062 s - in org.apache.phoenix.end2end.IndexToolForPartialBuildIT
[INFO] Running org.apache.phoenix.end2end.NonColumnEncodedImmutableNonTxStatsCollectorIT
[INFO] Running org.apache.phoenix.end2end.NonColumnEncodedImmutableTxStatsCollectorIT
[INFO] Tests run: 12, Failures: 0, Errors: 0, Skipped: 0, Time elapsed: 140.809 s - in org.apache.phoenix.end2end.CsvBulkLoadToolIT
[INFO] Tests run: 2, Failures: 0, Errors: 0, Skipped: 0, Time elapsed: 39.182 s - in org.apache.phoenix.end2end.IndexToolForPartialBuildWithNamespaceEnabledIT
[INFO] Tests run: 12, Failures: 0, Errors: 0, Skipped: 0, Time elapsed: 169.426 s - in org.apache.phoenix.end2end.FlappingLocalIndexIT
[INFO] Running org.apache.phoenix.end2end.QueryTimeoutIT
[INFO] Running org.apache.phoenix.end2end.QueryWithLimitIT
[INFO] Tests run: 2, Failures: 0, Errors: 0, Skipped: 0, Time elapsed: 6.105 s - in org.apache.phoenix.end2end.QueryWithLimitIT
[INFO] Running org.apache.phoenix.end2end.RebuildIndexConnectionPropsIT
[WARNING] Tests run: 24, Failures: 0, Errors: 0, Skipped: 4, Time elapsed: 90.21 s - in org.apache.phoenix.end2end.NonColumnEncodedImmutableNonTxStatsCollectorIT
[INFO] Tests run: 1, Failures: 0, Errors: 0, Skipped: 0, Time elapsed: 2.107 s - in org.apache.phoenix.end2end.RebuildIndexConnectionPropsIT
[INFO] Tests run: 10, Failures: 0, Errors: 0, Skipped: 0, Time elapsed: 144.511 s - in org.apache.phoenix.end2end.IndexScrutinyToolIT
[WARNING] Tests run: 24, Failures: 0, Errors: 0, Skipped: 4, Time elapsed: 113.068 s - in
org.apache.phoenix.end2end.NonColumnEncodedImmutableTxStatsCollectorIT
[INFO] Running org.apache.phoenix.end2end.SystemTablePermissionsIT
[INFO] Tests run: 2, Failures: 0, Errors: 0, Skipped: 0, Time elapsed: 58.659 s - in org.apache.phoenix.end2end.QueryTimeoutIT
[INFO] Running org.apache.phoenix.end2end.RegexBulkLoadToolIT
[INFO] Running org.apache.phoenix.end2end.RenewLeaseIT
[INFO] Running org.apache.phoenix.end2end.SpillableGroupByIT
[INFO] Running org.apache.phoenix.end2end.TableSnapshotReadsMapReduceIT
[INFO] Tests run: 1, Failures: 0, Errors: 0, Skipped: 0, Time elapsed: 26.871 s - in org.apache.phoenix.end2end.RenewLeaseIT
[INFO] Running org.apache.phoenix.end2end.SysTableNamespaceMappedStatsCollectorIT
[INFO] Tests run: 2, Failures: 0, Errors: 0, Skipped: 0, Time elapsed: 13.387 s - in org.apache.phoenix.end2end.SpillableGroupByIT
[INFO] Tests run: 3, Failures: 0, Errors: 0, Skipped: 0, Time elapsed: 26.7 s - in org.apache.phoenix.end2end.TableSnapshotReadsMapReduceIT
[INFO] Running org.apache.phoenix.end2end.UpdateCacheAcrossDifferentClientsIT
[INFO] Tests run: 2, Failures: 0, Errors: 0, Skipped: 0, Time elapsed: 128.614 s - in org.apache.phoenix.end2end.SystemTablePermissionsIT
[INFO] Tests run: 10, Failures: 0, Errors: 0, Skipped: 0, Time elapsed: 108.932 s - in org.apache.phoenix.end2end.RegexBulkLoadToolIT
[INFO] Running org.apache.phoenix.end2end.UserDefinedFunctionsIT
[INFO] Tests run: 6, Failures: 0, Errors: 0, Skipped: 0, Time elapsed: 37.321 s - in org.apache.phoenix.end2end.UpdateCacheAcrossDifferentClientsIT
[WARNING] Tests run: 24, Failures: 0, Errors: 0, Skipped: 4, Time elapsed: 93.707 s - in org.apache.phoenix.end2end.SysTableNamespaceMappedStatsCollectorIT
[INFO] Running org.apache.phoenix.end2end.index.ImmutableIndexIT
[INFO] Running org.apache.phoenix.end2end.index.LocalIndexIT
[INFO] Tests run: 14, Failures: 0, Errors: 0, Skipped: 0, Time elapsed: 59.802 s - in org.apache.phoenix.end2end.UserDefinedFunctionsIT
[INFO] Running org.apache.phoenix.end2end.index.MutableIndexFailureIT
[INFO] Running org.apache.phoenix.end2end.index.MutableIndexReplicationIT
[INFO] Running org.apache.phoenix.end2end.index.PartialIndexRebuilderIT
[INFO] Running org.apache.phoenix.end2end.index.txn.TxWriteFailureIT
[INFO] Tests run: 1, Failures: 0, Errors: 0, Skipped: 0, Time elapsed: 33.259 s - in org.apache.phoenix.end2end.index.MutableIndexReplicationIT
[WARNING] Tests run: 24, Failures: 0, Errors: 0, Skipped: 16, Time elapsed: 122.849 s - in
org.apache.phoenix.end2end.index.ImmutableIndexIT
[INFO] Running org.apache.phoenix.hbase.index.FailForUnsupportedHBaseVersionsIT
[INFO] Tests run: 8, Failures: 0, Errors: 0, Skipped: 0, Time elapsed: 64.5 s - in org.apache.phoenix.end2end.index.txn.TxWriteFailureIT
[INFO] Running org.apache.phoenix.execute.UpsertSelectOverlappingBatchesIT
[INFO] Tests run: 2, Failures: 0, Errors: 0, Skipped: 0, Time elapsed: 32.029 s - in org.apache.phoenix.hbase.index.FailForUnsupportedHBaseVersionsIT
[INFO] Running org.apache.phoenix.execute.PartialCommitIT
[INFO] Tests run: 12, Failures: 0, Errors: 0, Skipped: 0, Time elapsed: 2.686 s - in org.apache.phoenix.execute.PartialCommitIT
[INFO] Running org.apache.phoenix.iterate.RoundRobinResultIteratorWithStatsIT
[INFO] Running org.apache.phoenix.iterate.ScannerLeaseRenewalIT
[INFO] Tests run: 3, Failures: 0, Errors: 0, Skipped: 0, Time elapsed: 86.178 s - in org.apache.phoenix.execute.UpsertSelectOverlappingBatchesIT
[INFO] Tests run: 1, Failures: 0, Errors: 0, Skipped: 0, Time elapsed: 40.408 s - in org.apache.phoenix.iterate.RoundRobinResultIteratorWithStatsIT
[INFO] Running org.apache.phoenix.monitoring.PhoenixMetricsIT
[INFO] Running org.apache.phoenix.rpc.PhoenixClientRpcIT
[INFO] Tests run: 2, Failures: 0, Errors: 0, Skipped: 0, Time elapsed: 8.011 s - in org.apache.phoenix.rpc.PhoenixClientRpcIT
[INFO] Running org.apache.phoenix.rpc.PhoenixServerRpcIT
[INFO] Tests run: 2, Failures: 0, Errors: 0, Skipped: 0, Time elapsed: 22.67 s - in org.apache.phoenix.rpc.PhoenixServerRpcIT
[INFO] Tests run: 22, Failures: 0, Errors: 0, Skipped: 0, Time elapsed: 103.642 s - in org.apache.phoenix.monitoring.PhoenixMetricsIT
[INFO] Tests run: 2, Failures: 0, Errors: 0, Skipped: 0, Time elapsed: 164.018 s - in org.apache.phoenix.iterate.ScannerLeaseRenewalIT
[INFO] Tests run: 21, Failures: 0, Errors: 0, Skipped: 0, Time elapsed: 399.472 s - in org.apache.phoenix.end2end.index.MutableIndexFailureIT
[INFO] Tests run: 34, Failures: 0, Errors: 0, Skipped: 0, Time elapsed: 419.942 s - in org.apache.phoenix.end2end.index.LocalIndexIT
[ERROR] Tests run: 24, Failures: 1, Errors: 0, Skipped: 0, Time elapsed: 432.316 s <<<
FAILURE! - in org.apache.phoenix.end2end.index.PartialIndexRebuilderIT
[ERROR] testIndexWriteFailureDisablingIndex(org.apache.phoenix.end2end.index.PartialIndexRebuilderIT)
 Time elapsed: 9.128 s  <<< FAILURE!
java.lang.AssertionError: expected:<INACTIVE> but was:<DISABLE>
	at org.apache.phoenix.end2end.index.PartialIndexRebuilderIT.testIndexWriteFailureDuringRebuild(PartialIndexRebuilderIT.java:901)
	at org.apache.phoenix.end2end.index.PartialIndexRebuilderIT.testIndexWriteFailureDisablingIndex(PartialIndexRebuilderIT.java:827)

[INFO] Tests run: 140, Failures: 0, Errors: 0, Skipped: 0, Time elapsed: 1,008.329 s - in
org.apache.phoenix.end2end.IndexExtendedIT
[INFO] 
[INFO] Results:
[INFO] 
[ERROR] Failures: 
[ERROR]   PartialIndexRebuilderIT.testIndexWriteFailureDisablingIndex:827->testIndexWriteFailureDuringRebuild:901
expected:<INACTIVE> but was:<DISABLE>
[INFO] 
[ERROR] Tests run: 555, Failures: 1, Errors: 0, Skipped: 44
[INFO] 
[INFO] 
[INFO] --- maven-failsafe-plugin:2.20:verify (ParallelStatsEnabledTest) @ phoenix-core ---
[INFO] ------------------------------------------------------------------------
[INFO] Reactor Summary:
[INFO] 
[INFO] Apache Phoenix ..................................... SUCCESS [  4.385 s]
[INFO] Phoenix Core ....................................... FAILURE [  01:18 h]
[INFO] Phoenix - Flume .................................... SKIPPED
[INFO] Phoenix - Kafka .................................... SKIPPED
[INFO] Phoenix - Pig ...................................... SKIPPED
[INFO] Phoenix Query Server Client ........................ SKIPPED
[INFO] Phoenix Query Server ............................... SKIPPED
[INFO] Phoenix - Pherf .................................... SKIPPED
[INFO] Phoenix - Spark .................................... SKIPPED
[INFO] Phoenix - Hive ..................................... SKIPPED
[INFO] Phoenix Client ..................................... SKIPPED
[INFO] Phoenix Server ..................................... SKIPPED
[INFO] Phoenix Assembly ................................... SKIPPED
[INFO] Phoenix - Tracing Web Application .................. SKIPPED
[INFO] Phoenix Load Balancer .............................. SKIPPED
[INFO] ------------------------------------------------------------------------
[INFO] BUILD FAILURE
[INFO] ------------------------------------------------------------------------
[INFO] Total time: 01:18 h
[INFO] Finished at: 2017-09-29T20:11:55Z
[INFO] Final Memory: 62M/1049M
[INFO] ------------------------------------------------------------------------
[ERROR] Failed to execute goal org.apache.maven.plugins:maven-failsafe-plugin:2.20:verify
(ParallelStatsEnabledTest) on project phoenix-core: There are test failures.
[ERROR] 
[ERROR] Please refer to <https://builds.apache.org/job/Phoenix-master/ws/phoenix-core/target/failsafe-reports>
for the individual test results.
[ERROR] Please refer to dump files (if any exist) [date]-jvmRun[N].dump, [date].dumpstream
and [date]-jvmRun[N].dumpstream.
[ERROR] -> [Help 1]
[ERROR] 
[ERROR] To see the full stack trace of the errors, re-run Maven with the -e switch.
[ERROR] Re-run Maven using the -X switch to enable full debug logging.
[ERROR] 
[ERROR] For more information about the errors and possible solutions, please read the following
articles:
[ERROR] [Help 1] http://cwiki.apache.org/confluence/display/MAVEN/MojoFailureException
[ERROR] 
[ERROR] After correcting the problems, you can resume the build with the command
[ERROR]   mvn <goals> -rf :phoenix-core
Build step 'Invoke top-level Maven targets' marked build as failure
Archiving artifacts
[Fast Archiver] Compressed 3.22 GB of artifacts by 58.0% relative to #1807
[JIRA] Updating issue PHOENIX-4257
Recording test results

Mime
View raw message