phoenix-commits mailing list archives

Site index · List index
Message view « Date » · « Thread »
Top « Date » · « Thread »
From Apache Jenkins Server <jenk...@builds.apache.org>
Subject Build failed in Jenkins: Phoenix | Master #1795
Date Wed, 13 Sep 2017 23:47:27 GMT
See <https://builds.apache.org/job/Phoenix-master/1795/display/redirect>

------------------------------------------
[...truncated 108.01 KB...]
[INFO] 
[INFO] --- maven-failsafe-plugin:2.20:integration-test (NeedTheirOwnClusterTests) @ phoenix-core
---
[INFO] 
[INFO] -------------------------------------------------------
[INFO]  T E S T S
[INFO] -------------------------------------------------------
[INFO] Running org.apache.hadoop.hbase.regionserver.wal.WALReplayWithIndexWritesAndCompressedWALIT
[INFO] Running org.apache.phoenix.end2end.ConnectionUtilIT
[INFO] Tests run: 1, Failures: 0, Errors: 0, Skipped: 0, Time elapsed: 58.963 s - in org.apache.hadoop.hbase.regionserver.wal.WALReplayWithIndexWritesAndCompressedWALIT
[INFO] Running org.apache.hadoop.hbase.regionserver.wal.WALRecoveryRegionPostOpenIT
[INFO] Running org.apache.phoenix.end2end.CsvBulkLoadToolIT
[INFO] Running org.apache.phoenix.end2end.ArrayIT
[INFO] Running org.apache.phoenix.end2end.CountDistinctCompressionIT
[INFO] Tests run: 1, Failures: 0, Errors: 0, Skipped: 0, Time elapsed: 14.728 s - in org.apache.hadoop.hbase.regionserver.wal.WALRecoveryRegionPostOpenIT
[INFO] Tests run: 1, Failures: 0, Errors: 0, Skipped: 0, Time elapsed: 49.751 s - in org.apache.phoenix.end2end.ConnectionUtilIT
[INFO] Running org.apache.phoenix.end2end.ContextClassloaderIT
[INFO] Tests run: 1, Failures: 0, Errors: 0, Skipped: 0, Time elapsed: 8.878 s - in org.apache.phoenix.end2end.CountDistinctCompressionIT
[INFO] Tests run: 3, Failures: 0, Errors: 0, Skipped: 0, Time elapsed: 4.803 s - in org.apache.phoenix.end2end.ContextClassloaderIT
[INFO] Running org.apache.phoenix.end2end.FlappingLocalIndexIT
[INFO] Running org.apache.phoenix.end2end.IndexExtendedIT
[INFO] Running org.apache.phoenix.end2end.IndexScrutinyToolIT
[INFO] Running org.apache.phoenix.end2end.IndexToolForPartialBuildIT
[INFO] Running org.apache.phoenix.end2end.IndexToolForPartialBuildWithNamespaceEnabledIT
[INFO] Tests run: 1, Failures: 0, Errors: 0, Skipped: 0, Time elapsed: 18.697 s - in org.apache.phoenix.end2end.IndexToolForPartialBuildIT
[INFO] Running org.apache.phoenix.end2end.QueryTimeoutIT
[INFO] Tests run: 2, Failures: 0, Errors: 0, Skipped: 0, Time elapsed: 35.863 s - in org.apache.phoenix.end2end.IndexToolForPartialBuildWithNamespaceEnabledIT
[INFO] Tests run: 12, Failures: 0, Errors: 0, Skipped: 0, Time elapsed: 142.077 s - in org.apache.phoenix.end2end.CsvBulkLoadToolIT
[INFO] Tests run: 2, Failures: 0, Errors: 0, Skipped: 0, Time elapsed: 16.241 s - in org.apache.phoenix.end2end.QueryTimeoutIT
[INFO] Running org.apache.phoenix.end2end.QueryWithLimitIT
[INFO] Tests run: 2, Failures: 0, Errors: 0, Skipped: 0, Time elapsed: 14.111 s - in org.apache.phoenix.end2end.QueryWithLimitIT
[INFO] Running org.apache.phoenix.end2end.RebuildIndexConnectionPropsIT
[INFO] Tests run: 1, Failures: 0, Errors: 0, Skipped: 0, Time elapsed: 0.743 s - in org.apache.phoenix.end2end.RebuildIndexConnectionPropsIT
[INFO] Running org.apache.phoenix.end2end.RegexBulkLoadToolIT
[INFO] Running org.apache.phoenix.end2end.RenewLeaseIT
[INFO] Tests run: 10, Failures: 0, Errors: 0, Skipped: 0, Time elapsed: 157.543 s - in org.apache.phoenix.end2end.IndexScrutinyToolIT
[INFO] Tests run: 1, Failures: 0, Errors: 0, Skipped: 0, Time elapsed: 28.627 s - in org.apache.phoenix.end2end.RenewLeaseIT
[INFO] Running org.apache.phoenix.end2end.SystemTablePermissionsIT
[INFO] Tests run: 12, Failures: 0, Errors: 0, Skipped: 0, Time elapsed: 270.257 s - in org.apache.phoenix.end2end.FlappingLocalIndexIT
[INFO] Running org.apache.phoenix.end2end.SpillableGroupByIT
[INFO] Running org.apache.phoenix.end2end.StatsCollectorIT
[INFO] Tests run: 2, Failures: 0, Errors: 0, Skipped: 0, Time elapsed: 15.626 s - in org.apache.phoenix.end2end.SpillableGroupByIT
[INFO] Running org.apache.phoenix.end2end.SysTableNamespaceMappedStatsCollectorIT
[INFO] Tests run: 10, Failures: 0, Errors: 0, Skipped: 0, Time elapsed: 114.775 s - in org.apache.phoenix.end2end.RegexBulkLoadToolIT
[INFO] Running org.apache.phoenix.end2end.TableSnapshotReadsMapReduceIT
[INFO] Running org.apache.phoenix.end2end.UpdateCacheAcrossDifferentClientsIT
[INFO] Tests run: 3, Failures: 0, Errors: 0, Skipped: 0, Time elapsed: 35.523 s - in org.apache.phoenix.end2end.TableSnapshotReadsMapReduceIT
[INFO] Running org.apache.phoenix.end2end.UserDefinedFunctionsIT
[INFO] Tests run: 2, Failures: 0, Errors: 0, Skipped: 0, Time elapsed: 181.275 s - in org.apache.phoenix.end2end.SystemTablePermissionsIT
[INFO] Tests run: 6, Failures: 0, Errors: 0, Skipped: 0, Time elapsed: 73.043 s - in org.apache.phoenix.end2end.UpdateCacheAcrossDifferentClientsIT
[INFO] Running org.apache.phoenix.end2end.index.ImmutableIndexIT
[INFO] Running org.apache.phoenix.end2end.index.LocalIndexIT
[INFO] Running org.apache.phoenix.end2end.index.MutableIndexFailureIT
[INFO] Tests run: 14, Failures: 0, Errors: 0, Skipped: 0, Time elapsed: 129.401 s - in org.apache.phoenix.end2end.UserDefinedFunctionsIT
[INFO] Tests run: 80, Failures: 0, Errors: 0, Skipped: 0, Time elapsed: 575.831 s - in org.apache.phoenix.end2end.ArrayIT
[INFO] Running org.apache.phoenix.end2end.index.MutableIndexReplicationIT
[WARNING] Tests run: 24, Failures: 0, Errors: 0, Skipped: 16, Time elapsed: 164.387 s - in
org.apache.phoenix.end2end.index.ImmutableIndexIT
[INFO] Running org.apache.phoenix.end2end.index.PartialIndexRebuilderIT
[INFO] Tests run: 1, Failures: 0, Errors: 0, Skipped: 0, Time elapsed: 53.033 s - in org.apache.phoenix.end2end.index.MutableIndexReplicationIT
[INFO] Running org.apache.phoenix.end2end.index.txn.TxWriteFailureIT
[INFO] Running org.apache.phoenix.execute.PartialCommitIT
[INFO] Tests run: 12, Failures: 0, Errors: 0, Skipped: 0, Time elapsed: 1.013 s - in org.apache.phoenix.execute.PartialCommitIT
[INFO] Tests run: 8, Failures: 0, Errors: 0, Skipped: 0, Time elapsed: 115.51 s - in org.apache.phoenix.end2end.index.txn.TxWriteFailureIT
[INFO] Running org.apache.phoenix.hbase.index.FailForUnsupportedHBaseVersionsIT
[INFO] Running org.apache.phoenix.execute.UpsertSelectOverlappingBatchesIT
[INFO] Tests run: 2, Failures: 0, Errors: 0, Skipped: 0, Time elapsed: 37.047 s - in org.apache.phoenix.hbase.index.FailForUnsupportedHBaseVersionsIT
[INFO] Tests run: 1, Failures: 0, Errors: 0, Skipped: 0, Time elapsed: 27.738 s - in org.apache.phoenix.execute.UpsertSelectOverlappingBatchesIT
[INFO] Running org.apache.phoenix.hbase.index.covered.EndToEndCoveredColumnsIndexBuilderIT
[INFO] Running org.apache.phoenix.hbase.index.covered.FailWithoutRetriesIT
[INFO] Tests run: 1, Failures: 0, Errors: 0, Skipped: 0, Time elapsed: 5.232 s - in org.apache.phoenix.hbase.index.covered.FailWithoutRetriesIT
[INFO] Tests run: 2, Failures: 0, Errors: 0, Skipped: 0, Time elapsed: 28.856 s - in org.apache.phoenix.hbase.index.covered.EndToEndCoveredColumnsIndexBuilderIT
[ERROR] Tests run: 140, Failures: 0, Errors: 16, Skipped: 0, Time elapsed: 913.893 s <<<
FAILURE! - in org.apache.phoenix.end2end.IndexExtendedIT
[ERROR] testSecondaryIndex[transactional = true , mutable = false , localIndex = false, directApi
= false, useSnapshot = false](org.apache.phoenix.end2end.IndexExtendedIT)  Time elapsed: 2.031
s  <<< ERROR!
java.lang.RuntimeException: org.apache.thrift.TException: Unable to discover tx service.
	at org.apache.phoenix.end2end.IndexExtendedIT.testSecondaryIndex(IndexExtendedIT.java:214)
Caused by: org.apache.thrift.TException: Unable to discover tx service.
	at org.apache.phoenix.end2end.IndexExtendedIT.testSecondaryIndex(IndexExtendedIT.java:214)

[ERROR] testSecondaryIndex[transactional = true , mutable = false , localIndex = false, directApi
= true, useSnapshot = false](org.apache.phoenix.end2end.IndexExtendedIT)  Time elapsed: 2.004
s  <<< ERROR!
java.lang.RuntimeException: org.apache.thrift.TException: Unable to discover tx service.
	at org.apache.phoenix.end2end.IndexExtendedIT.testSecondaryIndex(IndexExtendedIT.java:214)
Caused by: org.apache.thrift.TException: Unable to discover tx service.
	at org.apache.phoenix.end2end.IndexExtendedIT.testSecondaryIndex(IndexExtendedIT.java:214)

[ERROR] testSecondaryIndex[transactional = true , mutable = false , localIndex = true, directApi
= false, useSnapshot = false](org.apache.phoenix.end2end.IndexExtendedIT)  Time elapsed: 2.004
s  <<< ERROR!
java.lang.RuntimeException: org.apache.thrift.TException: Unable to discover tx service.
	at org.apache.phoenix.end2end.IndexExtendedIT.testSecondaryIndex(IndexExtendedIT.java:214)
Caused by: org.apache.thrift.TException: Unable to discover tx service.
	at org.apache.phoenix.end2end.IndexExtendedIT.testSecondaryIndex(IndexExtendedIT.java:214)

[ERROR] testSecondaryIndex[transactional = true , mutable = false , localIndex = true, directApi
= true, useSnapshot = false](org.apache.phoenix.end2end.IndexExtendedIT)  Time elapsed: 2.005
s  <<< ERROR!
java.lang.RuntimeException: org.apache.thrift.TException: Unable to discover tx service.
	at org.apache.phoenix.end2end.IndexExtendedIT.testSecondaryIndex(IndexExtendedIT.java:214)
Caused by: org.apache.thrift.TException: Unable to discover tx service.
	at org.apache.phoenix.end2end.IndexExtendedIT.testSecondaryIndex(IndexExtendedIT.java:214)

[ERROR] testSecondaryIndex[transactional = true , mutable = true , localIndex = false, directApi
= false, useSnapshot = false](org.apache.phoenix.end2end.IndexExtendedIT)  Time elapsed: 2.004
s  <<< ERROR!
java.lang.RuntimeException: org.apache.thrift.TException: Unable to discover tx service.
	at org.apache.phoenix.end2end.IndexExtendedIT.testSecondaryIndex(IndexExtendedIT.java:214)
Caused by: org.apache.thrift.TException: Unable to discover tx service.
	at org.apache.phoenix.end2end.IndexExtendedIT.testSecondaryIndex(IndexExtendedIT.java:214)

[ERROR] testSecondaryIndex[transactional = true , mutable = true , localIndex = false, directApi
= true, useSnapshot = false](org.apache.phoenix.end2end.IndexExtendedIT)  Time elapsed: 2.004
s  <<< ERROR!
java.lang.RuntimeException: org.apache.thrift.TException: Unable to discover tx service.
	at org.apache.phoenix.end2end.IndexExtendedIT.testSecondaryIndex(IndexExtendedIT.java:214)
Caused by: org.apache.thrift.TException: Unable to discover tx service.
	at org.apache.phoenix.end2end.IndexExtendedIT.testSecondaryIndex(IndexExtendedIT.java:214)

[ERROR] testSecondaryIndex[transactional = true , mutable = true , localIndex = true, directApi
= false, useSnapshot = false](org.apache.phoenix.end2end.IndexExtendedIT)  Time elapsed: 2.004
s  <<< ERROR!
java.lang.RuntimeException: org.apache.thrift.TException: Unable to discover tx service.
	at org.apache.phoenix.end2end.IndexExtendedIT.testSecondaryIndex(IndexExtendedIT.java:214)
Caused by: org.apache.thrift.TException: Unable to discover tx service.
	at org.apache.phoenix.end2end.IndexExtendedIT.testSecondaryIndex(IndexExtendedIT.java:214)

[ERROR] testSecondaryIndex[transactional = true , mutable = true , localIndex = true, directApi
= true, useSnapshot = false](org.apache.phoenix.end2end.IndexExtendedIT)  Time elapsed: 2.003
s  <<< ERROR!
java.lang.RuntimeException: org.apache.thrift.TException: Unable to discover tx service.
	at org.apache.phoenix.end2end.IndexExtendedIT.testSecondaryIndex(IndexExtendedIT.java:214)
Caused by: org.apache.thrift.TException: Unable to discover tx service.
	at org.apache.phoenix.end2end.IndexExtendedIT.testSecondaryIndex(IndexExtendedIT.java:214)

[ERROR] testSecondaryIndex[transactional = true , mutable = false , localIndex = false, directApi
= false, useSnapshot = true](org.apache.phoenix.end2end.IndexExtendedIT)  Time elapsed: 2.003
s  <<< ERROR!
java.lang.RuntimeException: org.apache.thrift.TException: Unable to discover tx service.
	at org.apache.phoenix.end2end.IndexExtendedIT.testSecondaryIndex(IndexExtendedIT.java:214)
Caused by: org.apache.thrift.TException: Unable to discover tx service.
	at org.apache.phoenix.end2end.IndexExtendedIT.testSecondaryIndex(IndexExtendedIT.java:214)

[ERROR] testSecondaryIndex[transactional = true , mutable = false , localIndex = false, directApi
= true, useSnapshot = true](org.apache.phoenix.end2end.IndexExtendedIT)  Time elapsed: 2.003
s  <<< ERROR!
java.lang.RuntimeException: org.apache.thrift.TException: Unable to discover tx service.
	at org.apache.phoenix.end2end.IndexExtendedIT.testSecondaryIndex(IndexExtendedIT.java:214)
Caused by: org.apache.thrift.TException: Unable to discover tx service.
	at org.apache.phoenix.end2end.IndexExtendedIT.testSecondaryIndex(IndexExtendedIT.java:214)

[ERROR] testSecondaryIndex[transactional = true , mutable = false , localIndex = true, directApi
= false, useSnapshot = true](org.apache.phoenix.end2end.IndexExtendedIT)  Time elapsed: 2.003
s  <<< ERROR!
java.lang.RuntimeException: org.apache.thrift.TException: Unable to discover tx service.
	at org.apache.phoenix.end2end.IndexExtendedIT.testSecondaryIndex(IndexExtendedIT.java:214)
Caused by: org.apache.thrift.TException: Unable to discover tx service.
	at org.apache.phoenix.end2end.IndexExtendedIT.testSecondaryIndex(IndexExtendedIT.java:214)

[ERROR] testSecondaryIndex[transactional = true , mutable = false , localIndex = true, directApi
= true, useSnapshot = true](org.apache.phoenix.end2end.IndexExtendedIT)  Time elapsed: 2.004
s  <<< ERROR!
java.lang.RuntimeException: org.apache.thrift.TException: Unable to discover tx service.
	at org.apache.phoenix.end2end.IndexExtendedIT.testSecondaryIndex(IndexExtendedIT.java:214)
Caused by: org.apache.thrift.TException: Unable to discover tx service.
	at org.apache.phoenix.end2end.IndexExtendedIT.testSecondaryIndex(IndexExtendedIT.java:214)

[ERROR] testSecondaryIndex[transactional = true , mutable = true , localIndex = false, directApi
= false, useSnapshot = true](org.apache.phoenix.end2end.IndexExtendedIT)  Time elapsed: 2.003
s  <<< ERROR!
java.lang.RuntimeException: org.apache.thrift.TException: Unable to discover tx service.
	at org.apache.phoenix.end2end.IndexExtendedIT.testSecondaryIndex(IndexExtendedIT.java:214)
Caused by: org.apache.thrift.TException: Unable to discover tx service.
	at org.apache.phoenix.end2end.IndexExtendedIT.testSecondaryIndex(IndexExtendedIT.java:214)

[ERROR] testSecondaryIndex[transactional = true , mutable = true , localIndex = false, directApi
= true, useSnapshot = true](org.apache.phoenix.end2end.IndexExtendedIT)  Time elapsed: 2.003
s  <<< ERROR!
java.lang.RuntimeException: org.apache.thrift.TException: Unable to discover tx service.
	at org.apache.phoenix.end2end.IndexExtendedIT.testSecondaryIndex(IndexExtendedIT.java:214)
Caused by: org.apache.thrift.TException: Unable to discover tx service.
	at org.apache.phoenix.end2end.IndexExtendedIT.testSecondaryIndex(IndexExtendedIT.java:214)

[ERROR] testSecondaryIndex[transactional = true , mutable = true , localIndex = true, directApi
= false, useSnapshot = true](org.apache.phoenix.end2end.IndexExtendedIT)  Time elapsed: 2.003
s  <<< ERROR!
java.lang.RuntimeException: org.apache.thrift.TException: Unable to discover tx service.
	at org.apache.phoenix.end2end.IndexExtendedIT.testSecondaryIndex(IndexExtendedIT.java:214)
Caused by: org.apache.thrift.TException: Unable to discover tx service.
	at org.apache.phoenix.end2end.IndexExtendedIT.testSecondaryIndex(IndexExtendedIT.java:214)

[ERROR] testSecondaryIndex[transactional = true , mutable = true , localIndex = true, directApi
= true, useSnapshot = true](org.apache.phoenix.end2end.IndexExtendedIT)  Time elapsed: 2.003
s  <<< ERROR!
java.lang.RuntimeException: org.apache.thrift.TException: Unable to discover tx service.
	at org.apache.phoenix.end2end.IndexExtendedIT.testSecondaryIndex(IndexExtendedIT.java:214)
Caused by: org.apache.thrift.TException: Unable to discover tx service.
	at org.apache.phoenix.end2end.IndexExtendedIT.testSecondaryIndex(IndexExtendedIT.java:214)

[INFO] Running org.apache.phoenix.iterate.RoundRobinResultIteratorWithStatsIT
[INFO] Tests run: 1, Failures: 0, Errors: 0, Skipped: 0, Time elapsed: 9.997 s - in org.apache.phoenix.iterate.RoundRobinResultIteratorWithStatsIT
[INFO] Tests run: 21, Failures: 0, Errors: 0, Skipped: 0, Time elapsed: 496.574 s - in org.apache.phoenix.end2end.index.MutableIndexFailureIT
[INFO] Running org.apache.phoenix.iterate.ScannerLeaseRenewalIT
[INFO] Running org.apache.phoenix.monitoring.PhoenixMetricsIT
[INFO] Running org.apache.phoenix.rpc.PhoenixClientRpcIT
[INFO] Tests run: 2, Failures: 0, Errors: 0, Skipped: 0, Time elapsed: 14.664 s - in org.apache.phoenix.rpc.PhoenixClientRpcIT
[INFO] Running org.apache.phoenix.rpc.PhoenixServerRpcIT
[INFO] Tests run: 34, Failures: 0, Errors: 0, Skipped: 0, Time elapsed: 635.482 s - in org.apache.phoenix.end2end.index.LocalIndexIT
[INFO] Tests run: 2, Failures: 0, Errors: 0, Skipped: 0, Time elapsed: 33.075 s - in org.apache.phoenix.rpc.PhoenixServerRpcIT
[INFO] Tests run: 22, Failures: 0, Errors: 0, Skipped: 0, Time elapsed: 157.6 s - in org.apache.phoenix.monitoring.PhoenixMetricsIT
[INFO] Tests run: 2, Failures: 0, Errors: 0, Skipped: 0, Time elapsed: 177.625 s - in org.apache.phoenix.iterate.ScannerLeaseRenewalIT
[WARNING] Tests run: 132, Failures: 0, Errors: 0, Skipped: 24, Time elapsed: 992.835 s - in
org.apache.phoenix.end2end.StatsCollectorIT
[WARNING] Tests run: 132, Failures: 0, Errors: 0, Skipped: 24, Time elapsed: 987.819 s - in
org.apache.phoenix.end2end.SysTableNamespaceMappedStatsCollectorIT
[INFO] Tests run: 26, Failures: 0, Errors: 0, Skipped: 0, Time elapsed: 784.136 s - in org.apache.phoenix.end2end.index.PartialIndexRebuilderIT
[INFO] 
[INFO] Results:
[INFO] 
[ERROR] Errors: 
[ERROR]   IndexExtendedIT.testSecondaryIndex:214 » Runtime org.apache.thrift.TException:...
[ERROR]   IndexExtendedIT.testSecondaryIndex:214 » Runtime org.apache.thrift.TException:...
[ERROR]   IndexExtendedIT.testSecondaryIndex:214 » Runtime org.apache.thrift.TException:...
[ERROR]   IndexExtendedIT.testSecondaryIndex:214 » Runtime org.apache.thrift.TException:...
[ERROR]   IndexExtendedIT.testSecondaryIndex:214 » Runtime org.apache.thrift.TException:...
[ERROR]   IndexExtendedIT.testSecondaryIndex:214 » Runtime org.apache.thrift.TException:...
[ERROR]   IndexExtendedIT.testSecondaryIndex:214 » Runtime org.apache.thrift.TException:...
[ERROR]   IndexExtendedIT.testSecondaryIndex:214 » Runtime org.apache.thrift.TException:...
[ERROR]   IndexExtendedIT.testSecondaryIndex:214 » Runtime org.apache.thrift.TException:...
[ERROR]   IndexExtendedIT.testSecondaryIndex:214 » Runtime org.apache.thrift.TException:...
[ERROR]   IndexExtendedIT.testSecondaryIndex:214 » Runtime org.apache.thrift.TException:...
[ERROR]   IndexExtendedIT.testSecondaryIndex:214 » Runtime org.apache.thrift.TException:...
[ERROR]   IndexExtendedIT.testSecondaryIndex:214 » Runtime org.apache.thrift.TException:...
[ERROR]   IndexExtendedIT.testSecondaryIndex:214 » Runtime org.apache.thrift.TException:...
[ERROR]   IndexExtendedIT.testSecondaryIndex:214 » Runtime org.apache.thrift.TException:...
[ERROR]   IndexExtendedIT.testSecondaryIndex:214 » Runtime org.apache.thrift.TException:...
[INFO] 
[ERROR] Tests run: 732, Failures: 0, Errors: 16, Skipped: 64
[INFO] 
[INFO] 
[INFO] --- maven-failsafe-plugin:2.20:verify (ParallelStatsEnabledTest) @ phoenix-core ---
[INFO] ------------------------------------------------------------------------
[INFO] Reactor Summary:
[INFO] 
[INFO] Apache Phoenix ..................................... SUCCESS [  1.766 s]
[INFO] Phoenix Core ....................................... FAILURE [  02:32 h]
[INFO] Phoenix - Flume .................................... SKIPPED
[INFO] Phoenix - Kafka .................................... SKIPPED
[INFO] Phoenix - Pig ...................................... SKIPPED
[INFO] Phoenix Query Server Client ........................ SKIPPED
[INFO] Phoenix Query Server ............................... SKIPPED
[INFO] Phoenix - Pherf .................................... SKIPPED
[INFO] Phoenix - Spark .................................... SKIPPED
[INFO] Phoenix - Hive ..................................... SKIPPED
[INFO] Phoenix Client ..................................... SKIPPED
[INFO] Phoenix Server ..................................... SKIPPED
[INFO] Phoenix Assembly ................................... SKIPPED
[INFO] Phoenix - Tracing Web Application .................. SKIPPED
[INFO] Phoenix Load Balancer .............................. SKIPPED
[INFO] ------------------------------------------------------------------------
[INFO] BUILD FAILURE
[INFO] ------------------------------------------------------------------------
[INFO] Total time: 02:32 h
[INFO] Finished at: 2017-09-13T23:36:22Z
[INFO] Final Memory: 60M/1482M
[INFO] ------------------------------------------------------------------------
[ERROR] Failed to execute goal org.apache.maven.plugins:maven-failsafe-plugin:2.20:verify
(ParallelStatsEnabledTest) on project phoenix-core: There are test failures.
[ERROR] 
[ERROR] Please refer to <https://builds.apache.org/job/Phoenix-master/ws/phoenix-core/target/failsafe-reports>
for the individual test results.
[ERROR] Please refer to dump files (if any exist) [date]-jvmRun[N].dump, [date].dumpstream
and [date]-jvmRun[N].dumpstream.
[ERROR] -> [Help 1]
[ERROR] 
[ERROR] To see the full stack trace of the errors, re-run Maven with the -e switch.
[ERROR] Re-run Maven using the -X switch to enable full debug logging.
[ERROR] 
[ERROR] For more information about the errors and possible solutions, please read the following
articles:
[ERROR] [Help 1] http://cwiki.apache.org/confluence/display/MAVEN/MojoFailureException
[ERROR] 
[ERROR] After correcting the problems, you can resume the build with the command
[ERROR]   mvn <goals> -rf :phoenix-core
Build step 'Invoke top-level Maven targets' marked build as failure
Archiving artifacts
Recording test results

Mime
View raw message