phoenix-commits mailing list archives

Site index · List index
Message view « Date » · « Thread »
Top « Date » · « Thread »
From Apache Jenkins Server <jenk...@builds.apache.org>
Subject Build failed in Jenkins: Phoenix | Master #1806
Date Thu, 21 Sep 2017 18:12:17 GMT
See <https://builds.apache.org/job/Phoenix-master/1806/display/redirect?page=changes>

Changes:

[jtaylor] PHOENIX-4189 Introduce a class that wraps the Map of primary key data

[jtaylor] PHOENIX-4212 Disallow DML operations on connections with CURRENT_SCN set

[jtaylor] PHOENIX-4220 Upper bound not being used in partial index rebuilder

[jtaylor] PHOENIX-4221 Disallow DML operations on connections with CURRENT_SCN set

------------------------------------------
[...truncated 48.94 KB...]
[INFO] Running org.apache.phoenix.hbase.index.write.recovery.TestPerRegionIndexWriteCache
[INFO] Tests run: 2, Failures: 0, Errors: 0, Skipped: 0, Time elapsed: 2.123 s - in org.apache.phoenix.execute.MutationStateTest
[INFO] Running org.apache.phoenix.hbase.index.write.TestParalleIndexWriter
[INFO] Tests run: 6, Failures: 0, Errors: 0, Skipped: 0, Time elapsed: 2.325 s - in org.apache.phoenix.execute.CorrelatePlanTest
[INFO] Running org.apache.phoenix.hbase.index.write.TestIndexWriter
[INFO] Tests run: 2, Failures: 0, Errors: 0, Skipped: 0, Time elapsed: 1 s - in org.apache.phoenix.hbase.index.write.TestParalleIndexWriter
[INFO] Running org.apache.phoenix.hbase.index.write.TestWALRecoveryCaching
[WARNING] Tests run: 1, Failures: 0, Errors: 0, Skipped: 1, Time elapsed: 0.07 s - in org.apache.phoenix.hbase.index.write.TestWALRecoveryCaching
[INFO] Running org.apache.phoenix.hbase.index.util.TestIndexManagementUtil
[INFO] Tests run: 2, Failures: 0, Errors: 0, Skipped: 0, Time elapsed: 2.549 s - in org.apache.phoenix.hbase.index.write.TestParalleWriterIndexCommitter
[INFO] Running org.apache.phoenix.hbase.index.covered.TestCoveredColumnIndexCodec
[INFO] Tests run: 3, Failures: 0, Errors: 0, Skipped: 0, Time elapsed: 0.122 s - in org.apache.phoenix.hbase.index.util.TestIndexManagementUtil
[INFO] Running org.apache.phoenix.hbase.index.covered.LocalTableStateTest
[INFO] Tests run: 3, Failures: 0, Errors: 0, Skipped: 0, Time elapsed: 0.275 s - in org.apache.phoenix.hbase.index.covered.TestCoveredColumnIndexCodec
[INFO] Tests run: 5, Failures: 0, Errors: 0, Skipped: 0, Time elapsed: 1.425 s - in org.apache.phoenix.hbase.index.write.TestIndexWriter
[INFO] Running org.apache.phoenix.hbase.index.covered.filter.TestNewerTimestampFilter
[INFO] Tests run: 1, Failures: 0, Errors: 0, Skipped: 0, Time elapsed: 0 s - in org.apache.phoenix.hbase.index.covered.filter.TestNewerTimestampFilter
[INFO] Running org.apache.phoenix.hbase.index.covered.TestColumnTracker
[INFO] Tests run: 3, Failures: 0, Errors: 0, Skipped: 0, Time elapsed: 0.017 s - in org.apache.phoenix.hbase.index.covered.TestColumnTracker
[INFO] Running org.apache.phoenix.hbase.index.covered.data.TestIndexMemStore
[INFO] Running org.apache.phoenix.hbase.index.covered.filter.TestApplyAndFilterDeletesFilter
[INFO] Tests run: 6, Failures: 0, Errors: 0, Skipped: 0, Time elapsed: 0.001 s - in org.apache.phoenix.hbase.index.covered.filter.TestApplyAndFilterDeletesFilter
[INFO] Running org.apache.phoenix.hbase.index.covered.data.TestLocalTable
[INFO] Tests run: 1, Failures: 0, Errors: 0, Skipped: 0, Time elapsed: 0.085 s - in org.apache.phoenix.hbase.index.covered.data.TestLocalTable
[INFO] Tests run: 2, Failures: 0, Errors: 0, Skipped: 0, Time elapsed: 0.095 s - in org.apache.phoenix.hbase.index.covered.data.TestIndexMemStore
[INFO] Running org.apache.phoenix.hbase.index.covered.CoveredColumnsTest
[INFO] Running org.apache.phoenix.hbase.index.covered.update.TestIndexUpdateManager
[INFO] Tests run: 1, Failures: 0, Errors: 0, Skipped: 0, Time elapsed: 0.018 s - in org.apache.phoenix.hbase.index.covered.CoveredColumnsTest
[INFO] Running org.apache.phoenix.hbase.index.covered.TestCoveredIndexSpecifierBuilder
[INFO] Tests run: 1, Failures: 0, Errors: 0, Skipped: 0, Time elapsed: 0.073 s - in org.apache.phoenix.hbase.index.covered.TestCoveredIndexSpecifierBuilder
[INFO] Running org.apache.phoenix.hbase.index.covered.NonTxIndexBuilderTest
[INFO] Tests run: 2, Failures: 0, Errors: 0, Skipped: 0, Time elapsed: 0.149 s - in org.apache.phoenix.hbase.index.covered.update.TestIndexUpdateManager
[INFO] Running org.apache.phoenix.filter.DistinctPrefixFilterTest
[INFO] Tests run: 8, Failures: 0, Errors: 0, Skipped: 0, Time elapsed: 0.07 s - in org.apache.phoenix.filter.DistinctPrefixFilterTest
[INFO] Running org.apache.phoenix.filter.SkipScanBigFilterTest
[INFO] Tests run: 5, Failures: 0, Errors: 0, Skipped: 0, Time elapsed: 0.838 s - in org.apache.phoenix.hbase.index.covered.LocalTableStateTest
[INFO] Running org.apache.phoenix.filter.SkipScanFilterIntersectTest
[INFO] Tests run: 19, Failures: 0, Errors: 0, Skipped: 0, Time elapsed: 0.461 s - in org.apache.phoenix.filter.SkipScanFilterIntersectTest
[INFO] Running org.apache.phoenix.filter.SkipScanFilterTest
[INFO] Tests run: 20, Failures: 0, Errors: 0, Skipped: 0, Time elapsed: 0.913 s - in org.apache.phoenix.filter.SkipScanFilterTest
[INFO] Running org.apache.phoenix.memory.MemoryManagerTest
[INFO] Tests run: 109, Failures: 0, Errors: 0, Skipped: 0, Time elapsed: 10.58 s - in org.apache.phoenix.compile.WhereOptimizerTest
[INFO] Running org.apache.phoenix.iterate.MergeSortResultIteratorTest
[INFO] Tests run: 2, Failures: 0, Errors: 0, Skipped: 0, Time elapsed: 0.001 s - in org.apache.phoenix.iterate.MergeSortResultIteratorTest
[INFO] Running org.apache.phoenix.iterate.SpoolingResultIteratorTest
[INFO] Tests run: 3, Failures: 0, Errors: 0, Skipped: 0, Time elapsed: 0.29 s - in org.apache.phoenix.iterate.SpoolingResultIteratorTest
[INFO] Running org.apache.phoenix.iterate.OrderedResultIteratorTest
[INFO] Tests run: 1, Failures: 0, Errors: 0, Skipped: 0, Time elapsed: 0 s - in org.apache.phoenix.iterate.OrderedResultIteratorTest
[INFO] Running org.apache.phoenix.iterate.RowKeyOrderedAggregateResultIteratorTest
[INFO] Tests run: 2, Failures: 0, Errors: 0, Skipped: 0, Time elapsed: 4.338 s - in org.apache.phoenix.filter.SkipScanBigFilterTest
[INFO] Running org.apache.phoenix.iterate.ConcatResultIteratorTest
[INFO] Tests run: 2, Failures: 0, Errors: 0, Skipped: 0, Time elapsed: 0.076 s - in org.apache.phoenix.iterate.ConcatResultIteratorTest
[INFO] Running org.apache.phoenix.iterate.AggregateResultScannerTest
[INFO] Tests run: 4, Failures: 0, Errors: 0, Skipped: 0, Time elapsed: 3.039 s - in org.apache.phoenix.memory.MemoryManagerTest
[INFO] Running org.apache.phoenix.util.ColumnInfoTest
[INFO] Tests run: 5, Failures: 0, Errors: 0, Skipped: 0, Time elapsed: 0.03 s - in org.apache.phoenix.util.ColumnInfoTest
[INFO] Running org.apache.phoenix.util.QueryUtilTest
[INFO] Tests run: 3, Failures: 0, Errors: 0, Skipped: 0, Time elapsed: 8.178 s - in org.apache.phoenix.hbase.index.write.recovery.TestPerRegionIndexWriteCache
[INFO] Tests run: 11, Failures: 0, Errors: 0, Skipped: 0, Time elapsed: 0.151 s - in org.apache.phoenix.util.QueryUtilTest
[INFO] Running org.apache.phoenix.util.PropertiesUtilTest
[INFO] Running org.apache.phoenix.util.PrefixByteEncoderDecoderTest
[INFO] Tests run: 3, Failures: 0, Errors: 0, Skipped: 0, Time elapsed: 0.039 s - in org.apache.phoenix.util.PrefixByteEncoderDecoderTest
[INFO] Running org.apache.phoenix.util.PhoenixEncodeDecodeTest
[INFO] Tests run: 4, Failures: 0, Errors: 0, Skipped: 0, Time elapsed: 0.91 s - in org.apache.phoenix.util.PropertiesUtilTest
[INFO] Running org.apache.phoenix.util.PhoenixRuntimeTest
[INFO] Tests run: 1, Failures: 0, Errors: 0, Skipped: 0, Time elapsed: 3.517 s - in org.apache.phoenix.iterate.AggregateResultScannerTest
[INFO] Running org.apache.phoenix.util.LogUtilTest
[INFO] Tests run: 8, Failures: 0, Errors: 0, Skipped: 0, Time elapsed: 68.928 s - in org.apache.phoenix.jdbc.SecureUserConnectionsTest
[INFO] Running org.apache.phoenix.util.QualifierEncodingSchemeTest
[INFO] Tests run: 4, Failures: 0, Errors: 0, Skipped: 0, Time elapsed: 0.072 s - in org.apache.phoenix.util.QualifierEncodingSchemeTest
[INFO] Running org.apache.phoenix.util.LikeExpressionTest
[INFO] Tests run: 3, Failures: 0, Errors: 0, Skipped: 0, Time elapsed: 0.74 s - in org.apache.phoenix.util.LogUtilTest
[INFO] Running org.apache.phoenix.util.SequenceUtilTest
[INFO] Tests run: 1, Failures: 0, Errors: 0, Skipped: 0, Time elapsed: 0.109 s - in org.apache.phoenix.util.LikeExpressionTest
[INFO] Running org.apache.phoenix.util.DateUtilTest
[INFO] Tests run: 18, Failures: 0, Errors: 0, Skipped: 0, Time elapsed: 0.143 s - in org.apache.phoenix.util.SequenceUtilTest
[INFO] Running org.apache.phoenix.util.MetaDataUtilTest
[INFO] Tests run: 4, Failures: 0, Errors: 0, Skipped: 0, Time elapsed: 6.03 s - in org.apache.phoenix.iterate.RowKeyOrderedAggregateResultIteratorTest
[INFO] Running org.apache.phoenix.util.csv.StringToArrayConverterTest
[INFO] Tests run: 4, Failures: 0, Errors: 0, Skipped: 0, Time elapsed: 0.377 s - in org.apache.phoenix.util.MetaDataUtilTest
[INFO] Tests run: 4, Failures: 0, Errors: 0, Skipped: 0, Time elapsed: 4.232 s - in org.apache.phoenix.util.PhoenixEncodeDecodeTest
[INFO] Running org.apache.phoenix.util.TenantIdByteConversionTest
[INFO] Running org.apache.phoenix.util.csv.CsvUpsertExecutorTest
[INFO] Tests run: 18, Failures: 0, Errors: 0, Skipped: 0, Time elapsed: 0.375 s - in org.apache.phoenix.util.TenantIdByteConversionTest
[INFO] Running org.apache.phoenix.util.ByteUtilTest
[INFO] Tests run: 22, Failures: 0, Errors: 0, Skipped: 0, Time elapsed: 1.169 s - in org.apache.phoenix.util.DateUtilTest
[INFO] Running org.apache.phoenix.util.PhoenixContextExecutorTest
[INFO] Tests run: 1, Failures: 0, Errors: 0, Skipped: 0, Time elapsed: 0.041 s - in org.apache.phoenix.util.PhoenixContextExecutorTest
[INFO] Running org.apache.phoenix.util.IndexUtilTest
[INFO] Tests run: 3, Failures: 0, Errors: 0, Skipped: 0, Time elapsed: 0.33 s - in org.apache.phoenix.util.ByteUtilTest
[INFO] Tests run: 2, Failures: 0, Errors: 0, Skipped: 0, Time elapsed: 0.088 s - in org.apache.phoenix.util.IndexUtilTest
[INFO] Running org.apache.phoenix.util.ScanUtilTest
[INFO] Running org.apache.phoenix.util.Base62EncoderTest
[INFO] Tests run: 1, Failures: 0, Errors: 0, Skipped: 0, Time elapsed: 0.11 s - in org.apache.phoenix.util.Base62EncoderTest
[INFO] Running org.apache.phoenix.util.JDBCUtilTest
[INFO] Tests run: 13, Failures: 0, Errors: 0, Skipped: 0, Time elapsed: 0.098 s - in org.apache.phoenix.util.JDBCUtilTest
[INFO] Running org.apache.phoenix.util.json.JsonUpsertExecutorTest
[INFO] Tests run: 20, Failures: 0, Errors: 0, Skipped: 0, Time elapsed: 0.56 s - in org.apache.phoenix.util.ScanUtilTest
[INFO] Running org.apache.phoenix.util.StringUtilTest
[INFO] Tests run: 5, Failures: 0, Errors: 0, Skipped: 0, Time elapsed: 0.048 s - in org.apache.phoenix.util.StringUtilTest
[INFO] Running org.apache.phoenix.expression.RegexpSplitFunctionTest
[INFO] Tests run: 1, Failures: 0, Errors: 0, Skipped: 0, Time elapsed: 2.673 s - in org.apache.phoenix.expression.RegexpSplitFunctionTest
[INFO] Running org.apache.phoenix.expression.PowerFunctionTest
[ERROR] Tests run: 3, Failures: 0, Errors: 1, Skipped: 0, Time elapsed: 13.926 s <<< FAILURE! - in org.apache.phoenix.hbase.index.covered.NonTxIndexBuilderTest
[ERROR] testManyVersions(org.apache.phoenix.hbase.index.covered.NonTxIndexBuilderTest)  Time elapsed: 10.959 s  <<< ERROR!
org.junit.runners.model.TestTimedOutException: test timed out after 10000 milliseconds
	at org.apache.phoenix.hbase.index.covered.NonTxIndexBuilderTest.testManyVersions(NonTxIndexBuilderTest.java:289)

[INFO] Tests run: 1, Failures: 0, Errors: 0, Skipped: 0, Time elapsed: 0.36 s - in org.apache.phoenix.expression.PowerFunctionTest
[INFO] Running org.apache.phoenix.expression.GetSetByteBitFunctionTest
[INFO] Running org.apache.phoenix.expression.function.BuiltinFunctionConstructorTest
[INFO] Tests run: 8, Failures: 0, Errors: 0, Skipped: 0, Time elapsed: 3.98 s - in org.apache.phoenix.util.json.JsonUpsertExecutorTest
[INFO] Running org.apache.phoenix.expression.function.InstrFunctionTest
[INFO] Tests run: 1, Failures: 0, Errors: 0, Skipped: 0, Time elapsed: 0.04 s - in org.apache.phoenix.expression.function.InstrFunctionTest
[INFO] Running org.apache.phoenix.expression.function.ExternalSqlTypeIdFunctionTest
[INFO] Tests run: 8, Failures: 0, Errors: 0, Skipped: 0, Time elapsed: 5.05 s - in org.apache.phoenix.util.csv.CsvUpsertExecutorTest
[INFO] Running org.apache.phoenix.expression.AbsFunctionTest
[INFO] Tests run: 3, Failures: 0, Errors: 0, Skipped: 0, Time elapsed: 0.02 s - in org.apache.phoenix.expression.function.ExternalSqlTypeIdFunctionTest
[INFO] Running org.apache.phoenix.expression.SortOrderExpressionTest
[INFO] Tests run: 1, Failures: 0, Errors: 0, Skipped: 0, Time elapsed: 0.145 s - in org.apache.phoenix.expression.AbsFunctionTest
[INFO] Running org.apache.phoenix.expression.SqrtFunctionTest
[INFO] Tests run: 1, Failures: 0, Errors: 0, Skipped: 0, Time elapsed: 0.085 s - in org.apache.phoenix.expression.SqrtFunctionTest
[INFO] Running org.apache.phoenix.expression.LikeExpressionTest
[INFO] Tests run: 6, Failures: 0, Errors: 0, Skipped: 0, Time elapsed: 1.085 s - in org.apache.phoenix.expression.LikeExpressionTest
[INFO] Running org.apache.phoenix.expression.StringToArrayFunctionTest
[INFO] Tests run: 24, Failures: 0, Errors: 0, Skipped: 0, Time elapsed: 1.532 s - in org.apache.phoenix.expression.SortOrderExpressionTest
[INFO] Running org.apache.phoenix.expression.CoerceExpressionTest
[INFO] Tests run: 20, Failures: 0, Errors: 0, Skipped: 0, Time elapsed: 0.271 s - in org.apache.phoenix.expression.StringToArrayFunctionTest
[INFO] Running org.apache.phoenix.expression.RoundFloorCeilExpressionsTest
[INFO] Tests run: 5, Failures: 0, Errors: 0, Skipped: 0, Time elapsed: 0.047 s - in org.apache.phoenix.expression.CoerceExpressionTest
[INFO] Running org.apache.phoenix.expression.ArrayPrependFunctionTest
[INFO] Tests run: 2, Failures: 0, Errors: 0, Skipped: 0, Time elapsed: 3.25 s - in org.apache.phoenix.expression.function.BuiltinFunctionConstructorTest
[INFO] Running org.apache.phoenix.expression.ArrayConcatFunctionTest
[INFO] Tests run: 37, Failures: 0, Errors: 0, Skipped: 0, Time elapsed: 3.168 s - in org.apache.phoenix.expression.ArrayPrependFunctionTest
[INFO] Running org.apache.phoenix.expression.DeterminismTest
[INFO] Tests run: 1, Failures: 0, Errors: 0, Skipped: 0, Time elapsed: 0.001 s - in org.apache.phoenix.expression.DeterminismTest
[INFO] Running org.apache.phoenix.expression.RegexpSubstrFunctionTest
[INFO] Tests run: 4, Failures: 0, Errors: 0, Skipped: 0, Time elapsed: 10.237 s - in org.apache.phoenix.util.csv.StringToArrayConverterTest
[INFO] Running org.apache.phoenix.expression.ArrayAppendFunctionTest
[INFO] Tests run: 1, Failures: 0, Errors: 0, Skipped: 0, Time elapsed: 0.12 s - in org.apache.phoenix.expression.RegexpSubstrFunctionTest
[INFO] Running org.apache.phoenix.expression.ArithmeticOperationTest
[INFO] Tests run: 6, Failures: 0, Errors: 0, Skipped: 0, Time elapsed: 0.152 s - in org.apache.phoenix.expression.ArithmeticOperationTest
[INFO] Running org.apache.phoenix.expression.OctetLengthFunctionTest
[INFO] Tests run: 1, Failures: 0, Errors: 0, Skipped: 0, Time elapsed: 0.48 s - in org.apache.phoenix.expression.OctetLengthFunctionTest
[INFO] Running org.apache.phoenix.expression.ColumnExpressionTest
[INFO] Tests run: 4, Failures: 0, Errors: 0, Skipped: 0, Time elapsed: 0.061 s - in org.apache.phoenix.expression.ColumnExpressionTest
[INFO] Running org.apache.phoenix.expression.util.regex.PatternPerformanceTest
[INFO] Tests run: 1, Failures: 0, Errors: 0, Skipped: 0, Time elapsed: 0.018 s - in org.apache.phoenix.expression.util.regex.PatternPerformanceTest
[INFO] Running org.apache.phoenix.expression.RegexpReplaceFunctionTest
[INFO] Tests run: 1, Failures: 0, Errors: 0, Skipped: 0, Time elapsed: 0.06 s - in org.apache.phoenix.expression.RegexpReplaceFunctionTest
[INFO] Running org.apache.phoenix.expression.LnLogFunctionTest
[INFO] Tests run: 2, Failures: 0, Errors: 0, Skipped: 0, Time elapsed: 6.408 s - in org.apache.phoenix.expression.GetSetByteBitFunctionTest
[INFO] Running org.apache.phoenix.expression.ArrayFillFunctionTest
[INFO] Tests run: 47, Failures: 0, Errors: 0, Skipped: 0, Time elapsed: 26.969 s - in org.apache.phoenix.compile.QueryOptimizerTest
[INFO] Running org.apache.phoenix.expression.CbrtFunctionTest
[INFO] Tests run: 1, Failures: 0, Errors: 0, Skipped: 0, Time elapsed: 0.226 s - in org.apache.phoenix.expression.LnLogFunctionTest
[INFO] Running org.apache.phoenix.expression.ILikeExpressionTest
[INFO] Tests run: 1, Failures: 0, Errors: 0, Skipped: 0, Time elapsed: 0.06 s - in org.apache.phoenix.expression.CbrtFunctionTest
[INFO] Tests run: 14, Failures: 0, Errors: 0, Skipped: 0, Time elapsed: 0.249 s - in org.apache.phoenix.expression.ArrayFillFunctionTest
[INFO] Running org.apache.phoenix.expression.ExpFunctionTest
[INFO] Running org.apache.phoenix.expression.ArrayToStringFunctionTest
[INFO] Tests run: 1, Failures: 0, Errors: 0, Skipped: 0, Time elapsed: 0.05 s - in org.apache.phoenix.expression.ExpFunctionTest
[INFO] Running org.apache.phoenix.expression.ArrayConstructorExpressionTest
[INFO] Tests run: 1, Failures: 0, Errors: 0, Skipped: 0, Time elapsed: 0.039 s - in org.apache.phoenix.expression.ArrayConstructorExpressionTest
[INFO] Tests run: 3, Failures: 0, Errors: 0, Skipped: 0, Time elapsed: 0.207 s - in org.apache.phoenix.expression.ILikeExpressionTest
[INFO] Running org.apache.phoenix.expression.NullValueTest
[INFO] Running org.apache.phoenix.expression.SignFunctionTest
[INFO] Tests run: 24, Failures: 0, Errors: 0, Skipped: 0, Time elapsed: 0.229 s - in org.apache.phoenix.expression.ArrayToStringFunctionTest
[INFO] Running org.apache.phoenix.index.automated.MRJobSubmitterTest
[INFO] Tests run: 1, Failures: 0, Errors: 0, Skipped: 0, Time elapsed: 0.137 s - in org.apache.phoenix.expression.SignFunctionTest
[INFO] Running org.apache.phoenix.index.IndexMaintainerTest
[INFO] Tests run: 23, Failures: 0, Errors: 0, Skipped: 0, Time elapsed: 5.201 s - in org.apache.phoenix.expression.RoundFloorCeilExpressionsTest
[INFO] Tests run: 5, Failures: 0, Errors: 0, Skipped: 0, Time elapsed: 1.107 s - in org.apache.phoenix.index.automated.MRJobSubmitterTest
[INFO] Tests run: 25, Failures: 0, Errors: 0, Skipped: 0, Time elapsed: 2.629 s - in org.apache.phoenix.expression.ArrayAppendFunctionTest
[INFO] Tests run: 3, Failures: 0, Errors: 0, Skipped: 0, Time elapsed: 2.756 s - in org.apache.phoenix.expression.NullValueTest
[INFO] Tests run: 158, Failures: 0, Errors: 0, Skipped: 0, Time elapsed: 41.856 s - in org.apache.phoenix.compile.QueryCompilerTest
[INFO] Tests run: 12, Failures: 0, Errors: 0, Skipped: 0, Time elapsed: 20.05 s - in org.apache.phoenix.util.PhoenixRuntimeTest
[INFO] Tests run: 35, Failures: 0, Errors: 0, Skipped: 0, Time elapsed: 9.169 s - in org.apache.phoenix.expression.ArrayConcatFunctionTest
[INFO] Tests run: 24, Failures: 0, Errors: 0, Skipped: 0, Time elapsed: 7.006 s - in org.apache.phoenix.index.IndexMaintainerTest
[INFO] 
[INFO] Results:
[INFO] 
[ERROR] Errors: 
[ERROR]   NonTxIndexBuilderTest.testManyVersions:289 ยป TestTimedOut test timed out after...
[INFO] 
[ERROR] Tests run: 1541, Failures: 0, Errors: 1, Skipped: 3
[INFO] 
[INFO] ------------------------------------------------------------------------
[INFO] Reactor Summary:
[INFO] 
[INFO] Apache Phoenix ..................................... SUCCESS [  6.193 s]
[INFO] Phoenix Core ....................................... FAILURE [03:15 min]
[INFO] Phoenix - Flume .................................... SKIPPED
[INFO] Phoenix - Kafka .................................... SKIPPED
[INFO] Phoenix - Pig ...................................... SKIPPED
[INFO] Phoenix Query Server Client ........................ SKIPPED
[INFO] Phoenix Query Server ............................... SKIPPED
[INFO] Phoenix - Pherf .................................... SKIPPED
[INFO] Phoenix - Spark .................................... SKIPPED
[INFO] Phoenix - Hive ..................................... SKIPPED
[INFO] Phoenix Client ..................................... SKIPPED
[INFO] Phoenix Server ..................................... SKIPPED
[INFO] Phoenix Assembly ................................... SKIPPED
[INFO] Phoenix - Tracing Web Application .................. SKIPPED
[INFO] Phoenix Load Balancer .............................. SKIPPED
[INFO] ------------------------------------------------------------------------
[INFO] BUILD FAILURE
[INFO] ------------------------------------------------------------------------
[INFO] Total time: 03:26 min
[INFO] Finished at: 2017-09-21T17:55:38Z
[INFO] Final Memory: 81M/1349M
[INFO] ------------------------------------------------------------------------
[ERROR] Failed to execute goal org.apache.maven.plugins:maven-surefire-plugin:2.20:test (default-test) on project phoenix-core: There are test failures.
[ERROR] 
[ERROR] Please refer to <https://builds.apache.org/job/Phoenix-master/ws/phoenix-core/target/surefire-reports> for the individual test results.
[ERROR] Please refer to dump files (if any exist) [date]-jvmRun[N].dump, [date].dumpstream and [date]-jvmRun[N].dumpstream.
[ERROR] -> [Help 1]
[ERROR] 
[ERROR] To see the full stack trace of the errors, re-run Maven with the -e switch.
[ERROR] Re-run Maven using the -X switch to enable full debug logging.
[ERROR] 
[ERROR] For more information about the errors and possible solutions, please read the following articles:
[ERROR] [Help 1] http://cwiki.apache.org/confluence/display/MAVEN/MojoFailureException
[ERROR] 
[ERROR] After correcting the problems, you can resume the build with the command
[ERROR]   mvn <goals> -rf :phoenix-core
Build step 'Invoke top-level Maven targets' marked build as failure
Archiving artifacts
ERROR: Failed to archive {phoenix-queryserver/target/failsafe-reports/org.apache.phoenix.end2end.HttpParamImpersonationQueryServerIT-output.txt=phoenix-queryserver/target/failsafe-reports/org.apache.phoenix.end2end.HttpParamImpersonationQueryServerIT-output.txt, phoenix-core/target/surefire-reports/org.apache.phoenix.expression.CoerceExpressionTest.txt=phoenix-core/target/surefire-reports/org.apache.phoenix.expression.CoerceExpressionTest.txt, phoenix-hive/target/dependency/xz-1.0.jar=phoenix-hive/target/dependency/xz-1.0.jar, phoenix-hive/target/hive/hive-localDir-nm-0_3/usercache/jenkins/filecache/42/hive-exec-1.2.1.jar=phoenix-hive/target/hive/hive-localDir-nm-0_3/usercache/jenkins/filecache/42/hive-exec-1.2.1.jar, phoenix-spark/target/surefire-reports/TEST-org.scalatest.tools.DiscoverySuite-d4aa1f0a-555b-4847-9d0c-866b2e40feae.xml=phoenix-spark/target/surefire-reports/TEST-org.scalatest.tools.DiscoverySuite-d4aa1f0a-555b-4847-9d0c-866b2e40feae.xml, phoenix-queryserver/target/surefire-reports/org.apache.phoenix.queryserver.server.PhoenixRemoteUserExtractorTest-output.txt=phoenix-queryserver/target/surefire-reports/org.apache.phoenix.queryserver.server.PhoenixRemoteUserExtractorTest-output.txt, phoenix-core/target/surefire-reports/TEST-org.apache.phoenix.hbase.index.covered.NonTxIndexBuilderTest.xml=phoenix-core/target/surefire-reports/TEST-org.apache.phoenix.hbase.index.covered.NonTxIndexBuilderTest.xml, phoenix-hive/target/MiniMRCluster_2090392667/MiniMRCluster_2090392667-localDir-nm-0_2/usercache/jenkins/filecache/37/hadoop-common-2.7.1.jar=phoenix-hive/target/MiniMRCluster_2090392667/MiniMRCluster_2090392667-localDir-nm-0_2/usercache/jenkins/filecache/37/hadoop-common-2.7.1.jar, phoenix-core/target/surefire-reports/TEST-org.apache.phoenix.util.LogUtilTest.xml=phoenix-core/target/surefire-reports/TEST-org.apache.phoenix.util.LogUtilTest.xml, phoenix-core/target/surefire-reports/org.apache.phoenix.iterate.SpoolingResultIteratorTest.txt=phoenix-core/target/surefire-reports/org.apache.phoenix.iterate.SpoolingResultIteratorTest.txt, phoenix-hive/target/dependency/janino-2.7.6.jar=phoenix-hive/target/dependency/janino-2.7.6.jar, phoenix-core/target/surefire-reports/org.apache.phoenix.hbase.index.write.TestWALRecoveryCaching.txt=phoenix-core/target/surefire-reports/org.apache.phoenix.hbase.index.write.TestWALRecoveryCaching.txt, phoenix-queryserver/target/failsafe-reports/org.apache.phoenix.end2end.SecureQueryServerIT.txt=phoenix-queryserver/target/failsafe-reports/org.apache.phoenix.end2end.SecureQueryServerIT.txt, phoenix-hive/target/dependency/jsp-2.1-6.1.14.jar=phoenix-hive/target/dependency/jsp-2.1-6.1.14.jar, phoenix-hive/target/MiniMRCluster_2090392667/MiniMRCluster_2090392667-localDir-nm-0_1/usercache/jenkins/filecache/27/hive-exec-1.2.1.jar=phoenix-hive/target/MiniMRCluster_2090392667/MiniMRCluster_2090392667-localDir-nm-0_1/usercache/jenkins/filecache/27/hive-exec-1.2.1.jar, phoenix-flume/target/failsafe-reports/org.apache.phoenix.flume.CsvEventSerializerIT-output.txt=phoenix-flume/target/failsafe-reports/org.apache.phoenix.flume.CsvEventSerializerIT-output.txt, phoenix-hive/target/dependency/curator-framework-2.6.0.jar=phoenix-hive/target/dependency/curator-framework-2.6.0.jar, phoenix-core/target/surefire-reports/TEST-org.apache.phoenix.query.ParallelIteratorsSplitTest.xml=phoenix-core/target/surefire-reports/TEST-org.apache.phoenix.query.ParallelIteratorsSplitTest.xml, phoenix-core/target/surefire-reports/org.apache.phoenix.compile.QueryMetaDataTest.txt=phoenix-core/target/surefire-reports/org.apache.phoenix.compile.QueryMetaDataTest.txt, phoenix-core/target/surefire-reports/org.apache.phoenix.hbase.index.covered.CoveredColumnsTest.txt=phoenix-core/target/surefire-reports/org.apache.phoenix.hbase.index.covered.CoveredColumnsTest.txt, phoenix-hive/target/dependency/hive-service-1.2.1.jar=phoenix-hive/target/dependency/hive-service-1.2.1.jar, phoenix-hive/target/dependency/twill-common-0.8.0.jar=phoenix-hive/target/dependency/twill-common-0.8.0.jar, phoenix-core/target/surefire-reports/TEST-org.apache.phoenix.compile.SelectStatementRewriterTest.xml=phoenix-core/target/surefire-reports/TEST-org.apache.phoenix.compile.SelectStatementRewriterTest.xml, phoenix-hive/target/hive/hive-localDir-nm-0_2/usercache/jenkins/filecache/33/hive-exec-1.2.1.jar=phoenix-hive/target/hive/hive-localDir-nm-0_2/usercache/jenkins/filecache/33/hive-exec-1.2.1.jar, phoenix-spark/target/surefire-reports/TEST-org.apache.phoenix.spark.AbstractPhoenixSparkIT.xml=phoenix-spark/target/surefire-reports/TEST-org.apache.phoenix.spark.AbstractPhoenixSparkIT.xml, phoenix-flume/target/failsafe-reports/org.apache.phoenix.flume.PhoenixSinkIT.txt=phoenix-flume/target/failsafe-reports/org.apache.phoenix.flume.PhoenixSinkIT.txt, phoenix-hive/target/dependency/twill-discovery-api-0.8.0.jar=phoenix-hive/target/dependency/twill-discovery-api-0.8.0.jar, phoenix-core/target/surefire-reports/TEST-org.apache.phoenix.compile.ScanRangesIntersectTest.xml=phoenix-core/target/surefire-reports/TEST-org.apache.phoenix.compile.ScanRangesIntersectTest.xml, phoenix-core/target/surefire-reports/org.apache.phoenix.util.PhoenixEncodeDecodeTest.txt=phoenix-core/target/surefire-reports/org.apache.phoenix.util.PhoenixEncodeDecodeTest.txt, phoenix-core/target/surefire-reports/TEST-org.apache.phoenix.expression.ExpFunctionTest.xml=phoenix-core/target/surefire-reports/TEST-org.apache.phoenix.expression.ExpFunctionTest.xml, phoenix-core/target/surefire-reports/TEST-org.apache.phoenix.iterate.ConcatResultIteratorTest.xml=phoenix-core/target/surefire-reports/TEST-org.apache.phoenix.iterate.ConcatResultIteratorTest.xml, phoenix-hive/target/phoenix-hive-4.12.0-HBase-1.3-SNAPSHOT-sources.jar=phoenix-hive/target/phoenix-hive-4.12.0-HBase-1.3-SNAPSHOT-sources.jar, phoenix-pig/target/failsafe-reports/org.apache.phoenix.pig.udf.ReserveNSequenceTestIT-output.txt=phoenix-pig/target/failsafe-reports/org.apache.phoenix.pig.udf.ReserveNSequenceTestIT-output.txt, phoenix-core/target/surefire-reports/TEST-org.apache.phoenix.expression.RegexpSubstrFunctionTest.xml=phoenix-core/target/surefire-reports/TEST-org.apache.phoenix.expression.RegexpSubstrFunctionTest.xml, phoenix-load-balancer/target/phoenix-load-balancer-4.12.0-HBase-1.3-SNAPSHOT.jar=phoenix-load-balancer/target/phoenix-load-balancer-4.12.0-HBase-1.3-SNAPSHOT.jar, phoenix-hive/target/failsafe-reports/org.apache.phoenix.hive.HiveMapReduceIT-output.txt=phoenix-hive/target/failsafe-reports/org.apache.phoenix.hive.HiveMapReduceIT-output.txt, phoenix-core/target/surefire-reports/TEST-org.apache.phoenix.expression.NullValueTest.xml=phoenix-core/target/surefire-reports/TEST-org.apache.phoenix.expression.NullValueTest.xml, phoenix-core/target/surefire-reports/TEST-org.apache.phoenix.parse.CastParseNodeTest.xml=phoenix-core/target/surefire-reports/TEST-org.apache.phoenix.parse.CastParseNodeTest.xml, phoenix-core/target/surefire-reports/TEST-org.apache.phoenix.cache.TenantCacheTest.xml=phoenix-core/target/surefire-reports/TEST-org.apache.phoenix.cache.TenantCacheTest.xml, phoenix-hive/target/dependency/netty-3.6.2.Final.jar=phoenix-hive/target/dependency/netty-3.6.2.Final.jar, phoenix-core/target/surefire-reports/TEST-org.apache.phoenix.compile.LimitCompilerTest.xml=phoenix-core/target/surefire-reports/TEST-org.apache.phoenix.compile.LimitCompilerTest.xml, phoenix-core/target/surefire-reports/TEST-org.apache.phoenix.mapreduce.CsvToKeyValueMapperTest.xml=phoenix-core/target/surefire-reports/TEST-org.apache.phoenix.mapreduce.CsvToKeyValueMapperTest.xml, phoenix-pig/target/failsafe-reports/null-output.txt=phoenix-pig/target/failsafe-reports/null-output.txt, phoenix-core/target/surefire-reports/TEST-org.apache.phoenix.util.PhoenixContextExecutorTest.xml=phoenix-core/target/surefire-reports/TEST-org.apache.phoenix.util.PhoenixContextExecutorTest.xml, phoenix-core/target/surefire-reports/TEST-org.apache.phoenix.query.KeyRangeCoalesceTest.xml=phoenix-core/target/surefire-reports/TEST-org.apache.phoenix.query.KeyRangeCoalesceTest.xml, phoenix-core/target/surefire-reports/org.apache.phoenix.expression.ColumnExpressionTest.txt=phoenix-core/target/surefire-reports/org.apache.phoenix.expression.ColumnExpressionTest.txt, phoenix-queryserver/target/surefire-reports/TEST-org.apache.phoenix.queryserver.server.PhoenixDoAsCallbackTest.xml=phoenix-queryserver/target/surefire-reports/TEST-org.apache.phoenix.queryserver.server.PhoenixDoAsCallbackTest.xml, phoenix-core/target/surefire-reports/org.apache.phoenix.expression.ArrayConcatFunctionTest.txt=phoenix-core/target/surefire-reports/org.apache.phoenix.expression.ArrayConcatFunctionTest.txt, phoenix-core/target/surefire-reports/TEST-org.apache.phoenix.mapreduce.index.IndexScrutinyTableOutputTest.xml=phoenix-core/target/surefire-reports/TEST-org.apache.phoenix.mapreduce.index.IndexScrutinyTableOutputTest.xml, phoenix-core/target/surefire-reports/TEST-org.apache.phoenix.mapreduce.util.ColumnInfoToStringEncoderDecoderTest.xml=phoenix-core/target/surefire-reports/TEST-org.apache.phoenix.mapreduce.util.ColumnInfoToStringEncoderDecoderTest.xml, phoenix-core/target/surefire-reports/org.apache.phoenix.index.automated.MRJobSubmitterTest.txt=phoenix-core/target/surefire-reports/org.apache.phoenix.index.automated.MRJobSubmitterTest.txt, phoenix-hive/target/dependency/json-20090211.jar=phoenix-hive/target/dependency/json-20090211.jar, phoenix-core/target/surefire-reports/TEST-org.apache.phoenix.util.MetaDataUtilTest.xml=phoenix-core/target/surefire-reports/TEST-org.apache.phoenix.util.MetaDataUtilTest.xml, phoenix-core/target/surefire-reports/TEST-org.apache.phoenix.hbase.index.covered.data.TestIndexMemStore.xml=phoenix-core/target/surefire-reports/TEST-org.apache.phoenix.hbase.index.covered.data.TestIndexMemStore.xml, phoenix-pherf/target/surefire-reports/org.apache.phoenix.pherf.TestHBaseProps.txt=phoenix-pherf/target/surefire-reports/org.apache.phoenix.pherf.TestHBaseProps.txt, phoenix-hive/target/dependency/tez-mapreduce-0.8.4.jar=phoenix-hive/target/dependency/tez-mapreduce-0.8.4.jar, phoenix-core/target/surefire-reports/org.apache.phoenix.filter.SkipScanFilterTest.txt=phoenix-core/target/surefire-reports/org.apache.phoenix.filter.SkipScanFilterTest.txt, phoenix-core/target/surefire-reports/org.apache.phoenix.util.json.JsonUpsertExecutorTest.txt=phoenix-core/target/surefire-reports/org.apache.phoenix.util.json.JsonUpsertExecutorTest.txt, phoenix-hive/target/dependency/commons-io-2.4.jar=phoenix-hive/target/dependency/commons-io-2.4.jar, phoenix-core/target/surefire-reports/org.apache.phoenix.schema.MutationTest-output.txt=phoenix-core/target/surefire-reports/org.apache.phoenix.schema.MutationTest-output.txt, phoenix-core/target/surefire-reports/org.apache.phoenix.schema.RowKeySchemaTest.txt=phoenix-core/target/surefire-reports/org.apache.phoenix.schema.RowKeySchemaTest.txt, phoenix-pherf/target/surefire-reports/TEST-org.apache.phoenix.pherf.util.ResourceListTest.xml=phoenix-pherf/target/surefire-reports/TEST-org.apache.phoenix.pherf.util.ResourceListTest.xml, phoenix-pig/target/surefire-reports/org.apache.phoenix.pig.util.SqlQueryToColumnInfoFunctionTest.txt=phoenix-pig/target/surefire-reports/org.apache.phoenix.pig.util.SqlQueryToColumnInfoFunctionTest.txt, phoenix-core/target/surefire-reports/org.apache.hadoop.hbase.regionserver.wal.ReadWriteKeyValuesWithCodecTest-output.txt=phoenix-core/target/surefire-reports/org.apache.hadoop.hbase.regionserver.wal.ReadWriteKeyValuesWithCodecTest-output.txt, phoenix-hive/target/dependency/hamcrest-core-1.3.jar=phoenix-hive/target/dependency/hamcrest-core-1.3.jar, phoenix-hive/target/MiniMRCluster_2090392667/MiniMRCluster_2090392667-localDir-nm-0_2/usercache/jenkins/filecache/55/phoenix-4.12.0-HBase-1.3-SNAPSHOT-hive.jar=phoenix-hive/target/MiniMRCluster_2090392667/MiniMRCluster_2090392667-localDir-nm-0_2/usercache/jenkins/filecache/55/phoenix-4.12.0-HBase-1.3-SNAPSHOT-hive.jar, phoenix-core/target/surefire-reports/TEST-org.apache.phoenix.expression.ArrayAppendFunctionTest.xml=phoenix-core/target/surefire-reports/TEST-org.apache.phoenix.expression.ArrayAppendFunctionTest.xml, phoenix-hive/target/MiniMRCluster_2090392667/MiniMRCluster_2090392667-localDir-nm-0_2/usercache/jenkins/filecache/28/hadoop-common-2.7.1.jar=phoenix-hive/target/MiniMRCluster_2090392667/MiniMRCluster_2090392667-localDir-nm-0_2/usercache/jenkins/filecache/28/hadoop-common-2.7.1.jar, phoenix-core/target/surefire-reports/TEST-org.apache.phoenix.iterate.OrderedResultIteratorTest.xml=phoenix-core/target/surefire-reports/TEST-org.apache.phoenix.iterate.OrderedResultIteratorTest.xml, phoenix-flume/target/failsafe-reports/TEST-org.apache.phoenix.flume.RegexEventSerializerIT.xml=phoenix-flume/target/failsafe-reports/TEST-org.apache.phoenix.flume.RegexEventSerializerIT.xml, phoenix-hive/target/hive/hive-localDir-nm-0_2/usercache/jenkins/filecache/13/hadoop-common-2.7.1.jar=phoenix-hive/target/hive/hive-localDir-nm-0_2/usercache/jenkins/filecache/13/hadoop-common-2.7.1.jar, bin/sandbox-log4j.properties=bin/sandbox-log4j.properties, phoenix-core/target/surefire-reports/org.apache.phoenix.expression.SignFunctionTest.txt=phoenix-core/target/surefire-reports/org.apache.phoenix.expression.SignFunctionTest.txt, phoenix-core/target/surefire-reports/TEST-org.apache.phoenix.schema.PMetaDataImplTest.xml=phoenix-core/target/surefire-reports/TEST-org.apache.phoenix.schema.PMetaDataImplTest.xml, phoenix-core/target/surefire-reports/org.apache.phoenix.expression.ILikeExpressionTest.txt=phoenix-core/target/surefire-reports/org.apache.phoenix.expression.ILikeExpressionTest.txt, bin/hadoop-metrics2-hbase.properties=bin/hadoop-metrics2-hbase.properties, phoenix-core/target/surefire-reports/org.apache.phoenix.mapreduce.util.ColumnInfoToStringEncoderDecoderTest.txt=phoenix-core/target/surefire-reports/org.apache.phoenix.mapreduce.util.ColumnInfoToStringEncoderDecoderTest.txt, phoenix-hive/target/hive/hive-localDir-nm-0_3/usercache/jenkins/filecache/26/phoenix-4.12.0-HBase-1.3-SNAPSHOT-hive.jar=phoenix-hive/target/hive/hive-localDir-nm-0_3/usercache/jenkins/filecache/26/phoenix-4.12.0-HBase-1.3-SNAPSHOT-hive.jar, phoenix-hive/target/dependency/hive-serde-1.2.1.jar=phoenix-hive/target/dependency/hive-serde-1.2.1.jar, phoenix-core/target/surefire-reports/org.apache.phoenix.hbase.index.write.TestIndexWriter.txt=phoenix-core/target/surefire-reports/org.apache.phoenix.hbase.index.write.TestIndexWriter.txt, phoenix-queryserver/target/failsafe-reports/org.apache.phoenix.end2end.QueryServerBasicsIT-output.txt=phoenix-queryserver/target/failsafe-reports/org.apache.phoenix.end2end.QueryServerBasicsIT-output.txt, phoenix-core/target/surefire-reports/TEST-org.apache.phoenix.compile.WhereOptimizerTest.xml=phoenix-core/target/surefire-reports/TEST-org.apache.phoenix.compile.WhereOptimizerTest.xml, phoenix-core/target/surefire-reports/TEST-org.apache.phoenix.hbase.index.util.TestIndexManagementUtil.xml=phoenix-core/target/surefire-reports/TEST-org.apache.phoenix.hbase.index.util.TestIndexManagementUtil.xml, phoenix-tracing-webapp/target/phoenix-tracing-webapp-4.12.0-HBase-1.3-SNAPSHOT-tests.jar=phoenix-tracing-webapp/target/phoenix-tracing-webapp-4.12.0-HBase-1.3-SNAPSHOT-tests.jar, phoenix-pherf/target/surefire-reports/org.apache.phoenix.pherf.PherfTest.txt=phoenix-pherf/target/surefire-reports/org.apache.phoenix.pherf.PherfTest.txt, phoenix-core/target/surefire-reports/org.apache.phoenix.execute.MutationStateTest.txt=phoenix-core/target/surefire-reports/org.apache.phoenix.execute.MutationStateTest.txt, phoenix-hive/target/dependency/hadoop-auth-2.7.1.jar=phoenix-hive/target/dependency/hadoop-auth-2.7.1.jar, phoenix-hive/target/dependency/geronimo-jta_1.1_spec-1.1.1.jar=phoenix-hive/target/dependency/geronimo-jta_1.1_spec-1.1.1.jar, phoenix-core/target/surefire-reports/TEST-org.apache.phoenix.util.csv.CsvUpsertExecutorTest.xml=phoenix-core/target/surefire-reports/TEST-org.apache.phoenix.util.csv.CsvUpsertExecutorTest.xml, phoenix-hive/target/dependency/commons-dbcp-1.4.jar=phoenix-hive/target/dependency/commons-dbcp-1.4.jar, phoenix-hive/target/hive/hive-localDir-nm-0_0/usercache/jenkins/filecache/15/hive-exec-1.2.1.jar=phoenix-hive/target/hive/hive-localDir-nm-0_0/usercache/jenkins/filecache/15/hive-exec-1.2.1.jar, phoenix-hive/target/hive/hive-localDir-nm-0_0/usercache/jenkins/filecache/23/phoenix-4.12.0-HBase-1.3-SNAPSHOT-hive.jar=phoenix-hive/target/hive/hive-localDir-nm-0_0/usercache/jenkins/filecache/23/phoenix-4.12.0-HBase-1.3-SNAPSHOT-hive.jar, phoenix-hive/target/MiniMRCluster_2090392667/MiniMRCluster_2090392667-localDir-nm-0_0/usercache/jenkins/filecache/32/hadoop-common-2.7.1.jar=phoenix-hive/target/MiniMRCluster_2090392667/MiniMRCluster_2090392667-localDir-nm-0_0/usercache/jenkins/filecache/32/hadoop-common-2.7.1.jar, phoenix-core/target/surefire-reports/org.apache.phoenix.compile.HavingCompilerTest-output.txt=phoenix-core/target/surefire-reports/org.apache.phoenix.compile.HavingCompilerTest-output.txt, phoenix-core/target/surefire-reports/org.apache.phoenix.query.ParallelIteratorsSplitTest-output.txt=phoenix-core/target/surefire-reports/org.apache.phoenix.query.ParallelIteratorsSplitTest-output.txt, phoenix-hive/target/dependency/apacheds-kerberos-codec-2.0.0-M15.jar=phoenix-hive/target/dependency/apacheds-kerberos-codec-2.0.0-M15.jar, phoenix-hive/target/dependency/disruptor-3.3.0.jar=phoenix-hive/target/dependency/disruptor-3.3.0.jar, phoenix-hive/target/dependency/hadoop-hdfs-2.7.1.jar=phoenix-hive/target/dependency/hadoop-hdfs-2.7.1.jar, phoenix-kafka/target/failsafe-reports/org.apache.phoenix.kafka.PhoenixConsumerIT.txt=phoenix-kafka/target/failsafe-reports/org.apache.phoenix.kafka.PhoenixConsumerIT.txt, phoenix-pherf/target/surefire-reports/TEST-org.apache.phoenix.pherf.ResultTest.xml=phoenix-pherf/target/surefire-reports/TEST-org.apache.phoenix.pherf.ResultTest.xml, phoenix-core/target/surefire-reports/org.apache.phoenix.compile.SelectStatementRewriterTest.txt=phoenix-core/target/surefire-reports/org.apache.phoenix.compile.SelectStatementRewriterTest.txt, phoenix-queryserver/target/failsafe-reports/null-output.txt=phoenix-queryserver/target/failsafe-reports/null-output.txt, phoenix-hive/target/dependency/commons-daemon-1.0.13.jar=phoenix-hive/target/dependency/commons-daemon-1.0.13.jar, phoenix-pherf/target/failsafe-reports/TEST-org.apache.phoenix.pherf.DataIngestIT.xml=phoenix-pherf/target/failsafe-reports/TEST-org.apache.phoenix.pherf.DataIngestIT.xml, phoenix-core/target/surefire-reports/org.apache.phoenix.util.csv.StringToArrayConverterTest-output.txt=phoenix-core/target/surefire-reports/org.apache.phoenix.util.csv.StringToArrayConverterTest-output.txt, phoenix-pig/target/surefire-reports/org.apache.phoenix.pig.util.QuerySchemaParserFunctionTest.txt=phoenix-pig/target/surefire-reports/org.apache.phoenix.pig.util.QuerySchemaParserFunctionTest.txt, phoenix-tracing-webapp/src/main/config/checkstyle/header.txt=phoenix-tracing-webapp/src/main/config/checkstyle/header.txt, phoenix-hive/target/dependency/ant-launcher-1.9.1.jar=phoenix-hive/target/dependency/ant-launcher-1.9.1.jar, phoenix-core/target/surefire-reports/TEST-org.apache.phoenix.expression.SignFunctionTest.xml=phoenix-core/target/surefire-reports/TEST-org.apache.phoenix.expression.SignFunctionTest.xml, phoenix-hive/target/hive/hive-localDir-nm-0_0/usercache/jenkins/filecache/29/phoenix-4.12.0-HBase-1.3-SNAPSHOT-hive.jar=phoenix-hive/target/hive/hive-localDir-nm-0_0/usercache/jenkins/filecache/29/phoenix-4.12.0-HBase-1.3-SNAPSHOT-hive.jar, phoenix-core/target/surefire-reports/org.apache.phoenix.jdbc.PhoenixPreparedStatementTest.txt=phoenix-core/target/surefire-reports/org.apache.phoenix.jdbc.PhoenixPreparedStatementTest.txt, phoenix-hive/target/failsafe-reports/org.apache.phoenix.hive.HiveMapReduceIT.txt=phoenix-hive/target/failsafe-reports/org.apache.phoenix.hive.HiveMapReduceIT.txt, phoenix-core/target/surefire-reports/TEST-org.apache.phoenix.util.LikeExpressionTest.xml=phoenix-core/target/surefire-reports/TEST-org.apache.phoenix.util.LikeExpressionTest.xml, phoenix-core/target/surefire-reports/org.apache.phoenix.compile.WhereOptimizerTest.txt=phoenix-core/target/surefire-reports/org.apache.phoenix.compile.WhereOptimizerTest.txt, phoenix-hive/target/failsafe-reports/org.apache.phoenix.hive.HiveTezIT-output.txt=phoenix-hive/target/failsafe-reports/org.apache.phoenix.hive.HiveTezIT-output.txt, phoenix-core/target/surefire-reports/org.apache.phoenix.expression.ExpFunctionTest.txt=phoenix-core/target/surefire-reports/org.apache.phoenix.expression.ExpFunctionTest.txt, phoenix-hive/target/dependency/guice-3.0.jar=phoenix-hive/target/dependency/guice-3.0.jar, phoenix-hive/target/dependency/jsr305-2.0.1.jar=phoenix-hive/target/dependency/jsr305-2.0.1.jar, phoenix-pherf/target/failsafe-reports/org.apache.phoenix.pherf.DataIngestIT-output.txt=phoenix-pherf/target/failsafe-reports/org.apache.phoenix.pherf.DataIngestIT-output.txt, phoenix-queryserver/target/failsafe-reports/TEST-org.apache.phoenix.end2end.SecureQueryServerIT.xml=phoenix-queryserver/target/failsafe-reports/TEST-org.apache.phoenix.end2end.SecureQueryServerIT.xml, phoenix-core/target/surefire-reports/TEST-org.apache.phoenix.compile.QueryCompilerTest.xml=phoenix-core/target/surefire-reports/TEST-org.apache.phoenix.compile.QueryCompilerTest.xml, phoenix-core/target/surefire-reports/org.apache.phoenix.compile.LimitCompilerTest-output.txt=phoenix-core/target/surefire-reports/org.apache.phoenix.compile.LimitCompilerTest-output.txt, phoenix-core/target/surefire-reports/org.apache.phoenix.hbase.index.write.TestParalleWriterIndexCommitter.txt=phoenix-core/target/surefire-reports/org.apache.phoenix.hbase.index.write.TestParalleWriterIndexCommitter.txt, phoenix-hive/target/hive/hive-localDir-nm-0_0/usercache/jenkins/filecache/27/hive-exec-1.2.1.jar=phoenix-hive/target/hive/hive-localDir-nm-0_0/usercache/jenkins/filecache/27/hive-exec-1.2.1.jar, phoenix-core/target/surefire-reports/TEST-org.apache.phoenix.cache.JodaTimezoneCacheTest.xml=phoenix-core/target/surefire-reports/TEST-org.apache.phoenix.cache.JodaTimezoneCacheTest.xml, phoenix-pherf/target/failsafe-reports/org.apache.phoenix.pherf.PherfMainIT-output.txt=phoenix-pherf/target/failsafe-reports/org.apache.phoenix.pherf.PherfMainIT-output.txt, phoenix-hive/target/dependency/commons-el-1.0.jar=phoenix-hive/target/dependency/commons-el-1.0.jar, phoenix-hive/target/MiniMRCluster_2090392667/MiniMRCluster_2090392667-localDir-nm-0_0/usercache/jenkins/filecache/26/phoenix-4.12.0-HBase-1.3-SNAPSHOT-hive.jar=phoenix-hive/target/MiniMRCluster_2090392667/MiniMRCluster_2090392667-localDir-nm-0_0/usercache/jenkins/filecache/26/phoenix-4.12.0-HBase-1.3-SNAPSHOT-hive.jar, phoenix-hive/target/dependency/jaxb-impl-2.2.3-1.jar=phoenix-hive/target/dependency/jaxb-impl-2.2.3-1.jar, phoenix-hive/target/hive/hive-localDir-nm-0_3/usercache/jenkins/filecache/19/hadoop-common-2.7.1.jar=phoenix-hive/target/hive/hive-localDir-nm-0_3/usercache/jenkins/filecache/19/hadoop-common-2.7.1.jar, phoenix-core/target/surefire-reports/org.apache.phoenix.query.ScannerLeaseRenewalTest.txt=phoenix-core/target/surefire-reports/org.apache.phoenix.query.ScannerLeaseRenewalTest.txt, phoenix-pherf/target/surefire-reports/TEST-org.apache.phoenix.pherf.ColumnTest.xml=phoenix-pherf/target/surefire-reports/TEST-org.apache.phoenix.pherf.ColumnTest.xml, phoenix-core/target/surefire-reports/org.apache.phoenix.util.DateUtilTest.txt=phoenix-core/target/surefire-reports/org.apache.phoenix.util.DateUtilTest.txt, phoenix-pig/target/surefire-reports/org.apache.phoenix.pig.util.PhoenixPigSchemaUtilTest.txt=phoenix-pig/target/surefire-reports/org.apache.phoenix.pig.util.PhoenixPigSchemaUtilTest.txt, phoenix-core/target/surefire-reports/org.apache.phoenix.index.IndexMaintainerTest-output.txt=phoenix-core/target/surefire-reports/org.apache.phoenix.index.IndexMaintainerTest-output.txt, phoenix-core/target/surefire-reports/org.apache.phoenix.query.OrderByTest.txt=phoenix-core/target/surefire-reports/org.apache.phoenix.query.OrderByTest.txt, bin/psql.py=bin/psql.py, phoenix-pig/target/phoenix-pig-4.12.0-HBase-1.3-SNAPSHOT-tests.jar=phoenix-pig/target/phoenix-pig-4.12.0-HBase-1.3-SNAPSHOT-tests.jar, phoenix-core/target/surefire-reports/org.apache.phoenix.compile.WhereOptimizerTest-output.txt=phoenix-core/target/surefire-reports/org.apache.phoenix.compile.WhereOptimizerTest-output.txt, phoenix-hive/target/MiniMRCluster_2090392667/MiniMRCluster_2090392667-localDir-nm-0_0/usercache/jenkins/filecache/24/hadoop-common-2.7.1.jar=phoenix-hive/target/MiniMRCluster_2090392667/MiniMRCluster_2090392667-localDir-nm-0_0/usercache/jenkins/filecache/24/hadoop-common-2.7.1.jar, phoenix-hive/target/dependency/xml-apis-1.3.04.jar=phoenix-hive/target/dependency/xml-apis-1.3.04.jar, phoenix-core/target/surefire-reports/TEST-org.apache.phoenix.parse.QueryParserTest.xml=phoenix-core/target/surefire-reports/TEST-org.apache.phoenix.parse.QueryParserTest.xml, phoenix-core/target/surefire-reports/TEST-org.apache.phoenix.query.PropertyPolicyProviderTest.xml=phoenix-core/target/surefire-reports/TEST-org.apache.phoenix.query.PropertyPolicyProviderTest.xml, phoenix-core/target/surefire-reports/org.apache.phoenix.schema.ImmutableStorageSchemeTest.txt=phoenix-core/target/surefire-reports/org.apache.phoenix.schema.ImmutableStorageSchemeTest.txt, phoenix-hive/target/dependency/paranamer-2.3.jar=phoenix-hive/target/dependency/paranamer-2.3.jar, phoenix-hive/target/dependency/tez-runtime-library-0.8.4.jar=phoenix-hive/target/dependency/tez-runtime-library-0.8.4.jar, phoenix-pherf/target/surefire-reports/org.apache.phoenix.pherf.util.ResourceListTest.txt=phoenix-pherf/target/surefire-reports/org.apache.phoenix.pherf.util.ResourceListTest.txt, phoenix-pherf/target/surefire-reports/TEST-org.apache.phoenix.pherf.ResourceTest.xml=phoenix-pherf/target/surefire-reports/TEST-org.apache.phoenix.pherf.ResourceTest.xml, phoenix-core/target/surefire-reports/org.apache.phoenix.schema.types.PrimitiveShortPhoenixArrayToStringTest.txt=phoenix-core/target/surefire-reports/org.apache.phoenix.schema.types.PrimitiveShortPhoenixArrayToStringTest.txt, phoenix-hive/target/MiniMRCluster_2090392667/MiniMRCluster_2090392667-localDir-nm-0_0/usercache/jenkins/filecache/49/hadoop-common-2.7.1.jar=phoenix-hive/target/MiniMRCluster_2090392667/MiniMRCluster_2090392667-localDir-nm-0_0/usercache/jenkins/filecache/49/hadoop-common-2.7.1.jar, phoenix-core/target/surefire-reports/TEST-org.apache.phoenix.hbase.index.covered.TestCoveredColumnIndexCodec.xml=phoenix-core/target/surefire-reports/TEST-org.apache.phoenix.hbase.index.covered.TestCoveredColumnIndexCodec.xml, phoenix-core/target/surefire-reports/org.apache.phoenix.util.IndexUtilTest.txt=phoenix-core/target/surefire-reports/org.apache.phoenix.util.IndexUtilTest.txt, phoenix-hive/target/MiniMRCluster_2090392667/MiniMRCluster_2090392667-localDir-nm-0_3/usercache/jenkins/filecache/31/hive-exec-1.2.1.jar=phoenix-hive/target/MiniMRCluster_2090392667/MiniMRCluster_2090392667-localDir-nm-0_3/usercache/jenkins/filecache/31/hive-exec-1.2.1.jar, phoenix-core/target/surefire-reports/org.apache.phoenix.compile.StatementHintsCompilationTest-output.txt=phoenix-core/target/surefire-reports/org.apache.phoenix.compile.StatementHintsCompilationTest-output.txt, phoenix-core/target/surefire-reports/org.apache.phoenix.expression.LikeExpressionTest.txt=phoenix-core/target/surefire-reports/org.apache.phoenix.expression.LikeExpressionTest.txt, phoenix-hive/target/MiniMRCluster_2090392667/MiniMRCluster_2090392667-localDir-nm-0_2/usercache/jenkins/filecache/30/phoenix-4.12.0-HBase-1.3-SNAPSHOT-hive.jar=phoenix-hive/target/MiniMRCluster_2090392667/MiniMRCluster_2090392667-localDir-nm-0_2/usercache/jenkins/filecache/30/phoenix-4.12.0-HBase-1.3-SNAPSHOT-hive.jar, phoenix-core/target/surefire-reports/org.apache.hadoop.hbase.ipc.PhoenixIndexRpcSchedulerTest-output.txt=phoenix-core/target/surefire-reports/org.apache.hadoop.hbase.ipc.PhoenixIndexRpcSchedulerTest-output.txt, phoenix-core/target/surefire-reports/org.apache.phoenix.jdbc.PhoenixResultSetMetadataTest.txt=phoenix-core/target/surefire-reports/org.apache.phoenix.jdbc.PhoenixResultSetMetadataTest.txt, phoenix-hive/target/dependency/commons-math-2.2.jar=phoenix-hive/target/dependency/commons-math-2.2.jar, phoenix-hive/target/MiniMRCluster_2090392667/MiniMRCluster_2090392667-localDir-nm-0_1/usercache/jenkins/filecache/58/hadoop-common-2.7.1.jar=phoenix-hive/target/MiniMRCluster_2090392667/MiniMRCluster_2090392667-localDir-nm-0_1/usercache/jenkins/filecache/58/hadoop-common-2.7.1.jar, phoenix-core/target/surefire-reports/org.apache.phoenix.hbase.index.write.TestParalleIndexWriter-output.txt=phoenix-core/target/surefire-reports/org.apache.phoenix.hbase.index.write.TestParalleIndexWriter-output.txt, phoenix-hive/target/dependency/commons-cli-1.2.jar=phoenix-hive/target/dependency/commons-cli-1.2.jar, phoenix-hive/target/dependency/hadoop-yarn-server-nodemanager-2.7.1.jar=phoenix-hive/target/dependency/hadoop-yarn-server-nodemanager-2.7.1.jar, phoenix-queryserver-client/target/phoenix-queryserver-client-4.12.0-HBase-1.3-SNAPSHOT-sources.jar=phoenix-queryserver-client/target/phoenix-queryserver-client-4.12.0-HBase-1.3-SNAPSHOT-sources.jar, phoenix-hive/target/dependency/commons-digester-1.8.jar=phoenix-hive/target/dependency/commons-digester-1.8.jar, phoenix-core/target/surefire-reports/org.apache.phoenix.util.QueryUtilTest.txt=phoenix-core/target/surefire-reports/org.apache.phoenix.util.QueryUtilTest.txt, phoenix-hive/target/dependency/datanucleus-core-3.2.10.jar=phoenix-hive/target/dependency/datanucleus-core-3.2.10.jar, phoenix-queryserver-client/target/phoenix-4.12.0-HBase-1.3-SNAPSHOT-thin-client.jar=phoenix-queryserver-client/target/phoenix-4.12.0-HBase-1.3-SNAPSHOT-thin-client.jar, phoenix-core/target/surefire-reports/org.apache.phoenix.compile.CreateTableCompilerTest.txt=phoenix-core/target/surefire-reports/org.apache.phoenix.compile.CreateTableCompilerTest.txt, phoenix-pherf/target/surefire-reports/org.apache.phoenix.pherf.RuleGeneratorTest-output.txt=phoenix-pherf/target/surefire-reports/org.apache.phoenix.pherf.RuleGeneratorTest-output.txt, phoenix-hive/target/MiniMRCluster_2090392667/MiniMRCluster_2090392667-localDir-nm-0_1/usercache/jenkins/filecache/20/hadoop-common-2.7.1.jar=phoenix-hive/target/MiniMRCluster_2090392667/MiniMRCluster_2090392667-localDir-nm-0_1/usercache/jenkins/filecache/20/hadoop-common-2.7.1.jar, phoenix-queryserver/target/failsafe-reports/TEST-org.apache.phoenix.end2end.HttpParamImpersonationQueryServerIT.xml=phoenix-queryserver/target/failsafe-reports/TEST-org.apache.phoenix.end2end.HttpParamImpersonationQueryServerIT.xml, phoenix-core/target/surefire-reports/TEST-org.apache.phoenix.iterate.SpoolingResultIteratorTest.xml=phoenix-core/target/surefire-reports/TEST-org.apache.phoenix.iterate.SpoolingResultIteratorTest.xml, phoenix-hive/target/MiniMRCluster_2090392667/MiniMRCluster_2090392667-localDir-nm-0_3/usercache/jenkins/filecache/45/hadoop-common-2.7.1.jar=phoenix-hive/target/MiniMRCluster_2090392667/MiniMRCluster_2090392667-localDir-nm-0_3/usercache/jenkins/filecache/45/hadoop-common-2.7.1.jar, phoenix-core/target/surefire-reports/org.apache.phoenix.schema.types.PrimitiveDoublePhoenixArrayToStringTest.txt=phoenix-core/target/surefire-reports/org.apache.phoenix.schema.types.PrimitiveDoublePhoenixArrayToStringTest.txt, phoenix-hive/target/dependency/tez-runtime-internals-0.8.4.jar=phoenix-hive/target/dependency/tez-runtime-internals-0.8.4.jar, phoenix-hive/target/dependency/libfb303-0.9.2.jar=phoenix-hive/target/dependency/libfb303-0.9.2.jar, phoenix-hive/target/dependency/datanucleus-api-jdo-3.2.6.jar=phoenix-hive/target/dependency/datanucleus-api-jdo-3.2.6.jar, phoenix-hive/target/hive/hive-localDir-nm-0_1/usercache/jenkins/filecache/38/phoenix-4.12.0-HBase-1.3-SNAPSHOT-hive.jar=phoenix-hive/target/hive/hive-localDir-nm-0_1/usercache/jenkins/filecache/38/phoenix-4.12.0-HBase-1.3-SNAPSHOT-hive.jar, phoenix-pherf/target/surefire-reports/TEST-org.apache.phoenix.pherf.XMLConfigParserTest.xml=phoenix-pherf/target/surefire-reports/TEST-org.apache.phoenix.pherf.XMLConfigParserTest.xml, phoenix-hive/target/hive/hive-localDir-nm-0_0/usercache/jenkins/filecache/43/hadoop-common-2.7.1.jar=phoenix-hive/target/hive/hive-localDir-nm-0_0/usercache/jenkins/filecache/43/hadoop-common-2.7.1.jar, phoenix-core/target/surefire-reports/TEST-org.apache.phoenix.schema.SortOrderTest.xml=phoenix-core/target/surefire-reports/TEST-org.apache.phoenix.schema.SortOrderTest.xml, phoenix-hive/target/dependency/jta-1.1.jar=phoenix-hive/target/dependency/jta-1.1.jar, phoenix-tracing-webapp/target/phoenix-tracing-webapp-4.12.0-HBase-1.3-SNAPSHOT-runnable.jar=phoenix-tracing-webapp/target/phoenix-tracing-webapp-4.12.0-HBase-1.3-SNAPSHOT-runnable.jar, phoenix-hive/target/dependency/groovy-all-2.1.6.jar=phoenix-hive/target/dependency/groovy-all-2.1.6.jar, phoenix-core/target/surefire-reports/TEST-org.apache.phoenix.util.SequenceUtilTest.xml=phoenix-core/target/surefire-reports/TEST-org.apache.phoenix.util.SequenceUtilTest.xml, phoenix-flume/target/failsafe-reports/org.apache.phoenix.flume.JsonEventSerializerIT-output.txt=phoenix-flume/target/failsafe-reports/org.apache.phoenix.flume.JsonEventSerializerIT-output.txt, phoenix-core/target/surefire-reports/org.apache.phoenix.cache.JodaTimezoneCacheTest.txt=phoenix-core/target/surefire-reports/org.apache.phoenix.cache.JodaTimezoneCacheTest.txt, phoenix-core/target/surefire-reports/org.apache.phoenix.compile.WhereCompilerTest.txt=phoenix-core/target/surefire-reports/org.apache.phoenix.compile.WhereCompilerTest.txt, phoenix-core/target/surefire-reports/org.apache.phoenix.expression.RegexpReplaceFunctionTest.txt=phoenix-core/target/surefire-reports/org.apache.phoenix.expression.RegexpReplaceFunctionTest.txt, phoenix-core/target/surefire-reports/TEST-org.apache.phoenix.jdbc.PhoenixDriverTest.xml=phoenix-core/target/surefire-reports/TEST-org.apache.phoenix.jdbc.PhoenixDriverTest.xml, phoenix-core/target/surefire-reports/TEST-org.apache.phoenix.util.PhoenixRuntimeTest.xml=phoenix-core/target/surefire-reports/TEST-org.apache.phoenix.util.PhoenixRuntimeTest.xml, bin/pherf-standalone.py=bin/pherf-standalone.py, phoenix-core/target/surefire-reports/TEST-org.apache.phoenix.query.OrderByTest.xml=phoenix-core/target/surefire-reports/TEST-org.apache.phoenix.query.OrderByTest.xml, phoenix-core/target/surefire-reports/TEST-org.apache.phoenix.compile.QueryMetaDataTest.xml=phoenix-core/target/surefire-reports/TEST-org.apache.phoenix.compile.QueryMetaDataTest.xml, phoenix-hive/target/dependency/hbase-protocol-1.3.1.jar=phoenix-hive/target/dependency/hbase-protocol-1.3.1.jar, phoenix-hive/target/phoenix-hive-4.12.0-HBase-1.3-SNAPSHOT-tests.jar=phoenix-hive/target/phoenix-hive-4.12.0-HBase-1.3-SNAPSHOT-tests.jar, phoenix-core/target/surefire-reports/org.apache.phoenix.schema.types.PrimitiveBooleanPhoenixArrayToStringTest.txt=phoenix-core/target/surefire-reports/org.apache.phoenix.schema.types.PrimitiveBooleanPhoenixArrayToStringTest.txt, phoenix-hive/target/dependency/hadoop-yarn-common-2.7.1.jar=phoenix-hive/target/dependency/hadoop-yarn-common-2.7.1.jar, phoenix-core/target/surefire-reports/TEST-org.apache.phoenix.expression.ArrayFillFunctionTest.xml=phoenix-core/target/surefire-reports/TEST-org.apache.phoenix.expression.ArrayFillFunctionTest.xml, phoenix-hive/target/dependency/guava-13.0.1.jar=phoenix-hive/target/dependency/guava-13.0.1.jar, phoenix-hive/target/dependency/curator-recipes-2.7.1.jar=phoenix-hive/target/dependency/curator-recipes-2.7.1.jar, phoenix-core/target/surefire-reports/TEST-org.apache.phoenix.expression.LikeExpressionTest.xml=phoenix-core/target/surefire-reports/TEST-org.apache.phoenix.expression.LikeExpressionTest.xml, phoenix-core/target/surefire-reports/org.apache.phoenix.util.ByteUtilTest.txt=phoenix-core/target/surefire-reports/org.apache.phoenix.util.ByteUtilTest.txt, phoenix-core/target/surefire-reports/TEST-org.apache.phoenix.compile.QueryOptimizerTest.xml=phoenix-core/target/surefire-reports/TEST-org.apache.phoenix.compile.QueryOptimizerTest.xml, phoenix-pig/target/surefire-reports/org.apache.phoenix.pig.util.SqlQueryToColumnInfoFunctionTest-output.txt=phoenix-pig/target/surefire-reports/org.apache.phoenix.pig.util.SqlQueryToColumnInfoFunctionTest-output.txt, phoenix-kafka/target/phoenix-kafka-4.12.0-HBase-1.3-SNAPSHOT.jar=phoenix-kafka/target/phoenix-kafka-4.12.0-HBase-1.3-SNAPSHOT.jar, phoenix-pherf/target/phoenix-pherf-4.12.0-HBase-1.3-SNAPSHOT-sources.jar=phoenix-pherf/target/phoenix-pherf-4.12.0-HBase-1.3-SNAPSHOT-sources.jar, phoenix-pig/target/failsafe-reports/org.apache.phoenix.pig.PhoenixHBaseLoaderIT-output.txt=phoenix-pig/target/failsafe-reports/org.apache.phoenix.pig.PhoenixHBaseLoaderIT-output.txt, phoenix-core/target/surefire-reports/TEST-org.apache.phoenix.query.QueryPlanTest.xml=phoenix-core/target/surefire-reports/TEST-org.apache.phoenix.query.QueryPlanTest.xml, phoenix-hive/target/dependency/tez-tests-0.8.4-tests.jar=phoenix-hive/target/dependency/tez-tests-0.8.4-tests.jar, phoenix-core/target/surefire-reports/TEST-org.apache.phoenix.util.PrefixByteEncoderDecoderTest.xml=phoenix-core/target/surefire-reports/TEST-org.apache.phoenix.util.PrefixByteEncoderDecoderTest.xml, phoenix-core/target/surefire-reports/org.apache.phoenix.util.TenantIdByteConversionTest.txt=phoenix-core/target/surefire-reports/org.apache.phoenix.util.TenantIdByteConversionTest.txt, phoenix-core/target/surefire-reports/TEST-org.apache.phoenix.filter.DistinctPrefixFilterTest.xml=phoenix-core/target/surefire-reports/TEST-org.apache.phoenix.filter.DistinctPrefixFilterTest.xml, phoenix-hive/target/dependency/jettison-1.3.4.jar=phoenix-hive/target/dependency/jettison-1.3.4.jar, phoenix-hive/target/dependency/stax-api-1.0.1.jar=phoenix-hive/target/dependency/stax-api-1.0.1.jar, phoenix-core/target/surefire-reports/TEST-org.apache.phoenix.hbase.index.write.TestParalleIndexWriter.xml=phoenix-core/target/surefire-reports/TEST-org.apache.phoenix.hbase.index.write.TestParalleIndexWriter.xml, phoenix-core/target/surefire-reports/org.apache.hadoop.hbase.regionserver.PhoenixRpcSchedulerFactoryTest.txt=phoenix-core/target/surefire-reports/org.apache.hadoop.hbase.regionserver.PhoenixRpcSchedulerFactoryTest.txt, phoenix-core/target/surefire-reports/org.apache.phoenix.parse.QueryParserTest.txt=phoenix-core/target/surefire-reports/org.apache.phoenix.parse.QueryParserTest.txt, phoenix-core/target/surefire-reports/org.apache.phoenix.util.ColumnInfoTest.txt=phoenix-core/target/surefire-reports/org.apache.phoenix.util.ColumnInfoTest.txt, phoenix-hive/target/dependency/async-http-client-1.8.16.jar=phoenix-hive/target/dependency/async-http-client-1.8.16.jar, phoenix-core/target/surefire-reports/org.apache.phoenix.iterate.AggregateResultScannerTest-output.txt=phoenix-core/target/surefire-reports/org.apache.phoenix.iterate.AggregateResultScannerTest-output.txt, phoenix-hive/target/dependency/slf4j-api-1.6.4.jar=phoenix-hive/target/dependency/slf4j-api-1.6.4.jar, phoenix-hive/target/dependency/metrics-core-2.2.0.jar=phoenix-hive/target/dependency/metrics-core-2.2.0.jar, phoenix-hive/target/dependency/jasper-runtime-5.5.23.jar=phoenix-hive/target/dependency/jasper-runtime-5.5.23.jar, phoenix-hive/target/dependency/hbase-annotations-1.3.1-tests.jar=phoenix-hive/target/dependency/hbase-annotations-1.3.1-tests.jar, phoenix-pig/target/surefire-reports/TEST-org.apache.phoenix.pig.util.QuerySchemaParserFunctionTest.xml=phoenix-pig/target/surefire-reports/TEST-org.apache.phoenix.pig.util.QuerySchemaParserFunctionTest.xml, phoenix-queryserver/target/phoenix-queryserver-4.12.0-HBase-1.3-SNAPSHOT.jar=phoenix-queryserver/target/phoenix-queryserver-4.12.0-HBase-1.3-SNAPSHOT.jar, phoenix-hive/target/hive/hive-localDir-nm-0_1/usercache/jenkins/filecache/10/hive-exec-1.2.1-2764920d33df644f65840a0e65da33410ffd195149817ff58853ea508015bb92.jar=phoenix-hive/target/hive/hive-localDir-nm-0_1/usercache/jenkins/filecache/10/hive-exec-1.2.1-2764920d33df644f65840a0e65da33410ffd195149817ff58853ea508015bb92.jar, phoenix-hive/target/dependency/hadoop-yarn-server-tests-2.7.1-tests.jar=phoenix-hive/target/dependency/hadoop-yarn-server-tests-2.7.1-tests.jar, phoenix-hive/target/MiniMRCluster_2090392667/MiniMRCluster_2090392667-localDir-nm-0_3/usercache/jenkins/filecache/51/phoenix-4.12.0-HBase-1.3-SNAPSHOT-hive.jar=phoenix-hive/target/MiniMRCluster_2090392667/MiniMRCluster_2090392667-localDir-nm-0_3/usercache/jenkins/filecache/51/phoenix-4.12.0-HBase-1.3-SNAPSHOT-hive.jar, phoenix-core/target/surefire-reports/org.apache.phoenix.hbase.index.write.TestParalleIndexWriter.txt=phoenix-core/target/surefire-reports/org.apache.phoenix.hbase.index.write.TestParalleIndexWriter.txt, phoenix-pherf/target/surefire-reports/org.apache.phoenix.pherf.XMLConfigParserTest.txt=phoenix-pherf/target/surefire-reports/org.apache.phoenix.pherf.XMLConfigParserTest.txt, phoenix-core/target/surefire-reports/org.apache.phoenix.hbase.index.covered.data.TestIndexMemStore.txt=phoenix-core/target/surefire-reports/org.apache.phoenix.hbase.index.covered.data.TestIndexMemStore.txt, phoenix-core/target/surefire-reports/org.apache.phoenix.jdbc.PhoenixEmbeddedDriverTest.txt=phoenix-core/target/surefire-reports/org.apache.phoenix.jdbc.PhoenixEmbeddedDriverTest.txt, phoenix-hive/target/hive/hive-localDir-nm-0_3/usercache/jenkins/filecache/34/hadoop-common-2.7.1.jar=phoenix-hive/target/hive/hive-localDir-nm-0_3/usercache/jenkins/filecache/34/hadoop-common-2.7.1.jar, phoenix-hive/target/dependency/pentaho-aggdesigner-algorithm-5.1.5-jhyde.jar=phoenix-hive/target/dependency/pentaho-aggdesigner-algorithm-5.1.5-jhyde.jar, phoenix-core/target/surefire-reports/org.apache.phoenix.iterate.RowKeyOrderedAggregateResultIteratorTest-output.txt=phoenix-core/target/surefire-reports/org.apache.phoenix.iterate.RowKeyOrderedAggregateResultIteratorTest-output.txt, phoenix-pherf/target/surefire-reports/org.apache.phoenix.pherf.ColumnTest.txt=phoenix-pherf/target/surefire-reports/org.apache.phoenix.pherf.ColumnTest.txt, phoenix-core/target/surefire-reports/org.apache.phoenix.util.QualifierEncodingSchemeTest.txt=phoenix-core/target/surefire-reports/org.apache.phoenix.util.QualifierEncodingSchemeTest.txt, phoenix-flume/target/failsafe-reports/TEST-org.apache.phoenix.flume.JsonEventSerializerIT.xml=phoenix-flume/target/failsafe-reports/TEST-org.apache.phoenix.flume.JsonEventSerializerIT.xml, phoenix-hive/target/dependency/javax.inject-1.jar=phoenix-hive/target/dependency/javax.inject-1.jar, phoenix-hive/target/dependency/calcite-linq4j-1.2.0-incubating.jar=phoenix-hive/target/dependency/calcite-linq4j-1.2.0-incubating.jar, phoenix-core/target/surefire-reports/org.apache.phoenix.jdbc.SecureUserConnectionsTest-output.txt=phoenix-core/target/surefire-reports/org.apache.phoenix.jdbc.SecureUserConnectionsTest-output.txt, phoenix-hive/target/dependency/jersey-server-1.9.jar=phoenix-hive/target/dependency/jersey-server-1.9.jar, phoenix-core/target/surefire-reports/TEST-org.apache.phoenix.iterate.RowKeyOrderedAggregateResultIteratorTest.xml=phoenix-core/target/surefire-reports/TEST-org.apache.phoenix.iterate.RowKeyOrderedAggregateResultIteratorTest.xml, phoenix-core/target/surefire-reports/TEST-org.apache.phoenix.expression.RegexpSplitFunctionTest.xml=phoenix-core/target/surefire-reports/TEST-org.apache.phoenix.expression.RegexpSplitFunctionTest.xml, phoenix-core/target/surefire-reports/org.apache.phoenix.schema.types.PDateArrayToStringTest.txt=phoenix-core/target/surefire-reports/org.apache.phoenix.schema.types.PDateArrayToStringTest.txt, phoenix-core/target/surefire-reports/TEST-org.apache.phoenix.schema.types.PDataTypeTest.xml=phoenix-core/target/surefire-reports/TEST-org.apache.phoenix.schema.types.PDataTypeTest.xml, phoenix-core/target/surefire-reports/org.apache.phoenix.execute.DescVarLengthFastByteComparisonsTest.txt=phoenix-core/target/surefire-reports/org.apache.phoenix.execute.DescVarLengthFastByteComparisonsTest.txt, phoenix-core/target/surefire-reports/org.apache.phoenix.memory.MemoryManagerTest.txt=phoenix-core/target/surefire-reports/org.apache.phoenix.memory.MemoryManagerTest.txt, phoenix-hive/target/dependency/aopalliance-1.0.jar=phoenix-hive/target/dependency/aopalliance-1.0.jar, phoenix-core/target/surefire-reports/org.apache.phoenix.iterate.MergeSortResultIteratorTest.txt=phoenix-core/target/surefire-reports/org.apache.phoenix.iterate.MergeSortResultIteratorTest.txt, phoenix-hive/target/dependency/jline-2.11.jar=phoenix-hive/target/dependency/jline-2.11.jar, phoenix-core/target/surefire-reports/TEST-org.apache.phoenix.hbase.index.covered.update.TestIndexUpdateManager.xml=phoenix-core/target/surefire-reports/TEST-org.apache.phoenix.hbase.index.covered.update.TestIndexUpdateManager.xml, phoenix-pherf/target/surefire-reports/TEST-org.apache.phoenix.pherf.RuleGeneratorTest.xml=phoenix-pherf/target/surefire-reports/TEST-org.apache.phoenix.pherf.RuleGeneratorTest.xml, phoenix-core/target/surefire-reports/TEST-org.apache.phoenix.iterate.AggregateResultScannerTest.xml=phoenix-core/target/surefire-reports/TEST-org.apache.phoenix.iterate.AggregateResultScannerTest.xml, phoenix-core/target/surefire-reports/org.apache.phoenix.query.PhoenixStatsCacheRemovalListenerTest.txt=phoenix-core/target/surefire-reports/org.apache.phoenix.query.PhoenixStatsCacheRemovalListenerTest.txt, phoenix-core/target/surefire-reports/TEST-org.apache.phoenix.compile.TenantSpecificViewIndexCompileTest.xml=phoenix-core/target/surefire-reports/TEST-org.apache.phoenix.compile.TenantSpecificViewIndexCompileTest.xml, phoenix-core/target/surefire-reports/TEST-org.apache.phoenix.compile.ScanRangesTest.xml=phoenix-core/target/surefire-reports/TEST-org.apache.phoenix.compile.ScanRangesTest.xml, phoenix-core/target/surefire-reports/TEST-org.apache.phoenix.util.csv.StringToArrayConverterTest.xml=phoenix-core/target/surefire-reports/TEST-org.apache.phoenix.util.csv.StringToArrayConverterTest.xml, phoenix-pherf/target/surefire-reports/org.apache.phoenix.pherf.result.impl.XMLResultHandlerTest.txt=phoenix-pherf/target/surefire-reports/org.apache.phoenix.pherf.result.impl.XMLResultHandlerTest.txt, phoenix-core/target/surefire-reports/org.apache.phoenix.execute.MutationStateTest-output.txt=phoenix-core/target/surefire-reports/org.apache.phoenix.execute.MutationStateTest-output.txt, phoenix-core/target/surefire-reports/org.apache.phoenix.filter.SkipScanFilterIntersectTest.txt=phoenix-core/target/surefire-reports/org.apache.phoenix.filter.SkipScanFilterIntersectTest.txt, phoenix-hive/target/failsafe-reports/org.apache.phoenix.hive.HiveTezIT.txt=phoenix-hive/target/failsafe-reports/org.apache.phoenix.hive.HiveTezIT.txt, phoenix-core/target/surefire-reports/org.apache.phoenix.expression.function.BuiltinFunctionConstructorTest.txt=phoenix-core/target/surefire-reports/org.apache.phoenix.expression.function.BuiltinFunctionConstructorTest.txt, phoenix-flume/target/failsafe-reports/org.apache.phoenix.flume.CsvEventSerializerIT.txt=phoenix-flume/target/failsafe-reports/org.apache.phoenix.flume.CsvEventSerializerIT.txt, phoenix-hive/target/MiniMRCluster_2090392667/MiniMRCluster_2090392667-localDir-nm-0_3/usercache/jenkins/filecache/39/phoenix-4.12.0-HBase-1.3-SNAPSHOT-hive.jar=phoenix-hive/target/MiniMRCluster_2090392667/MiniMRCluster_2090392667-localDir-nm-0_3/usercache/jenkins/filecache/39/phoenix-4.12.0-HBase-1.3-SNAPSHOT-hive.jar, phoenix-pherf/target/phoenix-pherf-4.12.0-HBase-1.3-SNAPSHOT-tests.jar=phoenix-pherf/target/phoenix-pherf-4.12.0-HBase-1.3-SNAPSHOT-tests.jar, phoenix-core/target/surefire-reports/TEST-org.apache.phoenix.schema.stats.StatisticsScannerTest.xml=phoenix-core/target/surefire-reports/TEST-org.apache.phoenix.schema.stats.StatisticsScannerTest.xml, phoenix-hive/target/dependency/twill-core-0.8.0.jar=phoenix-hive/target/dependency/twill-core-0.8.0.jar, phoenix-hive/target/hive/hive-localDir-nm-0_1/usercache/jenkins/filecache/16/hadoop-common-2.7.1.jar=phoenix-hive/target/hive/hive-localDir-nm-0_1/usercache/jenkins/filecache/16/hadoop-common-2.7.1.jar, phoenix-core/target/surefire-reports/TEST-org.apache.hadoop.hbase.regionserver.wal.ReadWriteKeyValuesWithCodecTest.xml=phoenix-core/target/surefire-reports/TEST-org.apache.hadoop.hbase.regionserver.wal.ReadWriteKeyValuesWithCodecTest.xml, phoenix-core/target/surefire-reports/TEST-org.apache.phoenix.util.PhoenixEncodeDecodeTest.xml=phoenix-core/target/surefire-reports/TEST-org.apache.phoenix.util.PhoenixEncodeDecodeTest.xml, phoenix-hive/target/hive/hive-localDir-nm-0_2/usercache/jenkins/filecache/31/hadoop-common-2.7.1.jar=phoenix-hive/target/hive/hive-localDir-nm-0_2/usercache/jenkins/filecache/31/hadoop-common-2.7.1.jar, phoenix-queryserver-client/target/phoenix-queryserver-client-4.12.0-HBase-1.3-SNAPSHOT-tests.jar=phoenix-queryserver-client/target/phoenix-queryserver-client-4.12.0-HBase-1.3-SNAPSHOT-tests.jar, phoenix-core/target/surefire-reports/TEST-org.apache.phoenix.query.KeyRangeIntersectTest.xml=phoenix-core/target/surefire-reports/TEST-org.apache.phoenix.query.KeyRangeIntersectTest.xml, phoenix-core/target/surefire-reports/org.apache.phoenix.hbase.index.write.TestParalleWriterIndexCommitter-output.txt=phoenix-core/target/surefire-reports/org.apache.phoenix.hbase.index.write.TestParalleWriterIndexCommitter-output.txt, phoenix-core/target/surefire-reports/org.apache.phoenix.jdbc.SecureUserConnectionsTest.txt=phoenix-core/target/surefire-reports/org.apache.phoenix.jdbc.SecureUserConnectionsTest.txt, phoenix-hive/target/MiniMRCluster_2090392667/MiniMRCluster_2090392667-localDir-nm-0_3/usercache/jenkins/filecache/34/phoenix-4.12.0-HBase-1.3-SNAPSHOT-hive.jar=phoenix-hive/target/MiniMRCluster_2090392667/MiniMRCluster_2090392667-localDir-nm-0_3/usercache/jenkins/filecache/34/phoenix-4.12.0-HBase-1.3-SNAPSHOT-hive.jar, phoenix-core/target/surefire-reports/org.apache.phoenix.compile.ViewCompilerTest-output.txt=phoenix-core/target/surefire-reports/org.apache.phoenix.compile.ViewCompilerTest-output.txt, phoenix-core/target/surefire-reports/org.apache.phoenix.cache.TenantCacheTest.txt=phoenix-core/target/surefire-reports/org.apache.phoenix.cache.TenantCacheTest.txt, phoenix-core/target/surefire-reports/org.apache.phoenix.jdbc.PhoenixDriverTest.txt=phoenix-core/target/surefire-reports/org.apache.phoenix.jdbc.PhoenixDriverTest.txt, phoenix-hive/target/hive/hive-localDir-nm-0_3/usercache/jenkins/filecache/22/hadoop-common-2.7.1.jar=phoenix-hive/target/hive/hive-localDir-nm-0_3/usercache/jenkins/filecache/22/hadoop-common-2.7.1.jar, phoenix-spark/target/phoenix-spark-4.12.0-HBase-1.3-SNAPSHOT-sources.jar=phoenix-spark/target/phoenix-spark-4.12.0-HBase-1.3-SNAPSHOT-sources.jar, phoenix-core/target/surefire-reports/org.apache.phoenix.compile.QueryOptimizerTest-output.txt=phoenix-core/target/surefire-reports/org.apache.phoenix.compile.QueryOptimizerTest-output.txt, phoenix-hive/target/dependency/apacheds-i18n-2.0.0-M15.jar=phoenix-hive/target/dependency/apacheds-i18n-2.0.0-M15.jar, phoenix-core/target/surefire-reports/org.apache.phoenix.expression.SortOrderExpressionTest.txt=phoenix-core/target/surefire-reports/org.apache.phoenix.expression.SortOrderExpressionTest.txt, phoenix-load-balancer/target/phoenix-load-balancer-4.12.0-HBase-1.3-SNAPSHOT-test-sources.jar=phoenix-load-balancer/target/phoenix-load-balancer-4.12.0-HBase-1.3-SNAPSHOT-test-sources.jar, phoenix-pherf/target/failsafe-reports/org.apache.phoenix.pherf.SchemaReaderIT-output.txt=phoenix-pherf/target/failsafe-reports/org.apache.phoenix.pherf.SchemaReaderIT-output.txt, phoenix-hive/target/MiniMRCluster_2090392667/MiniMRCluster_2090392667-localDir-nm-0_1/usercache/jenkins/filecache/10/phoenix-4.12.0-HBase-1.3-SNAPSHOT-hive.jar=phoenix-hive/target/MiniMRCluster_2090392667/MiniMRCluster_2090392667-localDir-nm-0_1/usercache/jenkins/filecache/10/phoenix-4.12.0-HBase-1.3-SNAPSHOT-hive.jar, phoenix-core/target/surefire-reports/TEST-org.apache.phoenix.execute.CorrelatePlanTest.xml=phoenix-core/target/surefire-reports/TEST-org.apache.phoenix.execute.CorrelatePlanTest.xml, phoenix-hive/target/dependency/jetty-6.1.26.jar=phoenix-hive/target/dependency/jetty-6.1.26.jar, phoenix-hive/target/dependency/leveldbjni-all-1.8.jar=phoenix-hive/target/dependency/leveldbjni-all-1.8.jar, phoenix-pig/target/surefire-reports/org.apache.phoenix.pig.util.QuerySchemaParserFunctionTest-output.txt=phoenix-pig/target/surefire-reports/org.apache.phoenix.pig.util.QuerySchemaParserFunctionTest-output.txt, phoenix-core/target/surefire-reports/org.apache.phoenix.mapreduce.FormatToBytesWritableMapperTest.txt=phoenix-core/target/surefire-reports/org.apache.phoenix.mapreduce.FormatToBytesWritableMapperTest.txt, phoenix-hive/target/dependency/hive-exec-1.2.1.jar=phoenix-hive/target/dependency/hive-exec-1.2.1.jar, phoenix-hive/target/dependency/servlet-api-2.5.jar=phoenix-hive/target/dependency/servlet-api-2.5.jar, phoenix-core/target/surefire-reports/org.apache.phoenix.compile.ScanRangesTest.txt=phoenix-core/target/surefire-reports/org.apache.phoenix.compile.ScanRangesTest.txt, phoenix-hive/target/dependency/asm-all-5.0.2.jar=phoenix-hive/target/dependency/asm-all-5.0.2.jar, phoenix-hive/target/dependency/jackson-mapper-asl-1.9.2.jar=phoenix-hive/target/dependency/jackson-mapper-asl-1.9.2.jar, phoenix-pig/target/phoenix-pig-4.12.0-HBase-1.3-SNAPSHOT.jar=phoenix-pig/target/phoenix-pig-4.12.0-HBase-1.3-SNAPSHOT.jar, phoenix-hive/target/dependency/hadoop-annotations-2.7.1.jar=phoenix-hive/target/dependency/hadoop-annotations-2.7.1.jar, phoenix-core/target/surefire-reports/TEST-org.apache.phoenix.execute.UnnestArrayPlanTest.xml=phoenix-core/target/surefire-reports/TEST-org.apache.phoenix.execute.UnnestArrayPlanTest.xml, phoenix-hive/target/dependency/hadoop-mapreduce-client-common-2.7.1.jar=phoenix-hive/target/dependency/hadoop-mapreduce-client-common-2.7.1.jar, phoenix-hive/target/dependency/jackson-xc-1.9.2.jar=phoenix-hive/target/dependency/jackson-xc-1.9.2.jar, phoenix-hive/target/dependency/opencsv-2.3.jar=phoenix-hive/target/dependency/opencsv-2.3.jar, phoenix-core/target/surefire-reports/TEST-org.apache.phoenix.schema.RowKeySchemaTest.xml=phoenix-core/target/surefire-reports/TEST-org.apache.phoenix.schema.RowKeySchemaTest.xml, phoenix-core/target/surefire-reports/org.apache.phoenix.schema.types.PrimitiveLongPhoenixArrayToStringTest.txt=phoenix-core/target/surefire-reports/org.apache.phoenix.schema.types.PrimitiveLongPhoenixArrayToStringTest.txt, phoenix-core/target/surefire-reports/org.apache.phoenix.util.PhoenixRuntimeTest.txt=phoenix-core/target/surefire-reports/org.apache.phoenix.util.PhoenixRuntimeTest.txt, phoenix-core/target/surefire-reports/org.apache.phoenix.compile.JoinQueryCompilerTest.txt=phoenix-core/target/surefire-reports/org.apache.phoenix.compile.JoinQueryCompilerTest.txt, phoenix-core/target/cached_classpath.txt=phoenix-core/target/cached_classpath.txt, phoenix-core/target/surefire-reports/org.apache.phoenix.hbase.index.write.TestIndexWriter-output.txt=phoenix-core/target/surefire-reports/org.apache.phoenix.hbase.index.write.TestIndexWriter-output.txt, phoenix-hive/target/dependency/gson-2.2.4.jar=phoenix-hive/target/dependency/gson-2.2.4.jar, phoenix-hive/target/dependency/httpcore-4.0.1.jar=phoenix-hive/target/dependency/httpcore-4.0.1.jar, phoenix-core/target/surefire-reports/TEST-org.apache.phoenix.util.IndexUtilTest.xml=phoenix-core/target/surefire-reports/TEST-org.apache.phoenix.util.IndexUtilTest.xml, phoenix-hive/target/dependency/hbase-common-1.3.1.jar=phoenix-hive/target/dependency/hbase-common-1.3.1.jar, phoenix-core/target/surefire-reports/TEST-org.apache.phoenix.expression.GetSetByteBitFunctionTest.xml=phoenix-core/target/surefire-reports/TEST-org.apache.phoenix.expression.GetSetByteBitFunctionTest.xml, phoenix-hive/target/phoenix-hive-4.12.0-HBase-1.3-SNAPSHOT.jar=phoenix-hive/target/phoenix-hive-4.12.0-HBase-1.3-SNAPSHOT.jar, phoenix-core/target/surefire-reports/TEST-org.apache.phoenix.expression.function.ExternalSqlTypeIdFunctionTest.xml=phoenix-core/target/surefire-reports/TEST-org.apache.phoenix.expression.function.ExternalSqlTypeIdFunctionTest.xml, phoenix-hive/target/dependency/calcite-avatica-1.2.0-incubating.jar=phoenix-hive/target/dependency/calcite-avatica-1.2.0-incubating.jar, phoenix-hive/target/dependency/hadoop-mapreduce-client-app-2.7.1.jar=phoenix-hive/target/dependency/hadoop-mapreduce-client-app-2.7.1.jar, phoenix-core/target/surefire-reports/org.apache.phoenix.compile.ScanRangesIntersectTest.txt=phoenix-core/target/surefire-reports/org.apache.phoenix.compile.ScanRangesIntersectTest.txt, phoenix-hive/target/dependency/geronimo-annotation_1.0_spec-1.1.1.jar=phoenix-hive/target/dependency/geronimo-annotation_1.0_spec-1.1.1.jar, phoenix-core/target/surefire-reports/TEST-org.apache.phoenix.expression.RoundFloorCeilExpressionsTest.xml=phoenix-core/target/surefire-reports/TEST-org.apache.phoenix.expression.RoundFloorCeilExpressionsTest.xml, phoenix-core/target/surefire-reports/TEST-org.apache.phoenix.mapreduce.util.PhoenixConfigurationUtilTest.xml=phoenix-core/target/surefire-reports/TEST-org.apache.phoenix.mapreduce.util.PhoenixConfigurationUtilTest.xml, phoenix-core/target/surefire-reports/org.apache.phoenix.schema.stats.StatisticsScannerTest-output.txt=phoenix-core/target/surefire-reports/org.apache.phoenix.schema.stats.StatisticsScannerTest-output.txt, phoenix-hive/target/MiniMRCluster_2090392667/MiniMRCluster_2090392667-localDir-nm-0_3/usercache/jenkins/filecache/12/hadoop-common-2.7.1.jar=phoenix-hive/target/MiniMRCluster_2090392667/MiniMRCluster_2090392667-localDir-nm-0_3/usercache/jenkins/filecache/12/hadoop-common-2.7.1.jar, phoenix-hive/target/dependency/commons-compress-1.4.1.jar=phoenix-hive/target/dependency/commons-compress-1.4.1.jar, phoenix-hive/target/dependency/jets3t-0.9.0.jar=phoenix-hive/target/dependency/jets3t-0.9.0.jar, phoenix-spark/target/phoenix-spark-4.12.0-HBase-1.3-SNAPSHOT-javadoc.jar=phoenix-spark/target/phoenix-spark-4.12.0-HBase-1.3-SNAPSHOT-javadoc.jar, phoenix-hive/target/dependency/hadoop-mapreduce-client-jobclient-2.7.1.jar=phoenix-hive/target/dependency/hadoop-mapreduce-client-jobclient-2.7.1.jar, phoenix-hive/target/hive/hive-localDir-nm-0_1/usercache/jenkins/filecache/30/hive-exec-1.2.1.jar=phoenix-hive/target/hive/hive-localDir-nm-0_1/usercache/jenkins/filecache/30/hive-exec-1.2.1.jar, phoenix-pherf/target/surefire-reports/TEST-org.apache.phoenix.pherf.RowCalculatorTest.xml=phoenix-pherf/target/surefire-reports/TEST-org.apache.phoenix.pherf.RowCalculatorTest.xml, phoenix-hive/target/dependency/hadoop-yarn-server-resourcemanager-2.7.1.jar=phoenix-hive/target/dependency/hadoop-yarn-server-resourcemanager-2.7.1.jar, phoenix-core/target/surefire-reports/org.apache.phoenix.schema.RowKeySchemaTest-output.txt=phoenix-core/target/surefire-reports/org.apache.phoenix.schema.RowKeySchemaTest-output.txt, phoenix-core/target/surefire-reports/TEST-org.apache.hadoop.hbase.regionserver.wal.IndexedWALEditCodecTest.xml=phoenix-core/target/surefire-reports/TEST-org.apache.hadoop.hbase.regionserver.wal.IndexedWALEditCodecTest.xml, phoenix-hive/target/dependency/hive-shims-common-1.2.1.jar=phoenix-hive/target/dependency/hive-shims-common-1.2.1.jar, phoenix-client/target/phoenix-4.12.0-HBase-1.3-SNAPSHOT-client.jar=phoenix-client/target/phoenix-4.12.0-HBase-1.3-SNAPSHOT-client.jar, phoenix-pherf/target/surefire-reports/TEST-org.apache.phoenix.pherf.result.impl.XMLResultHandlerTest.xml=phoenix-pherf/target/surefire-reports/TEST-org.apache.phoenix.pherf.result.impl.XMLResultHandlerTest.xml, phoenix-hive/target/dependency/velocity-1.5.jar=phoenix-hive/target/dependency/velocity-1.5.jar, phoenix-hive/target/dependency/commons-configuration-1.6.jar=phoenix-hive/target/dependency/commons-configuration-1.6.jar, phoenix-hive/target/dependency/hbase-it-1.3.1-tests.jar=phoenix-hive/target/dependency/hbase-it-1.3.1-tests.jar, phoenix-pherf/target/surefire-reports/org.apache.phoenix.pherf.XMLConfigParserTest-output.txt=phoenix-pherf/target/surefire-reports/org.apache.phoenix.pherf.XMLConfigParserTest-output.txt, phoenix-core/target/surefire-reports/org.apache.phoenix.filter.DistinctPrefixFilterTest.txt=phoenix-core/target/surefire-reports/org.apache.phoenix.filter.DistinctPrefixFilterTest.txt, phoenix-hive/target/dependency/hbase-common-1.3.1-tests.jar=phoenix-hive/target/dependency/hbase-common-1.3.1-tests.jar, phoenix-core/target/surefire-reports/org.apache.phoenix.util.json.JsonUpsertExecutorTest-output.txt=phoenix-core/target/surefire-reports/org.apache.phoenix.util.json.JsonUpsertExecutorTest-output.txt, phoenix-core/target/surefire-reports/org.apache.phoenix.compile.QueryCompilerTest.txt=phoenix-core/target/surefire-reports/org.apache.phoenix.compile.QueryCompilerTest.txt, phoenix-core/target/surefire-reports/TEST-org.apache.phoenix.util.StringUtilTest.xml=phoenix-core/target/surefire-reports/TEST-org.apache.phoenix.util.StringUtilTest.xml, phoenix-core/target/surefire-reports/org.apache.phoenix.compile.CreateTableCompilerTest-output.txt=phoenix-core/target/surefire-reports/org.apache.phoenix.compile.CreateTableCompilerTest-output.txt, phoenix-core/target/surefire-reports/TEST-org.apache.phoenix.schema.types.PrimitiveIntPhoenixArrayToStringTest.xml=phoenix-core/target/surefire-reports/TEST-org.apache.phoenix.schema.types.PrimitiveIntPhoenixArrayToStringTest.xml, phoenix-kafka/target/phoenix-kafka-4.12.0-HBase-1.3-SNAPSHOT-sources.jar=phoenix-kafka/target/phoenix-kafka-4.12.0-HBase-1.3-SNAPSHOT-sources.jar, phoenix-core/target/surefire-reports/org.apache.phoenix.util.ScanUtilTest.txt=phoenix-core/target/surefire-reports/org.apache.phoenix.util.ScanUtilTest.txt, phoenix-core/target/surefire-reports/TEST-org.apache.phoenix.compile.StatementHintsCompilationTest.xml=phoenix-core/target/surefire-reports/TEST-org.apache.phoenix.compile.StatementHintsCompilationTest.xml, phoenix-core/target/surefire-reports/TEST-org.apache.phoenix.filter.SkipScanBigFilterTest.xml=phoenix-core/target/surefire-reports/TEST-org.apache.phoenix.filter.SkipScanBigFilterTest.xml, phoenix-pherf/target/failsafe-reports/failsafe-summary.xml=phoenix-pherf/target/failsafe-reports/failsafe-summary.xml, phoenix-hive/target/dependency/java-xmlbuilder-0.4.jar=phoenix-hive/target/dependency/java-xmlbuilder-0.4.jar, phoenix-hive/target/MiniMRCluster_2090392667/MiniMRCluster_2090392667-localDir-nm-0_3/usercache/jenkins/filecache/23/hive-exec-1.2.1.jar=phoenix-hive/target/MiniMRCluster_2090392667/MiniMRCluster_2090392667-localDir-nm-0_3/usercache/jenkins/filecache/23/hive-exec-1.2.1.jar, phoenix-hive/target/dependency/asm-3.1.jar=phoenix-hive/target/dependency/asm-3.1.jar, phoenix-hive/target/dependency/netty-all-4.0.23.Final.jar=phoenix-hive/target/dependency/netty-all-4.0.23.Final.jar, phoenix-hive/target/dependency/guice-servlet-3.0.jar=phoenix-hive/target/dependency/guice-servlet-3.0.jar, phoenix-hive/target/dependency/hive-shims-scheduler-1.2.1.jar=phoenix-hive/target/dependency/hive-shims-scheduler-1.2.1.jar, phoenix-flume/target/failsafe-reports/org.apache.phoenix.flume.RegexEventSerializerIT-output.txt=phoenix-flume/target/failsafe-reports/org.apache.phoenix.flume.RegexEventSerializerIT-output.txt, phoenix-hive/target/MiniMRCluster_2090392667/MiniMRCluster_2090392667-localDir-nm-0_1/usercache/jenkins/filecache/61/hive-exec-1.2.1.jar=phoenix-hive/target/MiniMRCluster_2090392667/MiniMRCluster_2090392667-localDir-nm-0_1/usercache/jenkins/filecache/61/hive-exec-1.2.1.jar, phoenix-core/target/surefire-reports/TEST-org.apache.phoenix.query.EncodedColumnQualifierCellsListTest.xml=phoenix-core/target/surefire-reports/TEST-org.apache.phoenix.query.EncodedColumnQualifierCellsListTest.xml, phoenix-core/target/surefire-reports/org.apache.phoenix.expression.RoundFloorCeilExpressionsTest.txt=phoenix-core/target/surefire-reports/org.apache.phoenix.expression.RoundFloorCeilExpressionsTest.txt, phoenix-core/target/surefire-reports/org.apache.phoenix.jdbc.ReadOnlyPropertiesTest-output.txt=phoenix-core/target/surefire-reports/org.apache.phoenix.jdbc.ReadOnlyPropertiesTest-output.txt, phoenix-hive/target/dependency/parquet-hadoop-bundle-1.6.0.jar=phoenix-hive/target/dependency/parquet-hadoop-bundle-1.6.0.jar, phoenix-core/target/surefire-reports/TEST-org.apache.phoenix.query.KeyRangeUnionTest.xml=phoenix-core/target/surefire-reports/TEST-org.apache.phoenix.query.KeyRangeUnionTest.xml, phoenix-core/target/surefire-reports/TEST-org.apache.phoenix.jdbc.ReadOnlyPropertiesTest.xml=phoenix-core/target/surefire-reports/TEST-org.apache.phoenix.jdbc.ReadOnlyPropertiesTest.xml, phoenix-core/target/surefire-reports/TEST-org.apache.phoenix.schema.types.PrimitiveFloatPhoenixArrayToStringTest.xml=phoenix-core/target/surefire-reports/TEST-org.apache.phoenix.schema.types.PrimitiveFloatPhoenixArrayToStringTest.xml, phoenix-queryserver/target/failsafe-reports/org.apache.phoenix.end2end.QueryServerBasicsIT.txt=phoenix-queryserver/target/failsafe-reports/org.apache.phoenix.end2end.QueryServerBasicsIT.txt, phoenix-core/target/surefire-reports/TEST-org.apache.phoenix.util.ColumnInfoTest.xml=phoenix-core/target/surefire-reports/TEST-org.apache.phoenix.util.ColumnInfoTest.xml, phoenix-hive/target/dependency/ant-1.9.1.jar=phoenix-hive/target/dependency/ant-1.9.1.jar, phoenix-hive/target/dependency/jetty-util-6.1.26.jar=phoenix-hive/target/dependency/jetty-util-6.1.26.jar, bin/sqlline-thin.py=bin/sqlline-thin.py, phoenix-hive/target/MiniMRCluster_2090392667/MiniMRCluster_2090392667-localDir-nm-0_2/filecache/11/MRAppJar.jar=phoenix-hive/target/MiniMRCluster_2090392667/MiniMRCluster_2090392667-localDir-nm-0_2/filecache/11/MRAppJar.jar, phoenix-kafka/target/failsafe-reports/org.apache.phoenix.kafka.PhoenixConsumerIT-output.txt=phoenix-kafka/target/failsafe-reports/org.apache.phoenix.kafka.PhoenixConsumerIT-output.txt, phoenix-core/target/surefire-reports/org.apache.hadoop.hbase.regionserver.PhoenixRpcSchedulerFactoryTest-output.txt=phoenix-core/target/surefire-reports/org.apache.hadoop.hbase.regionserver.PhoenixRpcSchedulerFactoryTest-output.txt, phoenix-core/target/surefire-reports/org.apache.hadoop.hbase.regionserver.wal.ReadWriteKeyValuesWithCodecTest.txt=phoenix-core/target/surefire-reports/org.apache.hadoop.hbase.regionserver.wal.ReadWriteKeyValuesWithCodecTest.txt, phoenix-core/target/surefire-reports/org.apache.phoenix.schema.stats.StatisticsScannerTest.txt=phoenix-core/target/surefire-reports/org.apache.phoenix.schema.stats.StatisticsScannerTest.txt, phoenix-hive/target/dependency/hbase-shell-1.3.1.jar=phoenix-hive/target/dependency/hbase-shell-1.3.1.jar, phoenix-hive/target/dependency/api-util-1.0.0-M20.jar=phoenix-hive/target/dependency/api-util-1.0.0-M20.jar, phoenix-pherf/target/surefire-reports/org.apache.phoenix.pherf.PherfTest-output.txt=phoenix-pherf/target/surefire-reports/org.apache.phoenix.pherf.PherfTest-output.txt, phoenix-core/target/surefire-reports/org.apache.phoenix.expression.GetSetByteBitFunctionTest.txt=phoenix-core/target/surefire-reports/org.apache.phoenix.expression.GetSetByteBitFunctionTest.txt, phoenix-pig/target/surefire-reports/TEST-org.apache.phoenix.pig.util.TableSchemaParserFunctionTest.xml=phoenix-pig/target/surefire-reports/TEST-org.apache.phoenix.pig.util.TableSchemaParserFunctionTest.xml, phoenix-kafka/target/failsafe-reports/null-output.txt=phoenix-kafka/target/failsafe-reports/null-output.txt, phoenix-core/target/surefire-reports/TEST-org.apache.phoenix.util.ByteUtilTest.xml=phoenix-core/target/surefire-reports/TEST-org.apache.phoenix.util.ByteUtilTest.xml, phoenix-hive/target/hive/hive-localDir-nm-0_2/usercache/jenkins/filecache/41/phoenix-4.12.0-HBase-1.3-SNAPSHOT-hive.jar=phoenix-hive/target/hive/hive-localDir-nm-0_2/usercache/jenkins/filecache/41/phoenix-4.12.0-HBase-1.3-SNAPSHOT-hive.jar, phoenix-core/target/surefire-reports/org.apache.phoenix.mapreduce.util.PhoenixConfigurationUtilTest-output.txt=phoenix-core/target/surefire-reports/org.apache.phoenix.mapreduce.util.PhoenixConfigurationUtilTest-output.txt, phoenix-hive/target/dependency/hadoop-yarn-api-2.7.1.jar=phoenix-hive/target/dependency/hadoop-yarn-api-2.7.1.jar, phoenix-hive/target/dependency/hive-cli-1.2.1.jar=phoenix-hive/target/dependency/hive-cli-1.2.1.jar, phoenix-core/target/surefire-reports/TEST-org.apache.phoenix.expression.AbsFunctionTest.xml=phoenix-core/target/surefire-reports/TEST-org.apache.phoenix.expression.AbsFunctionTest.xml, phoenix-core/target/surefire-reports/TEST-org.apache.phoenix.query.ConnectionlessTest.xml=phoenix-core/target/surefire-reports/TEST-org.apache.phoenix.query.ConnectionlessTest.xml, phoenix-core/target/surefire-reports/org.apache.phoenix.compile.QueryCompilerTest-output.txt=phoenix-core/target/surefire-reports/org.apache.phoenix.compile.QueryCompilerTest-output.txt, phoenix-core/target/surefire-reports/TEST-org.apache.phoenix.expression.SortOrderExpressionTest.xml=phoenix-core/target/surefire-reports/TEST-org.apache.phoenix.expression.SortOrderExpressionTest.xml, phoenix-hive/target/dependency/asm-tree-3.1.jar=phoenix-hive/target/dependency/asm-tree-3.1.jar, phoenix-hive/target/dependency/sqlline-1.2.0.jar=phoenix-hive/target/dependency/sqlline-1.2.0.jar, phoenix-core/target/surefire-reports/org.apache.phoenix.query.KeyRangeCoalesceTest.txt=phoenix-core/target/surefire-reports/org.apache.phoenix.query.KeyRangeCoalesceTest.txt, phoenix-hive/target/hive/hive-localDir-nm-0_1/usercache/jenkins/filecache/24/hive-exec-1.2.1.jar=phoenix-hive/target/hive/hive-localDir-nm-0_1/usercache/jenkins/filecache/24/hive-exec-1.2.1.jar, phoenix-core/target/surefire-reports/TEST-org.apache.phoenix.query.ConnectionQueryServicesImplTest.xml=phoenix-core/target/surefire-reports/TEST-org.apache.phoenix.query.ConnectionQueryServicesImplTest.xml, phoenix-hive/target/MiniMRCluster_2090392667/MiniMRCluster_2090392667-localDir-nm-0_3/usercache/jenkins/filecache/18/phoenix-4.12.0-HBase-1.3-SNAPSHOT-hive.jar=phoenix-hive/target/MiniMRCluster_2090392667/MiniMRCluster_2090392667-localDir-nm-0_3/usercache/jenkins/filecache/18/phoenix-4.12.0-HBase-1.3-SNAPSHOT-hive.jar, phoenix-hive/target/dependency/hadoop-common-2.7.1-tests.jar=phoenix-hive/target/dependency/hadoop-common-2.7.1-tests.jar, phoenix-hive/target/dependency/jsp-api-2.1-6.1.14.jar=phoenix-hive/target/dependency/jsp-api-2.1-6.1.14.jar, phoenix-hive/target/dependency/tez-common-0.8.4.jar=phoenix-hive/target/dependency/tez-common-0.8.4.jar, phoenix-pig/target/phoenix-pig-4.12.0-HBase-1.3-SNAPSHOT-sources.jar=phoenix-pig/target/phoenix-pig-4.12.0-HBase-1.3-SNAPSHOT-sources.jar, phoenix-hive/target/dependency/derby-10.10.2.0.jar=phoenix-hive/target/dependency/derby-10.10.2.0.jar, phoenix-queryserver-client/target/phoenix-queryserver-client-4.12.0-HBase-1.3-SNAPSHOT.jar=phoenix-queryserver-client/target/phoenix-queryserver-client-4.12.0-HBase-1.3-SNAPSHOT.jar, phoenix-core/target/surefire-reports/TEST-org.apache.phoenix.hbase.index.parallel.TestThreadPoolManager.xml=phoenix-core/target/surefire-reports/TEST-org.apache.phoenix.hbase.index.parallel.TestThreadPoolManager.xml, phoenix-core/target/surefire-reports/TEST-org.apache.phoenix.expression.util.regex.PatternPerformanceTest.xml=phoenix-core/target/surefire-reports/TEST-org.apache.phoenix.expression.util.regex.PatternPerformanceTest.xml, phoenix-core/target/surefire-reports/TEST-org.apache.phoenix.util.Base62EncoderTest.xml=phoenix-core/target/surefire-reports/TEST-org.apache.phoenix.util.Base62EncoderTest.xml, phoenix-core/target/surefire-reports/org.apache.phoenix.compile.ViewCompilerTest.txt=phoenix-core/target/surefire-reports/org.apache.phoenix.compile.ViewCompilerTest.txt, phoenix-pherf/target/surefire-reports/TEST-org.apache.phoenix.pherf.PherfTest.xml=phoenix-pherf/target/surefire-reports/TEST-org.apache.phoenix.pherf.PherfTest.xml, phoenix-hive/target/hive/hive-localDir-nm-0_2/usercache/jenkins/filecache/18/hive-exec-1.2.1.jar=phoenix-hive/target/hive/hive-localDir-nm-0_2/usercache/jenkins/filecache/18/hive-exec-1.2.1.jar, phoenix-hive/target/dependency/jetty-all-7.6.0.v20120127.jar=phoenix-hive/target/dependency/jetty-all-7.6.0.v20120127.jar, phoenix-core/target/surefire-reports/org.apache.phoenix.expression.AbsFunctionTest.txt=phoenix-core/target/surefire-reports/org.apache.phoenix.expression.AbsFunctionTest.txt, phoenix-core/target/surefire-reports/org.apache.phoenix.filter.SkipScanBigFilterTest-output.txt=phoenix-core/target/surefire-reports/org.apache.phoenix.filter.SkipScanBigFilterTest-output.txt, phoenix-queryserver/target/failsafe-reports/TEST-org.apache.phoenix.end2end.QueryServerBasicsIT.xml=phoenix-queryserver/target/failsafe-reports/TEST-org.apache.phoenix.end2end.QueryServerBasicsIT.xml, phoenix-core/target/surefire-reports/TEST-org.apache.phoenix.index.IndexMaintainerTest.xml=phoenix-core/target/surefire-reports/TEST-org.apache.phoenix.index.IndexMaintainerTest.xml, phoenix-core/target/surefire-reports/org.apache.phoenix.query.QueryPlanTest-output.txt=phoenix-core/target/surefire-reports/org.apache.phoenix.query.QueryPlanTest-output.txt, phoenix-core/target/surefire-reports/TEST-org.apache.phoenix.util.JDBCUtilTest.xml=phoenix-core/target/surefire-reports/TEST-org.apache.phoenix.util.JDBCUtilTest.xml, phoenix-hive/target/dependency/htrace-core-3.1.0-incubating.jar=phoenix-hive/target/dependency/htrace-core-3.1.0-incubating.jar, phoenix-hive/target/hive/hive-localDir-nm-0_1/usercache/jenkins/filecache/32/phoenix-4.12.0-HBase-1.3-SNAPSHOT-hive.jar=phoenix-hive/target/hive/hive-localDir-nm-0_1/usercache/jenkins/filecache/32/phoenix-4.12.0-HBase-1.3-SNAPSHOT-hive.jar, phoenix-core/target/surefire-reports/org.apache.phoenix.mapreduce.bulkload.TestTableRowkeyPair.txt=phoenix-core/target/surefire-reports/org.apache.phoenix.mapreduce.bulkload.TestTableRowkeyPair.txt, phoenix-core/target/surefire-reports/TEST-org.apache.phoenix.util.QualifierEncodingSchemeTest.xml=phoenix-core/target/surefire-reports/TEST-org.apache.phoenix.util.QualifierEncodingSchemeTest.xml, phoenix-hive/target/dependency/zookeeper-3.4.6.jar=phoenix-hive/target/dependency/zookeeper-3.4.6.jar, phoenix-hive/target/dependency/commons-collections4-4.1.jar=phoenix-hive/target/dependency/commons-collections4-4.1.jar, phoenix-core/target/surefire-reports/TEST-org.apache.phoenix.schema.types.PrimitiveShortPhoenixArrayToStringTest.xml=phoenix-core/target/surefire-reports/TEST-org.apache.phoenix.schema.types.PrimitiveShortPhoenixArrayToStringTest.xml, phoenix-core/target/surefire-reports/org.apache.phoenix.schema.SortOrderTest.txt=phoenix-core/target/surefire-reports/org.apache.phoenix.schema.SortOrderTest.txt, phoenix-core/target/surefire-reports/org.apache.phoenix.filter.SkipScanBigFilterTest.txt=phoenix-core/target/surefire-reports/org.apache.phoenix.filter.SkipScanBigFilterTest.txt, phoenix-hive/target/dependency/commons-codec-1.7.jar=phoenix-hive/target/dependency/commons-codec-1.7.jar, phoenix-hive/target/dependency/libthrift-0.9.2.jar=phoenix-hive/target/dependency/libthrift-0.9.2.jar, phoenix-core/target/surefire-reports/TEST-org.apache.hadoop.hbase.ipc.PhoenixIndexRpcSchedulerTest.xml=phoenix-core/target/surefire-reports/TEST-org.apache.hadoop.hbase.ipc.PhoenixIndexRpcSchedulerTest.xml, phoenix-core/target/surefire-reports/org.apache.phoenix.expression.RegexpSplitFunctionTest.txt=phoenix-core/target/surefire-reports/org.apache.phoenix.expression.RegexpSplitFunctionTest.txt, phoenix-protocol/README.txt=phoenix-protocol/README.txt, phoenix-core/target/surefire-reports/org.apache.phoenix.iterate.AggregateResultScannerTest.txt=phoenix-core/target/surefire-reports/org.apache.phoenix.iterate.AggregateResultScannerTest.txt, phoenix-core/target/surefire-reports/TEST-org.apache.phoenix.expression.ArrayConstructorExpressionTest.xml=phoenix-core/target/surefire-reports/TEST-org.apache.phoenix.expression.ArrayConstructorExpressionTest.xml, phoenix-core/target/surefire-reports/TEST-org.apache.phoenix.expression.PowerFunctionTest.xml=phoenix-core/target/surefire-reports/TEST-org.apache.phoenix.expression.PowerFunctionTest.xml, phoenix-hive/target/dependency/tez-api-0.8.4.jar=phoenix-hive/target/dependency/tez-api-0.8.4.jar, phoenix-core/target/surefire-reports/org.apache.phoenix.util.StringUtilTest.txt=phoenix-core/target/surefire-reports/org.apache.phoenix.util.StringUtilTest.txt, phoenix-core/target/surefire-reports/org.apache.hadoop.hbase.regionserver.wal.IndexedWALEditCodecTest.txt=phoenix-core/target/surefire-reports/org.apache.hadoop.hbase.regionserver.wal.IndexedWALEditCodecTest.txt, phoenix-core/target/surefire-reports/org.apache.phoenix.expression.PowerFunctionTest.txt=phoenix-core/target/surefire-reports/org.apache.phoenix.expression.PowerFunctionTest.txt, phoenix-hive/target/dependency/commons-beanutils-core-1.8.0.jar=phoenix-hive/target/dependency/commons-beanutils-core-1.8.0.jar, phoenix-core/target/surefire-reports/TEST-org.apache.phoenix.expression.ArrayPrependFunctionTest.xml=phoenix-core/target/surefire-reports/TEST-org.apache.phoenix.expression.ArrayPrependFunctionTest.xml, phoenix-hive/target/dependency/hive-shims-0.23-1.2.1.jar=phoenix-hive/target/dependency/hive-shims-0.23-1.2.1.jar, phoenix-core/target/surefire-reports/TEST-org.apache.phoenix.util.PropertiesUtilTest.xml=phoenix-core/target/surefire-reports/TEST-org.apache.phoenix.util.PropertiesUtilTest.xml, phoenix-hive/target/MiniMRCluster_2090392667/MiniMRCluster_2090392667-localDir-nm-0_2/usercache/jenkins/filecache/16/hadoop-common-2.7.1.jar=phoenix-hive/target/MiniMRCluster_2090392667/MiniMRCluster_2090392667-localDir-nm-0_2/usercache/jenkins/filecache/16/hadoop-common-2.7.1.jar, phoenix-core/target/surefire-reports/org.apache.phoenix.util.JDBCUtilTest.txt=phoenix-core/target/surefire-reports/org.apache.phoenix.util.JDBCUtilTest.txt, phoenix-pig/target/failsafe-reports/TEST-org.apache.phoenix.pig.PhoenixHBaseLoaderIT.xml=phoenix-pig/target/failsafe-reports/TEST-org.apache.phoenix.pig.PhoenixHBaseLoaderIT.xml, phoenix-kafka/target/phoenix-kafka-4.12.0-HBase-1.3-SNAPSHOT-tests.jar=phoenix-kafka/target/phoenix-kafka-4.12.0-HBase-1.3-SNAPSHOT-tests.jar, phoenix-core/target/surefire-reports/TEST-org.apache.phoenix.schema.PCharPadTest.xml=phoenix-core/target/surefire-reports/TEST-org.apache.phoenix.schema.PCharPadTest.xml, phoenix-hive/target/hive/hive-localDir-nm-0_3/usercache/jenkins/filecache/14/phoenix-4.12.0-HBase-1.3-SNAPSHOT-hive.jar=phoenix-hive/target/hive/hive-localDir-nm-0_3/usercache/jenkins/filecache/14/phoenix-4.12.0-HBase-1.3-SNAPSHOT-hive.jar, phoenix-core/target/surefire-reports/org.apache.phoenix.schema.PMetaDataImplTest.txt=phoenix-core/target/surefire-reports/org.apache.phoenix.schema.PMetaDataImplTest.txt, phoenix-core/target/surefire-reports/TEST-org.apache.phoenix.expression.function.InstrFunctionTest.xml=phoenix-core/target/surefire-reports/TEST-org.apache.phoenix.expression.function.InstrFunctionTest.xml, phoenix-core/target/surefire-reports/org.apache.phoenix.schema.types.PDataTypeForArraysTest.txt=phoenix-core/target/surefire-reports/org.apache.phoenix.schema.types.PDataTypeForArraysTest.txt, phoenix-hive/target/surefire-reports/org.apache.phoenix.hive.query.PhoenixQueryBuilderTest.txt=phoenix-hive/target/surefire-reports/org.apache.phoenix.hive.query.PhoenixQueryBuilderTest.txt, phoenix-queryserver/target/surefire-reports/org.apache.phoenix.queryserver.server.PhoenixRemoteUserExtractorTest.txt=phoenix-queryserver/target/surefire-reports/org.apache.phoenix.queryserver.server.PhoenixRemoteUserExtractorTest.txt, phoenix-core/target/surefire-reports/TEST-org.apache.phoenix.hbase.index.write.TestWALRecoveryCaching.xml=phoenix-core/target/surefire-reports/TEST-org.apache.phoenix.hbase.index.write.TestWALRecoveryCaching.xml, phoenix-pherf/target/failsafe-reports/null-output.txt=phoenix-pherf/target/failsafe-reports/null-output.txt, phoenix-core/target/surefire-reports/org.apache.phoenix.util.Base62EncoderTest.txt=phoenix-core/target/surefire-reports/org.apache.phoenix.util.Base62EncoderTest.txt, phoenix-hive/target/hive/hive-localDir-nm-0_1/usercache/jenkins/filecache/35/phoenix-4.12.0-HBase-1.3-SNAPSHOT-hive.jar=phoenix-hive/target/hive/hive-localDir-nm-0_1/usercache/jenkins/filecache/35/phoenix-4.12.0-HBase-1.3-SNAPSHOT-hive.jar, phoenix-core/target/surefire-reports/org.apache.phoenix.jdbc.PhoenixResultSetMetadataTest-output.txt=phoenix-core/target/surefire-reports/org.apache.phoenix.jdbc.PhoenixResultSetMetadataTest-output.txt, phoenix-core/target/surefire-reports/org.apache.phoenix.query.ParallelIteratorsSplitTest.txt=phoenix-core/target/surefire-reports/org.apache.phoenix.query.ParallelIteratorsSplitTest.txt, phoenix-core/target/surefire-reports/TEST-org.apache.phoenix.expression.ILikeExpressionTest.xml=phoenix-core/target/surefire-reports/TEST-org.apache.phoenix.expression.ILikeExpressionTest.xml, phoenix-core/target/surefire-reports/org.apache.phoenix.expression.ArrayToStringFunctionTest.txt=phoenix-core/target/surefire-reports/org.apache.phoenix.expression.ArrayToStringFunctionTest.txt, phoenix-core/target/surefire-reports/org.apache.phoenix.hbase.index.covered.TestCoveredIndexSpecifierBuilder.txt=phoenix-core/target/surefire-reports/org.apache.phoenix.hbase.index.covered.TestCoveredIndexSpecifierBuilder.txt, phoenix-pig/target/failsafe-reports/org.apache.phoenix.pig.PhoenixHBaseLoaderIT.txt=phoenix-pig/target/failsafe-reports/org.apache.phoenix.pig.PhoenixHBaseLoaderIT.txt, phoenix-core/target/surefire-reports/TEST-org.apache.phoenix.schema.SaltingUtilTest.xml=phoenix-core/target/surefire-reports/TEST-org.apache.phoenix.schema.SaltingUtilTest.xml, phoenix-flume/target/failsafe-reports/null-output.txt=phoenix-flume/target/failsafe-reports/null-output.txt, phoenix-core/target/surefire-reports/org.apache.phoenix.util.SequenceUtilTest.txt=phoenix-core/target/surefire-reports/org.apache.phoenix.util.SequenceUtilTest.txt, phoenix-core/target/surefire-reports/TEST-org.apache.phoenix.expression.CbrtFunctionTest.xml=phoenix-core/target/surefire-reports/TEST-org.apache.phoenix.expression.CbrtFunctionTest.xml, phoenix-hive/target/dependency/hadoop-mapreduce-client-core-2.7.1.jar=phoenix-hive/target/dependency/hadoop-mapreduce-client-core-2.7.1.jar, phoenix-hive/target/dependency/commons-math3-3.1.1.jar=phoenix-hive/target/dependency/commons-math3-3.1.1.jar, phoenix-hive/target/dependency/hbase-hadoop-compat-1.3.1.jar=phoenix-hive/target/dependency/hbase-hadoop-compat-1.3.1.jar, phoenix-hive/target/dependency/hbase-testing-util-1.3.1.jar=phoenix-hive/target/dependency/hbase-testing-util-1.3.1.jar, phoenix-core/target/surefire-reports/org.apache.phoenix.trace.TraceSpanReceiverTest.txt=phoenix-core/target/surefire-reports/org.apache.phoenix.trace.TraceSpanReceiverTest.txt, phoenix-flume/target/failsafe-reports/org.apache.phoenix.flume.PhoenixSinkIT-output.txt=phoenix-flume/target/failsafe-reports/org.apache.phoenix.flume.PhoenixSinkIT-output.txt, phoenix-hive/target/MiniMRCluster_2090392667/MiniMRCluster_2090392667-localDir-nm-0_3/usercache/jenkins/filecache/56/hive-exec-1.2.1.jar=phoenix-hive/target/MiniMRCluster_2090392667/MiniMRCluster_2090392667-localDir-nm-0_3/usercache/jenkins/filecache/56/hive-exec-1.2.1.jar, phoenix-core/target/surefire-reports/TEST-org.apache.phoenix.execute.DescVarLengthFastByteComparisonsTest.xml=phoenix-core/target/surefire-reports/TEST-org.apache.phoenix.execute.DescVarLengthFastByteComparisonsTest.xml, phoenix-core/target/surefire-reports/TEST-org.apache.phoenix.jdbc.PhoenixResultSetMetadataTest.xml=phoenix-core/target/surefire-reports/TEST-org.apache.phoenix.jdbc.PhoenixResultSetMetadataTest.xml, phoenix-hive/target/dependency/hadoop-common-2.7.1.jar=phoenix-hive/target/dependency/hadoop-common-2.7.1.jar, phoenix-hive/target/dependency/commons-beanutils-1.7.0.jar=phoenix-hive/target/dependency/commons-beanutils-1.7.0.jar, phoenix-core/target/surefire-reports/TEST-org.apache.phoenix.util.json.JsonUpsertExecutorTest.xml=phoenix-core/target/surefire-reports/TEST-org.apache.phoenix.util.json.JsonUpsertExecutorTest.xml, phoenix-hive/target/dependency/jsch-0.1.42.jar=phoenix-hive/target/dependency/jsch-0.1.42.jar, phoenix-core/target/surefire-reports/TEST-org.apache.phoenix.compile.CreateTableCompilerTest.xml=phoenix-core/target/surefire-reports/TEST-org.apache.phoenix.compile.CreateTableCompilerTest.xml, phoenix-core/target/surefire-reports/org.apache.phoenix.expression.CbrtFunctionTest.txt=phoenix-core/target/surefire-reports/org.apache.phoenix.expression.CbrtFunctionTest.txt, phoenix-hive/target/hive/hive-localDir-nm-0_3/usercache/jenkins/filecache/40/hadoop-common-2.7.1.jar=phoenix-hive/target/hive/hive-localDir-nm-0_3/usercache/jenkins/filecache/40/hadoop-common-2.7.1.jar, phoenix-pig/target/surefire-reports/TEST-org.apache.phoenix.pig.util.SqlQueryToColumnInfoFunctionTest.xml=phoenix-pig/target/surefire-reports/TEST-org.apache.phoenix.pig.util.SqlQueryToColumnInfoFunctionTest.xml, phoenix-hive/target/dependency/hadoop-mapreduce-client-hs-2.7.1.jar=phoenix-hive/target/dependency/hadoop-mapreduce-client-hs-2.7.1.jar, phoenix-core/target/surefire-reports/org.apache.phoenix.mapreduce.CsvToKeyValueMapperTest.txt=phoenix-core/target/surefire-reports/org.apache.phoenix.mapreduce.CsvToKeyValueMapperTest.txt, phoenix-kafka/target/failsafe-reports/TEST-org.apache.phoenix.kafka.PhoenixConsumerIT.xml=phoenix-kafka/target/failsafe-reports/TEST-org.apache.phoenix.kafka.PhoenixConsumerIT.xml, phoenix-core/target/surefire-reports/TEST-org.apache.phoenix.filter.SkipScanFilterIntersectTest.xml=phoenix-core/target/surefire-reports/TEST-org.apache.phoenix.filter.SkipScanFilterIntersectTest.xml, phoenix-core/target/surefire-reports/org.apache.phoenix.iterate.ConcatResultIteratorTest.txt=phoenix-core/target/surefire-reports/org.apache.phoenix.iterate.ConcatResultIteratorTest.txt, phoenix-core/target/surefire-reports/TEST-org.apache.phoenix.hbase.index.covered.data.TestLocalTable.xml=phoenix-core/target/surefire-reports/TEST-org.apache.phoenix.hbase.index.covered.data.TestLocalTable.xml, phoenix-core/target/surefire-reports/org.apache.phoenix.schema.MutationTest.txt=phoenix-core/target/surefire-reports/org.apache.phoenix.schema.MutationTest.txt, phoenix-core/target/surefire-reports/TEST-org.apache.phoenix.expression.ColumnExpressionTest.xml=phoenix-core/target/surefire-reports/TEST-org.apache.phoenix.expression.ColumnExpressionTest.xml, phoenix-hive/target/dependency/jackson-jaxrs-1.9.2.jar=phoenix-hive/target/dependency/jackson-jaxrs-1.9.2.jar, phoenix-core/target/surefire-reports/org.apache.phoenix.mapreduce.BulkLoadToolTest.txt=phoenix-core/target/surefire-reports/org.apache.phoenix.mapreduce.BulkLoadToolTest.txt, phoenix-core/target/surefire-reports/TEST-org.apache.phoenix.compile.WhereCompilerTest.xml=phoenix-core/target/surefire-reports/TEST-org.apache.phoenix.compile.WhereCompilerTest.xml, phoenix-core/target/surefire-reports/org.apache.phoenix.parse.CastParseNodeTest.txt=phoenix-core/target/surefire-reports/org.apache.phoenix.parse.CastParseNodeTest.txt, phoenix-hive/target/hive/hive-localDir-nm-0_2/usercache/jenkins/filecache/25/hadoop-common-2.7.1.jar=phoenix-hive/target/hive/hive-localDir-nm-0_2/usercache/jenkins/filecache/25/hadoop-common-2.7.1.jar, phoenix-core/target/surefire-reports/TEST-org.apache.phoenix.schema.types.PrimitiveBooleanPhoenixArrayToStringTest.xml=phoenix-core/target/surefire-reports/TEST-org.apache.phoenix.schema.types.PrimitiveBooleanPhoenixArrayToStringTest.xml, phoenix-core/target/surefire-reports/TEST-org.apache.phoenix.schema.types.PrimitiveLongPhoenixArrayToStringTest.xml=phoenix-core/target/surefire-reports/TEST-org.apache.phoenix.schema.types.PrimitiveLongPhoenixArrayToStringTest.xml, phoenix-hive/target/dependency/hbase-prefix-tree-1.3.1.jar=phoenix-hive/target/dependency/hbase-prefix-tree-1.3.1.jar, phoenix-hive/target/dependency/jersey-client-1.9.jar=phoenix-hive/target/dependency/jersey-client-1.9.jar, phoenix-hive/target/dependency/avro-1.7.4.jar=phoenix-hive/target/dependency/avro-1.7.4.jar, phoenix-hive/target/dependency/hbase-server-1.3.1.jar=phoenix-hive/target/dependency/hbase-server-1.3.1.jar, phoenix-hive/target/hive/hive-localDir-nm-0_1/usercache/jenkins/filecache/20/phoenix-4.12.0-HBase-1.3-SNAPSHOT-hive.jar=phoenix-hive/target/hive/hive-localDir-nm-0_1/usercache/jenkins/filecache/20/phoenix-4.12.0-HBase-1.3-SNAPSHOT-hive.jar, phoenix-core/target/surefire-reports/org.apache.phoenix.hbase.index.util.TestIndexManagementUtil.txt=phoenix-core/target/surefire-reports/org.apache.phoenix.hbase.index.util.TestIndexManagementUtil.txt, phoenix-hive/target/dependency/hadoop-yarn-server-web-proxy-2.6.0.jar=phoenix-hive/target/dependency/hadoop-yarn-server-web-proxy-2.6.0.jar, phoenix-queryserver/target/phoenix-queryserver-4.12.0-HBase-1.3-SNAPSHOT-sources.jar=phoenix-queryserver/target/phoenix-queryserver-4.12.0-HBase-1.3-SNAPSHOT-sources.jar, phoenix-hive/target/dependency/hbase-client-1.3.1.jar=phoenix-hive/target/dependency/hbase-client-1.3.1.jar, phoenix-core/target/surefire-reports/TEST-org.apache.phoenix.schema.types.PrimitiveBytePhoenixArrayToStringTest.xml=phoenix-core/target/surefire-reports/TEST-org.apache.phoenix.schema.types.PrimitiveBytePhoenixArrayToStringTest.xml, phoenix-core/target/surefire-reports/org.apache.phoenix.expression.OctetLengthFunctionTest.txt=phoenix-core/target/surefire-reports/org.apache.phoenix.expression.OctetLengthFunctionTest.txt, phoenix-hive/target/dependency/hadoop-hdfs-2.7.1-tests.jar=phoenix-hive/target/dependency/hadoop-hdfs-2.7.1-tests.jar, phoenix-hive/target/dependency/antlr-runtime-3.5.2.jar=phoenix-hive/target/dependency/antlr-runtime-3.5.2.jar, phoenix-pig/target/surefire-reports/TEST-org.apache.phoenix.pig.util.TypeUtilTest.xml=phoenix-pig/target/surefire-reports/TEST-org.apache.phoenix.pig.util.TypeUtilTest.xml, phoenix-core/target/surefire-reports/org.apache.phoenix.hbase.index.covered.TestColumnTracker.txt=phoenix-core/target/surefire-reports/org.apache.phoenix.hbase.index.covered.TestColumnTracker.txt, phoenix-hive/target/dependency/jaxb-api-2.2.2.jar=phoenix-hive/target/dependency/jaxb-api-2.2.2.jar, phoenix-pherf/target/phoenix-pherf-4.12.0-HBase-1.3-SNAPSHOT.jar=phoenix-pherf/target/phoenix-pherf-4.12.0-HBase-1.3-SNAPSHOT.jar, phoenix-core/target/surefire-reports/org.apache.phoenix.query.KeyRangeUnionTest.txt=phoenix-core/target/surefire-reports/org.apache.phoenix.query.KeyRangeUnionTest.txt, phoenix-pig/target/surefire-reports/org.apache.phoenix.pig.util.TypeUtilTest.txt=phoenix-pig/target/surefire-reports/org.apache.phoenix.pig.util.TypeUtilTest.txt, phoenix-core/target/surefire-reports/org.apache.phoenix.hbase.index.parallel.TestThreadPoolManager-output.txt=phoenix-core/target/surefire-reports/org.apache.phoenix.hbase.index.parallel.TestThreadPoolManager-output.txt, phoenix-hive/target/dependency/httpclient-4.0.1.jar=phoenix-hive/target/dependency/httpclient-4.0.1.jar, bin/readme.txt=bin/readme.txt, phoenix-hive/target/dependency/tephra-hbase-compat-1.1-0.12.0-incubating.jar=phoenix-hive/target/dependency/tephra-hbase-compat-1.1-0.12.0-incubating.jar, phoenix-core/target/surefire-reports/TEST-org.apache.phoenix.schema.types.PVarcharArrayToStringTest.xml=phoenix-core/target/surefire-reports/TEST-org.apache.phoenix.schema.types.PVarcharArrayToStringTest.xml, phoenix-core/target/surefire-reports/org.apache.phoenix.hbase.index.covered.NonTxIndexBuilderTest.txt=phoenix-core/target/surefire-reports/org.apache.phoenix.hbase.index.covered.NonTxIndexBuilderTest.txt, phoenix-hive/target/dependency/hbase-hadoop2-compat-1.3.1-tests.jar=phoenix-hive/target/dependency/hbase-hadoop2-compat-1.3.1-tests.jar, phoenix-flume/target/phoenix-flume-4.12.0-HBase-1.3-SNAPSHOT.jar=phoenix-flume/target/phoenix-flume-4.12.0-HBase-1.3-SNAPSHOT.jar, phoenix-core/target/surefire-reports/org.apache.phoenix.index.IndexMaintainerTest.txt=phoenix-core/target/surefire-reports/org.apache.phoenix.index.IndexMaintainerTest.txt, phoenix-hive/target/MiniMRCluster_2090392667/MiniMRCluster_2090392667-localDir-nm-0_1/usercache/jenkins/filecache/43/phoenix-4.12.0-HBase-1.3-SNAPSHOT-hive.jar=phoenix-hive/target/MiniMRCluster_2090392667/MiniMRCluster_2090392667-localDir-nm-0_1/usercache/jenkins/filecache/43/phoenix-4.12.0-HBase-1.3-SNAPSHOT-hive.jar, phoenix-core/target/surefire-reports/org.apache.phoenix.query.PropertyPolicyProviderTest-output.txt=phoenix-core/target/surefire-reports/org.apache.phoenix.query.PropertyPolicyProviderTest-output.txt, phoenix-queryserver/target/failsafe-reports/failsafe-summary.xml=phoenix-queryserver/target/failsafe-reports/failsafe-summary.xml, phoenix-core/target/surefire-reports/org.apache.phoenix.hbase.index.write.recovery.TestPerRegionIndexWriteCache.txt=phoenix-core/target/surefire-reports/org.apache.phoenix.hbase.index.write.recovery.TestPerRegionIndexWriteCache.txt, phoenix-hive/target/hive/hive-localDir-nm-0_0/usercache/jenkins/filecache/11/phoenix-4.12.0-HBase-1.3-SNAPSHOT-hive.jar=phoenix-hive/target/hive/hive-localDir-nm-0_0/usercache/jenkins/filecache/11/phoenix-4.12.0-HBase-1.3-SNAPSHOT-hive.jar, bin/performance.py=bin/performance.py, phoenix-core/target/surefire-reports/TEST-org.apache.phoenix.hbase.index.covered.filter.TestApplyAndFilterDeletesFilter.xml=phoenix-core/target/surefire-reports/TEST-org.apache.phoenix.hbase.index.covered.filter.TestApplyAndFilterDeletesFilter.xml, bin/pherf-cluster.py=bin/pherf-cluster.py, phoenix-core/target/surefire-reports/org.apache.phoenix.index.automated.MRJobSubmitterTest-output.txt=phoenix-core/target/surefire-reports/org.apache.phoenix.index.automated.MRJobSubmitterTest-output.txt, phoenix-core/target/surefire-reports/org.apache.phoenix.util.LogUtilTest.txt=phoenix-core/target/surefire-reports/org.apache.phoenix.util.LogUtilTest.txt, phoenix-queryserver/target/surefire-reports/TEST-org.apache.phoenix.DriverCohabitationTest.xml=phoenix-queryserver/target/surefire-reports/TEST-org.apache.phoenix.DriverCohabitationTest.xml, phoenix-core/target/surefire-reports/TEST-org.apache.phoenix.trace.TraceSpanReceiverTest.xml=phoenix-core/target/surefire-reports/TEST-org.apache.phoenix.trace.TraceSpanReceiverTest.xml, phoenix-core/target/surefire-reports/org.apache.phoenix.iterate.OrderedResultIteratorTest.txt=phoenix-core/target/surefire-reports/org.apache.phoenix.iterate.OrderedResultIteratorTest.txt, phoenix-hive/target/dependency/datanucleus-rdbms-3.2.9.jar=phoenix-hive/target/dependency/datanucleus-rdbms-3.2.9.jar, phoenix-hive/target/dependency/jcip-annotations-1.0-1.jar=phoenix-hive/target/dependency/jcip-annotations-1.0-1.jar, phoenix-hive/target/dependency/slf4j-log4j12-1.7.5.jar=phoenix-hive/target/dependency/slf4j-log4j12-1.7.5.jar, phoenix-core/target/surefire-reports/org.apache.phoenix.mapreduce.util.IndexColumnNamesTest.txt=phoenix-core/target/surefire-reports/org.apache.phoenix.mapreduce.util.IndexColumnNamesTest.txt, phoenix-core/target/surefire-reports/org.apache.phoenix.schema.types.PDataTypeTest.txt=phoenix-core/target/surefire-reports/org.apache.phoenix.schema.types.PDataTypeTest.txt, phoenix-core/target/surefire-reports/TEST-org.apache.phoenix.util.QueryUtilTest.xml=phoenix-core/target/surefire-reports/TEST-org.apache.phoenix.util.QueryUtilTest.xml, phoenix-core/target/surefire-reports/TEST-org.apache.phoenix.expression.function.BuiltinFunctionConstructorTest.xml=phoenix-core/target/surefire-reports/TEST-org.apache.phoenix.expression.function.BuiltinFunctionConstructorTest.xml, phoenix-core/target/surefire-reports/org.apache.phoenix.compile.QueryOptimizerTest.txt=phoenix-core/target/surefire-reports/org.apache.phoenix.compile.QueryOptimizerTest.txt, phoenix-hive/target/MiniMRCluster_2090392667/MiniMRCluster_2090392667-localDir-nm-0_3/usercache/jenkins/filecache/66/hadoop-common-2.7.1.jar=phoenix-hive/target/MiniMRCluster_2090392667/MiniMRCluster_2090392667-localDir-nm-0_3/usercache/jenkins/filecache/66/hadoop-common-2.7.1.jar, phoenix-hive/target/dependency/hive-shims-1.2.1.jar=phoenix-hive/target/dependency/hive-shims-1.2.1.jar, phoenix-hive/target/dependency/findbugs-annotations-1.3.9-1.jar=phoenix-hive/target/dependency/findbugs-annotations-1.3.9-1.jar, phoenix-core/target/surefire-reports/TEST-org.apache.phoenix.schema.SequenceAllocationTest.xml=phoenix-core/target/surefire-reports/TEST-org.apache.phoenix.schema.SequenceAllocationTest.xml, phoenix-hive/target/failsafe-reports/null-output.txt=phoenix-hive/target/failsafe-reports/null-output.txt, bin/hbase-site.xml=bin/hbase-site.xml, phoenix-hive/target/dependency/jersey-core-1.9.jar=phoenix-hive/target/dependency/jersey-core-1.9.jar, phoenix-core/target/surefire-reports/org.apache.phoenix.expression.StringToArrayFunctionTest.txt=phoenix-core/target/surefire-reports/org.apache.phoenix.expression.StringToArrayFunctionTest.txt, phoenix-core/target/surefire-reports/org.apache.phoenix.hbase.index.covered.data.TestLocalTable.txt=phoenix-core/target/surefire-reports/org.apache.phoenix.hbase.index.covered.data.TestLocalTable.txt, phoenix-hive/target/MiniMRCluster_2090392667/MiniMRCluster_2090392667-localDir-nm-0_0/usercache/jenkins/filecache/52/hive-exec-1.2.1.jar=phoenix-hive/target/MiniMRCluster_2090392667/MiniMRCluster_2090392667-localDir-nm-0_0/usercache/jenkins/filecache/52/hive-exec-1.2.1.jar, phoenix-pig/target/failsafe-reports/TEST-org.apache.phoenix.pig.PhoenixHBaseStorerIT.xml=phoenix-pig/target/failsafe-reports/TEST-org.apache.phoenix.pig.PhoenixHBaseStorerIT.xml, bin/sqlline.py=bin/sqlline.py, phoenix-core/target/surefire-reports/org.apache.hadoop.hbase.ipc.PhoenixIndexRpcSchedulerTest.txt=phoenix-core/target/surefire-reports/org.apache.hadoop.hbase.ipc.PhoenixIndexRpcSchedulerTest.txt, phoenix-hive/target/dependency/commons-httpclient-3.0.1.jar=phoenix-hive/target/dependency/commons-httpclient-3.0.1.jar, phoenix-core/target/surefire-reports/org.apache.phoenix.query.KeyRangeIntersectTest.txt=phoenix-core/target/surefire-reports/org.apache.phoenix.query.KeyRangeIntersectTest.txt, phoenix-hive/target/dependency/activation-1.1.jar=phoenix-hive/target/dependency/activation-1.1.jar, phoenix-core/target/surefire-reports/TEST-org.apache.phoenix.expression.SqrtFunctionTest.xml=phoenix-core/target/surefire-reports/TEST-org.apache.phoenix.expression.SqrtFunctionTest.xml, phoenix-core/target/surefire-reports/org.apache.phoenix.expression.NullValueTest-output.txt=phoenix-core/target/surefire-reports/org.apache.phoenix.expression.NullValueTest-output.txt, phoenix-core/target/surefire-reports/org.apache.phoenix.schema.types.PrimitiveFloatPhoenixArrayToStringTest.txt=phoenix-core/target/surefire-reports/org.apache.phoenix.schema.types.PrimitiveFloatPhoenixArrayToStringTest.txt, phoenix-hive/target/dependency/xmlenc-0.52.jar=phoenix-hive/target/dependency/xmlenc-0.52.jar, phoenix-hive/target/hive/hive-localDir-nm-0_0/usercache/jenkins/filecache/37/hadoop-common-2.7.1.jar=phoenix-hive/target/hive/hive-localDir-nm-0_0/usercache/jenkins/filecache/37/hadoop-common-2.7.1.jar, phoenix-kafka/target/failsafe-reports/failsafe-summary.xml=phoenix-kafka/target/failsafe-reports/failsafe-summary.xml, phoenix-hive/target/dependency/commons-compiler-2.7.6.jar=phoenix-hive/target/dependency/commons-compiler-2.7.6.jar, phoenix-core/target/surefire-reports/org.apache.phoenix.schema.SchemaUtilTest.txt=phoenix-core/target/surefire-reports/org.apache.phoenix.schema.SchemaUtilTest.txt, phoenix-hive/target/MiniMRCluster_2090392667/MiniMRCluster_2090392667-localDir-nm-0_2/usercache/jenkins/filecache/65/hive-exec-1.2.1.jar=phoenix-hive/target/MiniMRCluster_2090392667/MiniMRCluster_2090392667-localDir-nm-0_2/usercache/jenkins/filecache/65/hive-exec-1.2.1.jar, phoenix-queryserver/target/surefire-reports/org.apache.phoenix.queryserver.server.RemoteUserExtractorFactoryTest.txt=phoenix-queryserver/target/surefire-reports/org.apache.phoenix.queryserver.server.RemoteUserExtractorFactoryTest.txt, phoenix-core/target/surefire-reports/TEST-org.apache.phoenix.expression.OctetLengthFunctionTest.xml=phoenix-core/target/surefire-reports/TEST-org.apache.phoenix.expression.OctetLengthFunctionTest.xml, phoenix-core/target/surefire-reports/org.apache.phoenix.query.QueryPlanTest.txt=phoenix-core/target/surefire-reports/org.apache.phoenix.query.QueryPlanTest.txt, phoenix-pherf/target/surefire-reports/org.apache.phoenix.pherf.ResourceTest.txt=phoenix-pherf/target/surefire-reports/org.apache.phoenix.pherf.ResourceTest.txt, phoenix-hive/target/dependency/twill-discovery-core-0.8.0.jar=phoenix-hive/target/dependency/twill-discovery-core-0.8.0.jar, phoenix-pherf/target/surefire-reports/org.apache.phoenix.pherf.RowCalculatorTest.txt=phoenix-pherf/target/surefire-reports/org.apache.phoenix.pherf.RowCalculatorTest.txt, phoenix-core/target/surefire-reports/TEST-org.apache.phoenix.hbase.index.covered.TestCoveredIndexSpecifierBuilder.xml=phoenix-core/target/surefire-reports/TEST-org.apache.phoenix.hbase.index.covered.TestCoveredIndexSpecifierBuilder.xml, phoenix-spark/target/phoenix-spark-4.12.0-HBase-1.3-SNAPSHOT-tests.jar=phoenix-spark/target/phoenix-spark-4.12.0-HBase-1.3-SNAPSHOT-tests.jar, phoenix-core/target/surefire-reports/org.apache.phoenix.schema.types.PrimitiveBytePhoenixArrayToStringTest.txt=phoenix-core/target/surefire-reports/org.apache.phoenix.schema.types.PrimitiveBytePhoenixArrayToStringTest.txt, phoenix-hive/target/dependency/jdo-api-3.0.1.jar=phoenix-hive/target/dependency/jdo-api-3.0.1.jar, src/main/config/checkstyle/header.txt=src/main/config/checkstyle/header.txt, phoenix-hive/target/dependency/servlet-api-2.5-6.1.14.jar=phoenix-hive/target/dependency/servlet-api-2.5-6.1.14.jar, phoenix-hive/target/hive/hive-localDir-nm-0_2/usercache/jenkins/filecache/36/hive-exec-1.2.1.jar=phoenix-hive/target/hive/hive-localDir-nm-0_2/usercache/jenkins/filecache/36/hive-exec-1.2.1.jar, phoenix-hive/target/dependency/apache-log4j-extras-1.2.17.jar=phoenix-hive/target/dependency/apache-log4j-extras-1.2.17.jar, phoenix-core/target/surefire-reports/org.apache.phoenix.schema.PCharPadTest.txt=phoenix-core/target/surefire-reports/org.apache.phoenix.schema.PCharPadTest.txt, phoenix-hive/target/dependency/ivy-2.4.0.jar=phoenix-hive/target/dependency/ivy-2.4.0.jar, phoenix-hive/target/failsafe-reports/TEST-org.apache.phoenix.hive.HiveMapReduceIT.xml=phoenix-hive/target/failsafe-reports/TEST-org.apache.phoenix.hive.HiveMapReduceIT.xml, target/phoenix-4.12.0-HBase-1.3-SNAPSHOT-tests.jar=target/phoenix-4.12.0-HBase-1.3-SNAPSHOT-tests.jar, phoenix-pherf/target/surefire-reports/TEST-org.apache.phoenix.pherf.ConfigurationParserTest.xml=phoenix-pherf/target/surefire-reports/TEST-org.apache.phoenix.pherf.ConfigurationParserTest.xml, phoenix-flume/target/failsafe-reports/org.apache.phoenix.flume.RegexEventSerializerIT.txt=phoenix-flume/target/failsafe-reports/org.apache.phoenix.flume.RegexEventSerializerIT.txt, phoenix-core/target/surefire-reports/org.apache.phoenix.query.ConnectionlessTest-output.txt=phoenix-core/target/surefire-reports/org.apache.phoenix.query.ConnectionlessTest-output.txt, phoenix-core/target/surefire-reports/TEST-org.apache.phoenix.parse.CursorParserTest.xml=phoenix-core/target/surefire-reports/TEST-org.apache.phoenix.parse.CursorParserTest.xml, phoenix-hive/target/dependency/twill-zookeeper-0.8.0.jar=phoenix-hive/target/dependency/twill-zookeeper-0.8.0.jar, phoenix-hive/target/dependency/eigenbase-properties-1.1.5.jar=phoenix-hive/target/dependency/eigenbase-properties-1.1.5.jar, phoenix-hive/target/dependency/mail-1.4.1.jar=phoenix-hive/target/dependency/mail-1.4.1.jar, bin/daemon.py=bin/daemon.py, phoenix-hive/target/dependency/metrics-core-3.1.0.jar=phoenix-hive/target/dependency/metrics-core-3.1.0.jar, phoenix-pig/target/failsafe-reports/failsafe-summary.xml=phoenix-pig/target/failsafe-reports/failsafe-summary.xml, phoenix-core/target/surefire-reports/org.apache.phoenix.hbase.index.parallel.TestThreadPoolBuilder.txt=phoenix-core/target/surefire-reports/org.apache.phoenix.hbase.index.parallel.TestThreadPoolBuilder.txt, phoenix-core/target/surefire-reports/org.apache.phoenix.query.OrderByTest-output.txt=phoenix-core/target/surefire-reports/org.apache.phoenix.query.OrderByTest-output.txt, phoenix-core/target/surefire-reports/TEST-org.apache.phoenix.expression.CoerceExpressionTest.xml=phoenix-core/target/surefire-reports/TEST-org.apache.phoenix.expression.CoerceExpressionTest.xml, phoenix-core/target/surefire-reports/org.apache.phoenix.mapreduce.CsvBulkImportUtilTest.txt=phoenix-core/target/surefire-reports/org.apache.phoenix.mapreduce.CsvBulkImportUtilTest.txt, phoenix-core/target/surefire-reports/org.apache.phoenix.util.PhoenixContextExecutorTest.txt=phoenix-core/target/surefire-reports/org.apache.phoenix.util.PhoenixContextExecutorTest.txt, phoenix-core/target/surefire-reports/org.apache.phoenix.util.csv.CsvUpsertExecutorTest.txt=phoenix-core/target/surefire-reports/org.apache.phoenix.util.csv.CsvUpsertExecutorTest.txt, phoenix-hive/target/dependency/hbase-hadoop2-compat-1.3.1.jar=phoenix-hive/target/dependency/hbase-hadoop2-compat-1.3.1.jar, phoenix-hive/target/dependency/hbase-hadoop-compat-1.3.1-tests.jar=phoenix-hive/target/dependency/hbase-hadoop-compat-1.3.1-tests.jar, phoenix-core/target/surefire-reports/TEST-org.apache.phoenix.schema.MutationTest.xml=phoenix-core/target/surefire-reports/TEST-org.apache.phoenix.schema.MutationTest.xml, phoenix-flume/target/phoenix-flume-4.12.0-HBase-1.3-SNAPSHOT-sources.jar=phoenix-flume/target/phoenix-flume-4.12.0-HBase-1.3-SNAPSHOT-sources.jar, phoenix-core/target/surefire-reports/org.apache.phoenix.execute.LiteralResultIteratorPlanTest.txt=phoenix-core/target/surefire-reports/org.apache.phoenix.execute.LiteralResultIteratorPlanTest.txt, phoenix-hive/target/surefire-reports/org.apache.phoenix.hive.query.PhoenixQueryBuilderTest-output.txt=phoenix-hive/target/surefire-reports/org.apache.phoenix.hive.query.PhoenixQueryBuilderTest-output.txt, bin/hadoop-metrics2-phoenix.properties=bin/hadoop-metrics2-phoenix.properties, phoenix-hive/target/dependency/hadoop-minicluster-2.7.1.jar=phoenix-hive/target/dependency/hadoop-minicluster-2.7.1.jar, phoenix-core/target/surefire-reports/org.apache.phoenix.expression.SqrtFunctionTest.txt=phoenix-core/target/surefire-reports/org.apache.phoenix.expression.SqrtFunctionTest.txt, phoenix-core/target/surefire-reports/org.apache.phoenix.schema.SaltingUtilTest.txt=phoenix-core/target/surefire-reports/org.apache.phoenix.schema.SaltingUtilTest.txt, phoenix-pig/target/failsafe-reports/TEST-org.apache.phoenix.pig.udf.ReserveNSequenceTestIT.xml=phoenix-pig/target/failsafe-reports/TEST-org.apache.phoenix.pig.udf.ReserveNSequenceTestIT.xml, phoenix-core/target/surefire-reports/TEST-org.apache.phoenix.expression.DeterminismTest.xml=phoenix-core/target/surefire-reports/TEST-org.apache.phoenix.expression.DeterminismTest.xml, phoenix-core/target/surefire-reports/TEST-org.apache.phoenix.query.PhoenixStatsCacheRemovalListenerTest.xml=phoenix-core/target/surefire-reports/TEST-org.apache.phoenix.query.PhoenixStatsCacheRemovalListenerTest.xml, phoenix-core/target/surefire-reports/org.apache.phoenix.compile.StatementHintsCompilationTest.txt=phoenix-core/target/surefire-reports/org.apache.phoenix.compile.StatementHintsCompilationTest.txt, phoenix-pherf/target/surefire-reports/org.apache.phoenix.pherf.RuleGeneratorTest.txt=phoenix-pherf/target/surefire-reports/org.apache.phoenix.pherf.RuleGeneratorTest.txt, phoenix-core/target/surefire-reports/org.apache.phoenix.hbase.index.covered.LocalTableStateTest.txt=phoenix-core/target/surefire-reports/org.apache.phoenix.hbase.index.covered.LocalTableStateTest.txt, phoenix-core/target/surefire-reports/TEST-org.apache.phoenix.expression.ArithmeticOperationTest.xml=phoenix-core/target/surefire-reports/TEST-org.apache.phoenix.expression.ArithmeticOperationTest.xml, phoenix-core/target/surefire-reports/org.apache.phoenix.mapreduce.util.IndexColumnNamesTest-output.txt=phoenix-core/target/surefire-reports/org.apache.phoenix.mapreduce.util.IndexColumnNamesTest-output.txt, phoenix-core/target/surefire-reports/org.apache.phoenix.query.ScannerLeaseRenewalTest-output.txt=phoenix-core/target/surefire-reports/org.apache.phoenix.query.ScannerLeaseRenewalTest-output.txt, phoenix-pig/target/failsafe-reports/org.apache.phoenix.pig.PhoenixHBaseStorerIT-output.txt=phoenix-pig/target/failsafe-reports/org.apache.phoenix.pig.PhoenixHBaseStorerIT-output.txt, phoenix-core/target/surefire-reports/TEST-org.apache.phoenix.util.ScanUtilTest.xml=phoenix-core/target/surefire-reports/TEST-org.apache.phoenix.util.ScanUtilTest.xml, phoenix-queryserver/target/surefire-reports/org.apache.phoenix.queryserver.server.PhoenixDoAsCallbackTest-output.txt=phoenix-queryserver/target/surefire-reports/org.apache.phoenix.queryserver.server.PhoenixDoAsCallbackTest-output.txt, phoenix-core/target/surefire-reports/org.apache.phoenix.mapreduce.index.IndexScrutinyTableOutputTest-output.txt=phoenix-core/target/surefire-reports/org.apache.phoenix.mapreduce.index.IndexScrutinyTableOutputTest-output.txt, phoenix-core/target/surefire-reports/TEST-org.apache.phoenix.hbase.index.covered.LocalTableStateTest.xml=phoenix-core/target/surefire-reports/TEST-org.apache.phoenix.hbase.index.covered.LocalTableStateTest.xml, phoenix-core/target/surefire-reports/org.apache.phoenix.mapreduce.CsvBulkImportUtilTest-output.txt=phoenix-core/target/surefire-reports/org.apache.phoenix.mapreduce.CsvBulkImportUtilTest-output.txt, phoenix-hive/target/dependency/hive-shims-0.20S-1.2.1.jar=phoenix-hive/target/dependency/hive-shims-0.20S-1.2.1.jar, phoenix-queryserver/target/failsafe-reports/org.apache.phoenix.end2end.HttpParamImpersonationQueryServerIT.txt=phoenix-queryserver/target/failsafe-reports/org.apache.phoenix.end2end.HttpParamImpersonationQueryServerIT.txt, phoenix-hive/target/dependency/jamon-runtime-2.4.1.jar=phoenix-hive/target/dependency/jamon-runtime-2.4.1.jar, phoenix-core/target/surefire-reports/org.apache.phoenix.query.ConnectionQueryServicesImplTest.txt=phoenix-core/target/surefire-reports/org.apache.phoenix.query.ConnectionQueryServicesImplTest.txt, phoenix-hive/target/dependency/tools.jar=phoenix-hive/target/dependency/tools.jar, phoenix-hive/target/dependency/asm-commons-3.1.jar=phoenix-hive/target/dependency/asm-commons-3.1.jar, phoenix-core/target/surefire-reports/org.apache.phoenix.util.PhoenixRuntimeTest-output.txt=phoenix-core/target/surefire-reports/org.apache.phoenix.util.PhoenixRuntimeTest-output.txt, phoenix-core/target/surefire-reports/org.apache.phoenix.expression.DeterminismTest.txt=phoenix-core/target/surefire-reports/org.apache.phoenix.expression.DeterminismTest.txt, phoenix-hive/target/dependency/commons-collections-3.2.2.jar=phoenix-hive/target/dependency/commons-collections-3.2.2.jar, phoenix-core/target/surefire-reports/TEST-org.apache.phoenix.query.HBaseFactoryProviderTest.xml=phoenix-core/target/surefire-reports/TEST-org.apache.phoenix.query.HBaseFactoryProviderTest.xml, phoenix-hive/target/dependency/tez-examples-0.8.4.jar=phoenix-hive/target/dependency/tez-examples-0.8.4.jar, phoenix-hive/target/phoenix-4.12.0-HBase-1.3-SNAPSHOT-hive.jar=phoenix-hive/target/phoenix-4.12.0-HBase-1.3-SNAPSHOT-hive.jar, phoenix-core/target/surefire-reports/org.apache.phoenix.expression.function.InstrFunctionTest.txt=phoenix-core/target/surefire-reports/org.apache.phoenix.expression.function.InstrFunctionTest.txt, phoenix-hive/target/dependency/curator-client-2.12.0.jar=phoenix-hive/target/dependency/curator-client-2.12.0.jar, phoenix-hive/target/dependency/snappy-0.3.jar=phoenix-hive/target/dependency/snappy-0.3.jar, phoenix-core/target/surefire-reports/TEST-org.apache.phoenix.util.TenantIdByteConversionTest.xml=phoenix-core/target/surefire-reports/TEST-org.apache.phoenix.util.TenantIdByteConversionTest.xml, phoenix-core/target/surefire-reports/org.apache.phoenix.hbase.index.covered.update.TestIndexUpdateManager.txt=phoenix-core/target/surefire-reports/org.apache.phoenix.hbase.index.covered.update.TestIndexUpdateManager.txt, phoenix-core/target/surefire-reports/org.apache.phoenix.util.PhoenixEncodeDecodeTest-output.txt=phoenix-core/target/surefire-reports/org.apache.phoenix.util.PhoenixEncodeDecodeTest-output.txt, phoenix-hive/target/hive/hive-localDir-nm-0_2/usercache/jenkins/filecache/21/hive-exec-1.2.1.jar=phoenix-hive/target/hive/hive-localDir-nm-0_2/usercache/jenkins/filecache/21/hive-exec-1.2.1.jar, phoenix-core/target/surefire-reports/org.apache.phoenix.hbase.index.covered.filter.TestNewerTimestampFilter.txt=phoenix-core/target/surefire-reports/org.apache.phoenix.hbase.index.covered.filter.TestNewerTimestampFilter.txt, phoenix-core/target/surefire-reports/org.apache.phoenix.hbase.index.covered.NonTxIndexBuilderTest-output.txt=phoenix-core/target/surefire-reports/org.apache.phoenix.hbase.index.covered.NonTxIndexBuilderTest-output.txt, phoenix-core/target/surefire-reports/org.apache.phoenix.parse.BuiltInFunctionInfoTest.txt=phoenix-core/target/surefire-reports/org.apache.phoenix.parse.BuiltInFunctionInfoTest.txt, phoenix-core/target/surefire-reports/org.apache.phoenix.util.PropertiesUtilTest.txt=phoenix-core/target/surefire-reports/org.apache.phoenix.util.PropertiesUtilTest.txt, phoenix-core/target/surefire-reports/org.apache.phoenix.parse.CursorParserTest.txt=phoenix-core/target/surefire-reports/org.apache.phoenix.parse.CursorParserTest.txt, phoenix-hive/target/dependency/mockito-all-1.8.5.jar=phoenix-hive/target/dependency/mockito-all-1.8.5.jar, phoenix-flume/target/failsafe-reports/failsafe-summary.xml=phoenix-flume/target/failsafe-reports/failsafe-summary.xml, phoenix-hive/target/dependency/xercesImpl-2.9.1.jar=phoenix-hive/target/dependency/xercesImpl-2.9.1.jar, phoenix-core/target/surefire-reports/org.apache.phoenix.jdbc.PhoenixDriverTest-output.txt=phoenix-core/target/surefire-reports/org.apache.phoenix.jdbc.PhoenixDriverTest-output.txt, bin/phoenix_sandbox.py=bin/phoenix_sandbox.py, phoenix-hive/target/dependency/RoaringBitmap-0.4.9.jar=phoenix-hive/target/dependency/RoaringBitmap-0.4.9.jar, phoenix-hive/target/hive/hive-localDir-nm-0_1/usercache/jenkins/filecache/28/hadoop-common-2.7.1.jar=phoenix-hive/target/hive/hive-localDir-nm-0_1/usercache/jenkins/filecache/28/hadoop-common-2.7.1.jar, phoenix-queryserver/target/surefire-reports/org.apache.phoenix.DriverCohabitationTest-output.txt=phoenix-queryserver/target/surefire-reports/org.apache.phoenix.DriverCohabitationTest-output.txt, phoenix-core/target/surefire-reports/TEST-org.apache.phoenix.mapreduce.util.IndexColumnNamesTest.xml=phoenix-core/target/surefire-reports/TEST-org.apache.phoenix.mapreduce.util.IndexColumnNamesTest.xml, phoenix-flume/target/failsafe-reports/TEST-org.apache.phoenix.flume.CsvEventSerializerIT.xml=phoenix-flume/target/failsafe-reports/TEST-org.apache.phoenix.flume.CsvEventSerializerIT.xml, bin/log4j.properties=bin/log4j.properties, phoenix-hive/target/MiniMRCluster_2090392667/MiniMRCluster_2090392667-localDir-nm-0_0/usercache/jenkins/filecache/60/phoenix-4.12.0-HBase-1.3-SNAPSHOT-hive.jar=phoenix-hive/target/MiniMRCluster_2090392667/MiniMRCluster_2090392667-localDir-nm-0_0/usercache/jenkins/filecache/60/phoenix-4.12.0-HBase-1.3-SNAPSHOT-hive.jar, phoenix-hive/target/dependency/jasper-compiler-5.5.23.jar=phoenix-hive/target/dependency/jasper-compiler-5.5.23.jar, phoenix-pherf/target/failsafe-reports/TEST-org.apache.phoenix.pherf.PherfMainIT.xml=phoenix-pherf/target/failsafe-reports/TEST-org.apache.phoenix.pherf.PherfMainIT.xml, phoenix-flume/target/phoenix-flume-4.12.0-HBase-1.3-SNAPSHOT-tests.jar=phoenix-flume/target/phoenix-flume-4.12.0-HBase-1.3-SNAPSHOT-tests.jar, phoenix-hive/target/dependency/hadoop-yarn-server-common-2.7.1.jar=phoenix-hive/target/dependency/hadoop-yarn-server-common-2.7.1.jar, phoenix-tracing-webapp/target/phoenix-tracing-webapp-4.12.0-HBase-1.3-SNAPSHOT-sources.jar=phoenix-tracing-webapp/target/phoenix-tracing-webapp-4.12.0-HBase-1.3-SNAPSHOT-sources.jar, phoenix-core/target/surefire-reports/org.apache.phoenix.jdbc.PhoenixPreparedStatementTest-output.txt=phoenix-core/target/surefire-reports/org.apache.phoenix.jdbc.PhoenixPreparedStatementTest-output.txt, phoenix-hive/target/dependency/hbase-server-1.3.1-tests.jar=phoenix-hive/target/dependency/hbase-server-1.3.1-tests.jar, phoenix-hive/target/dependency/commons-lang-2.6.jar=phoenix-hive/target/dependency/commons-lang-2.6.jar, phoenix-core/target/surefire-reports/TEST-org.apache.phoenix.memory.MemoryManagerTest.xml=phoenix-core/target/surefire-reports/TEST-org.apache.phoenix.memory.MemoryManagerTest.xml, phoenix-hive/target/MiniMRCluster_2090392667/MiniMRCluster_2090392667-localDir-nm-0_1/usercache/jenkins/filecache/15/hive-exec-1.2.1.jar=phoenix-hive/target/MiniMRCluster_2090392667/MiniMRCluster_2090392667-localDir-nm-0_1/usercache/jenkins/filecache/15/hive-exec-1.2.1.jar, phoenix-core/target/surefire-reports/TEST-org.apache.phoenix.expression.ArrayToStringFunctionTest.xml=phoenix-core/target/surefire-reports/TEST-org.apache.phoenix.expression.ArrayToStringFunctionTest.xml, phoenix-core/target/surefire-reports/org.apache.phoenix.compile.WhereCompilerTest-output.txt=phoenix-core/target/surefire-reports/org.apache.phoenix.compile.WhereCompilerTest-output.txt, phoenix-pherf/target/surefire-reports/org.apache.phoenix.pherf.ResultTest.txt=phoenix-pherf/target/surefire-reports/org.apache.phoenix.pherf.ResultTest.txt, phoenix-core/target/surefire-reports/org.apache.phoenix.hbase.index.write.recovery.TestPerRegionIndexWriteCache-output.txt=phoenix-core/target/surefire-reports/org.apache.phoenix.hbase.index.write.recovery.TestPerRegionIndexWriteCache-output.txt, phoenix-core/target/surefire-reports/org.apache.phoenix.expression.ArithmeticOperationTest.txt=phoenix-core/target/surefire-reports/org.apache.phoenix.expression.ArithmeticOperationTest.txt, phoenix-core/target/surefire-reports/TEST-org.apache.phoenix.metrics.MetricTypeTest.xml=phoenix-core/target/surefire-reports/TEST-org.apache.phoenix.metrics.MetricTypeTest.xml, phoenix-queryserver/target/phoenix-queryserver-4.12.0-HBase-1.3-SNAPSHOT-tests.jar=phoenix-queryserver/target/phoenix-queryserver-4.12.0-HBase-1.3-SNAPSHOT-tests.jar, phoenix-pherf/target/surefire-reports/TEST-org.apache.phoenix.pherf.TestHBaseProps.xml=phoenix-pherf/target/surefire-reports/TEST-org.apache.phoenix.pherf.TestHBaseProps.xml, phoenix-core/target/surefire-reports/org.apache.phoenix.expression.ArrayFillFunctionTest.txt=phoenix-core/target/surefire-reports/org.apache.phoenix.expression.ArrayFillFunctionTest.txt, phoenix-core/target/surefire-reports/org.apache.phoenix.compile.SelectStatementRewriterTest-output.txt=phoenix-core/target/surefire-reports/org.apache.phoenix.compile.SelectStatementRewriterTest-output.txt, phoenix-hive/target/dependency/guice-assistedinject-3.0.jar=phoenix-hive/target/dependency/guice-assistedinject-3.0.jar, phoenix-core/target/surefire-reports/org.apache.phoenix.util.LikeExpressionTest.txt=phoenix-core/target/surefire-reports/org.apache.phoenix.util.LikeExpressionTest.txt, phoenix-core/target/surefire-reports/org.apache.phoenix.compile.CursorCompilerTest.txt=phoenix-core/target/surefire-reports/org.apache.phoenix.compile.CursorCompilerTest.txt, phoenix-hive/target/hive/hive-localDir-nm-0_2/filecache/10/TezAppJar.jar=phoenix-hive/target/hive/hive-localDir-nm-0_2/filecache/10/TezAppJar.jar, phoenix-hive/target/dependency/hbase-annotations-1.3.1.jar=phoenix-hive/target/dependency/hbase-annotations-1.3.1.jar, phoenix-core/target/surefire-reports/org.apache.phoenix.query.KeyRangeMoreTest.txt=phoenix-core/target/surefire-reports/org.apache.phoenix.query.KeyRangeMoreTest.txt, phoenix-hive/target/dependency/log4j-1.2.17.jar=phoenix-hive/target/dependency/log4j-1.2.17.jar, phoenix-core/target/surefire-reports/TEST-org.apache.phoenix.compile.ViewCompilerTest.xml=phoenix-core/target/surefire-reports/TEST-org.apache.phoenix.compile.ViewCompilerTest.xml, phoenix-hive/target/dependency/phoenix-core-4.12.0-HBase-1.3-SNAPSHOT.jar=phoenix-hive/target/dependency/phoenix-core-4.12.0-HBase-1.3-SNAPSHOT.jar, phoenix-pig/target/surefire-reports/org.apache.phoenix.pig.util.TableSchemaParserFunctionTest.txt=phoenix-pig/target/surefire-reports/org.apache.phoenix.pig.util.TableSchemaParserFunctionTest.txt, phoenix-pherf/target/failsafe-reports/TEST-org.apache.phoenix.pherf.SchemaReaderIT.xml=phoenix-pherf/target/failsafe-reports/TEST-org.apache.phoenix.pherf.SchemaReaderIT.xml, phoenix-hive/target/dependency/commons-pool-1.5.4.jar=phoenix-hive/target/dependency/commons-pool-1.5.4.jar, phoenix-core/target/surefire-reports/org.apache.phoenix.compile.QueryMetaDataTest-output.txt=phoenix-core/target/surefire-reports/org.apache.phoenix.compile.QueryMetaDataTest-output.txt, phoenix-core/target/surefire-reports/TEST-org.apache.phoenix.iterate.MergeSortResultIteratorTest.xml=phoenix-core/target/surefire-reports/TEST-org.apache.phoenix.iterate.MergeSortResultIteratorTest.xml, phoenix-core/target/surefire-reports/TEST-org.apache.hadoop.hbase.regionserver.PhoenixRpcSchedulerFactoryTest.xml=phoenix-core/target/surefire-reports/TEST-org.apache.hadoop.hbase.regionserver.PhoenixRpcSchedulerFactoryTest.xml, phoenix-core/target/surefire-reports/TEST-org.apache.phoenix.query.ScannerLeaseRenewalTest.xml=phoenix-core/target/surefire-reports/TEST-org.apache.phoenix.query.ScannerLeaseRenewalTest.xml, phoenix-spark/target/surefire-reports/TEST-org.apache.phoenix.spark.PhoenixSparkIT.xml=phoenix-spark/target/surefire-reports/TEST-org.apache.phoenix.spark.PhoenixSparkIT.xml, phoenix-core/target/surefire-reports/TEST-org.apache.phoenix.schema.RowKeyValueAccessorTest.xml=phoenix-core/target/surefire-reports/TEST-org.apache.phoenix.schema.RowKeyValueAccessorTest.xml, phoenix-queryserver/target/failsafe-reports/org.apache.phoenix.end2end.SecureQueryServerIT-output.txt=phoenix-queryserver/target/failsafe-reports/org.apache.phoenix.end2end.SecureQueryServerIT-output.txt, phoenix-hive/target/dependency/geronimo-jaspic_1.0_spec-1.0.jar=phoenix-hive/target/dependency/geronimo-jaspic_1.0_spec-1.0.jar, phoenix-hive/target/dependency/stax-api-1.0-2.jar=phoenix-hive/target/dependency/stax-api-1.0-2.jar, phoenix-core/target/surefire-reports/TEST-org.apache.phoenix.expression.RegexpReplaceFunctionTest.xml=phoenix-core/target/surefire-reports/TEST-org.apache.phoenix.expression.RegexpReplaceFunctionTest.xml, phoenix-hive/target/dependency/hive-metastore-1.2.1.jar=phoenix-hive/target/dependency/hive-metastore-1.2.1.jar, phoenix-hive/target/dependency/oro-2.0.8.jar=phoenix-hive/target/dependency/oro-2.0.8.jar, phoenix-hive/target/MiniMRCluster_2090392667/MiniMRCluster_2090392667-localDir-nm-0_3/usercache/jenkins/filecache/48/hive-exec-1.2.1.jar=phoenix-hive/target/MiniMRCluster_2090392667/MiniMRCluster_2090392667-localDir-nm-0_3/usercache/jenkins/filecache/48/hive-exec-1.2.1.jar, phoenix-queryserver/target/surefire-reports/TEST-org.apache.phoenix.queryserver.server.PhoenixRemoteUserExtractorTest.xml=phoenix-queryserver/target/surefire-reports/TEST-org.apache.phoenix.queryserver.server.PhoenixRemoteUserExtractorTest.xml, phoenix-core/target/surefire-reports/TEST-org.apache.phoenix.index.automated.MRJobSubmitterTest.xml=phoenix-core/target/surefire-reports/TEST-org.apache.phoenix.index.automated.MRJobSubmitterTest.xml, phoenix-core/target/surefire-reports/TEST-org.apache.phoenix.schema.types.PDateArrayToStringTest.xml=phoenix-core/target/surefire-reports/TEST-org.apache.phoenix.schema.types.PDateArrayToStringTest.xml, phoenix-core/target/surefire-reports/TEST-org.apache.phoenix.execute.MutationStateTest.xml=phoenix-core/target/surefire-reports/TEST-org.apache.phoenix.execute.MutationStateTest.xml, phoenix-hive/target/dependency/jersey-guice-1.9.jar=phoenix-hive/target/dependency/jersey-guice-1.9.jar, phoenix-hive/target/dependency/api-asn1-api-1.0.0-M20.jar=phoenix-hive/target/dependency/api-asn1-api-1.0.0-M20.jar, phoenix-hive/target/dependency/jpam-1.1.jar=phoenix-hive/target/dependency/jpam-1.1.jar, phoenix-hive/target/MiniMRCluster_2090392667/MiniMRCluster_2090392667-localDir-nm-0_0/usercache/jenkins/filecache/35/hive-exec-1.2.1.jar=phoenix-hive/target/MiniMRCluster_2090392667/MiniMRCluster_2090392667-localDir-nm-0_0/usercache/jenkins/filecache/35/hive-exec-1.2.1.jar, phoenix-hive/target/MiniMRCluster_2090392667/MiniMRCluster_2090392667-localDir-nm-0_2/usercache/jenkins/filecache/22/phoenix-4.12.0-HBase-1.3-SNAPSHOT-hive.jar=phoenix-hive/target/MiniMRCluster_2090392667/MiniMRCluster_2090392667-localDir-nm-0_2/usercache/jenkins/filecache/22/phoenix-4.12.0-HBase-1.3-SNAPSHOT-hive.jar, bin/end2endTest.py=bin/end2endTest.py, phoenix-core/target/surefire-reports/TEST-org.apache.phoenix.mapreduce.bulkload.TestTableRowkeyPair.xml=phoenix-core/target/surefire-reports/TEST-org.apache.phoenix.mapreduce.bulkload.TestTableRowkeyPair.xml, phoenix-hive/target/MiniMRCluster_2090392667/MiniMRCluster_2090392667-localDir-nm-0_2/usercache/jenkins/filecache/47/phoenix-4.12.0-HBase-1.3-SNAPSHOT-hive.jar=phoenix-hive/target/MiniMRCluster_2090392667/MiniMRCluster_2090392667-localDir-nm-0_2/usercache/jenkins/filecache/47/phoenix-4.12.0-HBase-1.3-SNAPSHOT-hive.jar, build.txt=build.txt, phoenix-core/target/surefire-reports/TEST-org.apache.phoenix.mapreduce.CsvBulkImportUtilTest.xml=phoenix-core/target/surefire-reports/TEST-org.apache.phoenix.mapreduce.CsvBulkImportUtilTest.xml, phoenix-hive/target/dependency/joni-2.1.2.jar=phoenix-hive/target/dependency/joni-2.1.2.jar, phoenix-core/target/surefire-reports/org.apache.phoenix.compile.HavingCompilerTest.txt=phoenix-core/target/surefire-reports/org.apache.phoenix.compile.HavingCompilerTest.txt, phoenix-pherf/target/phoenix-pherf-4.12.0-HBase-1.3-SNAPSHOT-minimal.jar=phoenix-pherf/target/phoenix-pherf-4.12.0-HBase-1.3-SNAPSHOT-minimal.jar, phoenix-core/target/surefire-reports/org.apache.phoenix.hbase.index.parallel.TestThreadPoolManager.txt=phoenix-core/target/surefire-reports/org.apache.phoenix.hbase.index.parallel.TestThreadPoolManager.txt, phoenix-hive/target/hive/hive-localDir-nm-0_1/usercache/jenkins/filecache/12/hive-exec-1.2.1.jar=phoenix-hive/target/hive/hive-localDir-nm-0_1/usercache/jenkins/filecache/12/hive-exec-1.2.1.jar, phoenix-hive/target/dependency/zookeeper-3.4.6-tests.jar=phoenix-hive/target/dependency/zookeeper-3.4.6-tests.jar, phoenix-hive/target/dependency/hadoop-shim-0.8.4.jar=phoenix-hive/target/dependency/hadoop-shim-0.8.4.jar, bin/traceserver.py=bin/traceserver.py, phoenix-core/target/surefire-reports/TEST-org.apache.phoenix.mapreduce.BulkLoadToolTest.xml=phoenix-core/target/surefire-reports/TEST-org.apache.phoenix.mapreduce.BulkLoadToolTest.xml, phoenix-core/target/surefire-reports/org.apache.phoenix.execute.CorrelatePlanTest-output.txt=phoenix-core/target/surefire-reports/org.apache.phoenix.execute.CorrelatePlanTest-output.txt, phoenix-core/target/surefire-reports/org.apache.phoenix.util.csv.CsvUpsertExecutorTest-output.txt=phoenix-core/target/surefire-reports/org.apache.phoenix.util.csv.CsvUpsertExecutorTest-output.txt, phoenix-core/target/surefire-reports/TEST-org.apache.phoenix.query.KeyRangeMoreTest.xml=phoenix-core/target/surefire-reports/TEST-org.apache.phoenix.query.KeyRangeMoreTest.xml, phoenix-core/target/surefire-reports/org.apache.phoenix.compile.TenantSpecificViewIndexCompileTest-output.txt=phoenix-core/target/surefire-reports/org.apache.phoenix.compile.TenantSpecificViewIndexCompileTest-output.txt, phoenix-hive/target/dependency/tephra-api-0.12.0-incubating.jar=phoenix-hive/target/dependency/tephra-api-0.12.0-incubating.jar, phoenix-hive/target/dependency/commons-net-3.1.jar=phoenix-hive/target/dependency/commons-net-3.1.jar, phoenix-hive/target/dependency/phoenix-core-4.12.0-HBase-1.3-SNAPSHOT-tests.jar=phoenix-hive/target/dependency/phoenix-core-4.12.0-HBase-1.3-SNAPSHOT-tests.jar, phoenix-hive/target/failsafe-reports/TEST-org.apache.phoenix.hive.HiveTezIT.xml=phoenix-hive/target/failsafe-reports/TEST-org.apache.phoenix.hive.HiveTezIT.xml, phoenix-pherf/target/surefire-reports/org.apache.phoenix.pherf.ResultTest-output.txt=phoenix-pherf/target/surefire-reports/org.apache.phoenix.pherf.ResultTest-output.txt, phoenix-hive/target/dependency/jetty-sslengine-6.1.26.jar=phoenix-hive/target/dependency/jetty-sslengine-6.1.26.jar, phoenix-hive/target/dependency/fastutil-6.5.6.jar=phoenix-hive/target/dependency/fastutil-6.5.6.jar, phoenix-hive/target/dependency/commons-logging-1.2.jar=phoenix-hive/target/dependency/commons-logging-1.2.jar, phoenix-hive/target/MiniMRCluster_2090392667/MiniMRCluster_2090392667-localDir-nm-0_2/usercache/jenkins/filecache/11/hive-exec-1.2.1.jar=phoenix-hive/target/MiniMRCluster_2090392667/MiniMRCluster_2090392667-localDir-nm-0_2/usercache/jenkins/filecache/11/hive-exec-1.2.1.jar, phoenix-flume/target/failsafe-reports/TEST-org.apache.phoenix.flume.PhoenixSinkIT.xml=phoenix-flume/target/failsafe-reports/TEST-org.apache.phoenix.flume.PhoenixSinkIT.xml, phoenix-hive/target/dependency/jcodings-1.0.8.jar=phoenix-hive/target/dependency/jcodings-1.0.8.jar, phoenix-hive/target/MiniMRCluster_2090392667/MiniMRCluster_2090392667-localDir-nm-0_2/usercache/jenkins/filecache/44/hive-exec-1.2.1.jar=phoenix-hive/target/MiniMRCluster_2090392667/MiniMRCluster_2090392667-localDir-nm-0_2/usercache/jenkins/filecache/44/hive-exec-1.2.1.jar, phoenix-hive/target/dependency/hbase-procedure-1.3.1.jar=phoenix-hive/target/dependency/hbase-procedure-1.3.1.jar, phoenix-hive/target/MiniMRCluster_2090392667/MiniMRCluster_2090392667-localDir-nm-0_1/usercache/jenkins/filecache/41/hadoop-common-2.7.1.jar=phoenix-hive/target/MiniMRCluster_2090392667/MiniMRCluster_2090392667-localDir-nm-0_1/usercache/jenkins/filecache/41/hadoop-common-2.7.1.jar, phoenix-hive/target/dependency/hadoop-mapreduce-client-shuffle-2.7.1.jar=phoenix-hive/target/dependency/hadoop-mapreduce-client-shuffle-2.7.1.jar, phoenix-core/target/surefire-reports/org.apache.phoenix.expression.ArrayPrependFunctionTest.txt=phoenix-core/target/surefire-reports/org.apache.phoenix.expression.ArrayPrependFunctionTest.txt, phoenix-pig/target/failsafe-reports/org.apache.phoenix.pig.PhoenixHBaseStorerIT.txt=phoenix-pig/target/failsafe-reports/org.apache.phoenix.pig.PhoenixHBaseStorerIT.txt, phoenix-core/target/surefire-reports/TEST-org.apache.phoenix.compile.HavingCompilerTest.xml=phoenix-core/target/surefire-reports/TEST-org.apache.phoenix.compile.HavingCompilerTest.xml, phoenix-core/target/surefire-reports/TEST-org.apache.phoenix.mapreduce.FormatToBytesWritableMapperTest.xml=phoenix-core/target/surefire-reports/TEST-org.apache.phoenix.mapreduce.FormatToBytesWritableMapperTest.xml, phoenix-core/target/surefire-reports/org.apache.phoenix.schema.RowKeyValueAccessorTest.txt=phoenix-core/target/surefire-reports/org.apache.phoenix.schema.RowKeyValueAccessorTest.txt, phoenix-core/target/surefire-reports/TEST-org.apache.phoenix.schema.SchemaUtilTest.xml=phoenix-core/target/surefire-reports/TEST-org.apache.phoenix.schema.SchemaUtilTest.xml, bin/queryserver.py=bin/queryserver.py, phoenix-pherf/target/failsafe-reports/org.apache.phoenix.pherf.DataIngestIT.txt=phoenix-pherf/target/failsafe-reports/org.apache.phoenix.pherf.DataIngestIT.txt, phoenix-hive/target/dependency/joda-time-1.6.jar=phoenix-hive/target/dependency/joda-time-1.6.jar, phoenix-core/target/surefire-reports/TEST-org.apache.phoenix.parse.BuiltInFunctionInfoTest.xml=phoenix-core/target/surefire-reports/TEST-org.apache.phoenix.parse.BuiltInFunctionInfoTest.xml, phoenix-core/target/surefire-reports/org.apache.phoenix.hbase.index.covered.filter.TestApplyAndFilterDeletesFilter.txt=phoenix-core/target/surefire-reports/org.apache.phoenix.hbase.index.covered.filter.TestApplyAndFilterDeletesFilter.txt, phoenix-core/target/surefire-reports/TEST-org.apache.phoenix.expression.StringToArrayFunctionTest.xml=phoenix-core/target/surefire-reports/TEST-org.apache.phoenix.expression.StringToArrayFunctionTest.xml, phoenix-core/target/surefire-reports/TEST-org.apache.phoenix.compile.CursorCompilerTest.xml=phoenix-core/target/surefire-reports/TEST-org.apache.phoenix.compile.CursorCompilerTest.xml, phoenix-spark/target/surefire-reports/TestSuite.txt=phoenix-spark/target/surefire-reports/TestSuite.txt, phoenix-hive/target/MiniMRCluster_2090392667/MiniMRCluster_2090392667-localDir-nm-0_0/usercache/jenkins/filecache/19/hive-exec-1.2.1.jar=phoenix-hive/target/MiniMRCluster_2090392667/MiniMRCluster_2090392667-localDir-nm-0_0/usercache/jenkins/filecache/19/hive-exec-1.2.1.jar, phoenix-core/target/surefire-reports/TEST-org.apache.phoenix.schema.ValueBitSetTest.xml=phoenix-core/target/surefire-reports/TEST-org.apache.phoenix.schema.ValueBitSetTest.xml, phoenix-core/target/surefire-reports/org.apache.phoenix.compile.CursorCompilerTest-output.txt=phoenix-core/target/surefire-reports/org.apache.phoenix.compile.CursorCompilerTest-output.txt, bin/phoenix_utils.py=bin/phoenix_utils.py, phoenix-hive/target/MiniMRCluster_2090392667/MiniMRCluster_2090392667-localDir-nm-0_1/usercache/jenkins/filecache/64/phoenix-4.12.0-HBase-1.3-SNAPSHOT-hive.jar=phoenix-hive/target/MiniMRCluster_2090392667/MiniMRCluster_2090392667-localDir-nm-0_1/usercache/jenkins/filecache/64/phoenix-4.12.0-HBase-1.3-SNAPSHOT-hive.jar, phoenix-hive/target/dependency/hadoop-client-2.7.1.jar=phoenix-hive/target/dependency/hadoop-client-2.7.1.jar, phoenix-hive/target/surefire-reports/TEST-org.apache.phoenix.hive.query.PhoenixQueryBuilderTest.xml=phoenix-hive/target/surefire-reports/TEST-org.apache.phoenix.hive.query.PhoenixQueryBuilderTest.xml, phoenix-core/target/surefire-reports/org.apache.phoenix.expression.util.regex.PatternPerformanceTest.txt=phoenix-core/target/surefire-reports/org.apache.phoenix.expression.util.regex.PatternPerformanceTest.txt, phoenix-core/target/surefire-reports/org.apache.phoenix.compile.JoinQueryCompilerTest-output.txt=phoenix-core/target/surefire-reports/org.apache.phoenix.compile.JoinQueryCompilerTest-output.txt, phoenix-queryserver/target/surefire-reports/org.apache.phoenix.DriverCohabitationTest.txt=phoenix-queryserver/target/surefire-reports/org.apache.phoenix.DriverCohabitationTest.txt, phoenix-core/target/surefire-reports/TEST-org.apache.phoenix.compile.SaltedScanRangesTest.xml=phoenix-core/target/surefire-reports/TEST-org.apache.phoenix.compile.SaltedScanRangesTest.xml, phoenix-core/target/surefire-reports/TEST-org.apache.phoenix.execute.LiteralResultIteratorPlanTest.xml=phoenix-core/target/surefire-reports/TEST-org.apache.phoenix.execute.LiteralResultIteratorPlanTest.xml, phoenix-core/target/surefire-reports/org.apache.phoenix.query.ConnectionlessTest.txt=phoenix-core/target/surefire-reports/org.apache.phoenix.query.ConnectionlessTest.txt, phoenix-hive/target/dependency/stream-2.9.5.jar=phoenix-hive/target/dependency/stream-2.9.5.jar, phoenix-core/target/surefire-reports/TEST-org.apache.phoenix.hbase.index.covered.CoveredColumnsTest.xml=phoenix-core/target/surefire-reports/TEST-org.apache.phoenix.hbase.index.covered.CoveredColumnsTest.xml, phoenix-pherf/target/surefire-reports/org.apache.phoenix.pherf.ConfigurationParserTest.txt=phoenix-pherf/target/surefire-reports/org.apache.phoenix.pherf.ConfigurationParserTest.txt, phoenix-core/target/surefire-reports/TEST-org.apache.phoenix.schema.types.PDataTypeForArraysTest.xml=phoenix-core/target/surefire-reports/TEST-org.apache.phoenix.schema.types.PDataTypeForArraysTest.xml, phoenix-core/target/surefire-reports/TEST-org.apache.phoenix.hbase.index.covered.TestColumnTracker.xml=phoenix-core/target/surefire-reports/TEST-org.apache.phoenix.hbase.index.covered.TestColumnTracker.xml, phoenix-core/target/surefire-reports/org.apache.phoenix.mapreduce.util.PhoenixConfigurationUtilTest.txt=phoenix-core/target/surefire-reports/org.apache.phoenix.mapreduce.util.PhoenixConfigurationUtilTest.txt, phoenix-core/target/surefire-reports/org.apache.phoenix.expression.ArrayAppendFunctionTest.txt=phoenix-core/target/surefire-reports/org.apache.phoenix.expression.ArrayAppendFunctionTest.txt, phoenix-core/target/surefire-reports/org.apache.phoenix.compile.TenantSpecificViewIndexCompileTest.txt=phoenix-core/target/surefire-reports/org.apache.phoenix.compile.TenantSpecificViewIndexCompileTest.txt, phoenix-core/target/surefire-reports/TEST-org.apache.phoenix.hbase.index.write.recovery.TestPerRegionIndexWriteCache.xml=phoenix-core/target/surefire-reports/TEST-org.apache.phoenix.hbase.index.write.recovery.TestPerRegionIndexWriteCache.xml, phoenix-hive/target/failsafe-reports/failsafe-summary.xml=phoenix-hive/target/failsafe-reports/failsafe-summary.xml, phoenix-core/target/surefire-reports/org.apache.phoenix.jdbc.PhoenixEmbeddedDriverTest-output.txt=phoenix-core/target/surefire-reports/org.apache.phoenix.jdbc.PhoenixEmbeddedDriverTest-output.txt, phoenix-core/target/surefire-reports/org.apache.phoenix.hbase.index.covered.TestCoveredColumnIndexCodec.txt=phoenix-core/target/surefire-reports/org.apache.phoenix.hbase.index.covered.TestCoveredColumnIndexCodec.txt, phoenix-hive/target/dependency/hive-common-1.2.1.jar=phoenix-hive/target/dependency/hive-common-1.2.1.jar, phoenix-core/target/surefire-reports/TEST-org.apache.phoenix.hbase.index.parallel.TestThreadPoolBuilder.xml=phoenix-core/target/surefire-reports/TEST-org.apache.phoenix.hbase.index.parallel.TestThreadPoolBuilder.xml, phoenix-hive/target/dependency/twill-api-0.8.0.jar=phoenix-hive/target/dependency/twill-api-0.8.0.jar, phoenix-core/target/surefire-reports/org.apache.phoenix.expression.NullValueTest.txt=phoenix-core/target/surefire-reports/org.apache.phoenix.expression.NullValueTest.txt, phoenix-queryserver/target/surefire-reports/org.apache.phoenix.queryserver.server.PhoenixDoAsCallbackTest.txt=phoenix-queryserver/target/surefire-reports/org.apache.phoenix.queryserver.server.PhoenixDoAsCallbackTest.txt, phoenix-core/target/surefire-reports/org.apache.phoenix.query.HBaseFactoryProviderTest.txt=phoenix-core/target/surefire-reports/org.apache.phoenix.query.HBaseFactoryProviderTest.txt, phoenix-core/target/surefire-reports/TEST-org.apache.phoenix.hbase.index.write.TestIndexWriter.xml=phoenix-core/target/surefire-reports/TEST-org.apache.phoenix.hbase.index.write.TestIndexWriter.xml, phoenix-core/target/surefire-reports/org.apache.phoenix.execute.CorrelatePlanTest.txt=phoenix-core/target/surefire-reports/org.apache.phoenix.execute.CorrelatePlanTest.txt, phoenix-core/target/surefire-reports/TEST-org.apache.phoenix.jdbc.SecureUserConnectionsTest.xml=phoenix-core/target/surefire-reports/TEST-org.apache.phoenix.jdbc.SecureUserConnectionsTest.xml, phoenix-hive/target/dependency/hadoop-yarn-client-2.7.1.jar=phoenix-hive/target/dependency/hadoop-yarn-client-2.7.1.jar, phoenix-hive/target/dependency/protobuf-java-2.5.0.jar=phoenix-hive/target/dependency/protobuf-java-2.5.0.jar, phoenix-server/target/phoenix-4.12.0-HBase-1.3-SNAPSHOT-server.jar=phoenix-server/target/phoenix-4.12.0-HBase-1.3-SNAPSHOT-server.jar, phoenix-core/target/surefire-reports/org.apache.phoenix.schema.types.PVarcharArrayToStringTest.txt=phoenix-core/target/surefire-reports/org.apache.phoenix.schema.types.PVarcharArrayToStringTest.txt, phoenix-kafka/target/phoenix-kafka-4.12.0-HBase-1.3-SNAPSHOT-minimal.jar=phoenix-kafka/target/phoenix-kafka-4.12.0-HBase-1.3-SNAPSHOT-minimal.jar, phoenix-core/target/surefire-reports/org.apache.phoenix.schema.RowKeyValueAccessorTest-output.txt=phoenix-core/target/surefire-reports/org.apache.phoenix.schema.RowKeyValueAccessorTest-output.txt, phoenix-core/target/surefire-reports/org.apache.phoenix.expression.function.ExternalSqlTypeIdFunctionTest.txt=phoenix-core/target/surefire-reports/org.apache.phoenix.expression.function.ExternalSqlTypeIdFunctionTest.txt, phoenix-core/target/surefire-reports/org.apache.phoenix.schema.ValueBitSetTest.txt=phoenix-core/target/surefire-reports/org.apache.phoenix.schema.ValueBitSetTest.txt, phoenix-hive/target/dependency/tephra-core-0.12.0-incubating.jar=phoenix-hive/target/dependency/tephra-core-0.12.0-incubating.jar, phoenix-core/target/surefire-reports/org.apache.phoenix.execute.UnnestArrayPlanTest.txt=phoenix-core/target/surefire-reports/org.apache.phoenix.execute.UnnestArrayPlanTest.txt, phoenix-core/target/surefire-reports/org.apache.phoenix.query.PropertyPolicyProviderTest.txt=phoenix-core/target/surefire-reports/org.apache.phoenix.query.PropertyPolicyProviderTest.txt, phoenix-pig/target/failsafe-reports/org.apache.phoenix.pig.udf.ReserveNSequenceTestIT.txt=phoenix-pig/target/failsafe-reports/org.apache.phoenix.pig.udf.ReserveNSequenceTestIT.txt, phoenix-core/target/surefire-reports/org.apache.phoenix.util.csv.StringToArrayConverterTest.txt=phoenix-core/target/surefire-reports/org.apache.phoenix.util.csv.StringToArrayConverterTest.txt, phoenix-hive/target/hive/hive-localDir-nm-0_1/usercache/jenkins/filecache/17/phoenix-4.12.0-HBase-1.3-SNAPSHOT-hive.jar=phoenix-hive/target/hive/hive-localDir-nm-0_1/usercache/jenkins/filecache/17/phoenix-4.12.0-HBase-1.3-SNAPSHOT-hive.jar, phoenix-pig/target/surefire-reports/TEST-org.apache.phoenix.pig.util.PhoenixPigSchemaUtilTest.xml=phoenix-pig/target/surefire-reports/TEST-org.apache.phoenix.pig.util.PhoenixPigSchemaUtilTest.xml, phoenix-core/target/surefire-reports/org.apache.phoenix.execute.UnnestArrayPlanTest-output.txt=phoenix-core/target/surefire-reports/org.apache.phoenix.execute.UnnestArrayPlanTest-output.txt, phoenix-tracing-webapp/target/phoenix-tracing-webapp-4.12.0-HBase-1.3-SNAPSHOT.jar=phoenix-tracing-webapp/target/phoenix-tracing-webapp-4.12.0-HBase-1.3-SNAPSHOT.jar, phoenix-hive/target/dependency/commons-csv-1.0.jar=phoenix-hive/target/dependency/commons-csv-1.0.jar, phoenix-core/target/surefire-reports/org.apache.phoenix.schema.types.PrimitiveIntPhoenixArrayToStringTest.txt=phoenix-core/target/surefire-reports/org.apache.phoenix.schema.types.PrimitiveIntPhoenixArrayToStringTest.txt, phoenix-queryserver/target/phoenix-4.12.0-HBase-1.3-SNAPSHOT-queryserver.jar=phoenix-queryserver/target/phoenix-4.12.0-HBase-1.3-SNAPSHOT-queryserver.jar, phoenix-core/target/surefire-reports/org.apache.phoenix.metrics.MetricTypeTest.txt=phoenix-core/target/surefire-reports/org.apache.phoenix.metrics.MetricTypeTest.txt, phoenix-core/target/surefire-reports/TEST-org.apache.phoenix.filter.SkipScanFilterTest.xml=phoenix-core/target/surefire-reports/TEST-org.apache.phoenix.filter.SkipScanFilterTest.xml, phoenix-core/target/surefire-reports/TEST-org.apache.phoenix.schema.types.PrimitiveDoublePhoenixArrayToStringTest.xml=phoenix-core/target/surefire-reports/TEST-org.apache.phoenix.schema.types.PrimitiveDoublePhoenixArrayToStringTest.xml, phoenix-core/target/surefire-reports/TEST-org.apache.phoenix.util.DateUtilTest.xml=phoenix-core/target/surefire-reports/TEST-org.apache.phoenix.util.DateUtilTest.xml, phoenix-hive/target/failsafe-reports/org.apache.phoenix.hive.HivePhoenixStoreIT.txt=phoenix-hive/target/failsafe-reports/org.apache.phoenix.hive.HivePhoenixStoreIT.txt, phoenix-hive/target/dependency/junit-4.12.jar=phoenix-hive/target/dependency/junit-4.12.jar, phoenix-core/target/surefire-reports/TEST-org.apache.phoenix.hbase.index.covered.filter.TestNewerTimestampFilter.xml=phoenix-core/target/surefire-reports/TEST-org.apache.phoenix.hbase.index.covered.filter.TestNewerTimestampFilter.xml, phoenix-core/target/surefire-reports/TEST-org.apache.phoenix.expression.ArrayConcatFunctionTest.xml=phoenix-core/target/surefire-reports/TEST-org.apache.phoenix.expression.ArrayConcatFunctionTest.xml, phoenix-core/target/surefire-reports/org.apache.phoenix.query.EncodedColumnQualifierCellsListTest.txt=phoenix-core/target/surefire-reports/org.apache.phoenix.query.EncodedColumnQualifierCellsListTest.txt, phoenix-flume/target/failsafe-reports/org.apache.phoenix.flume.JsonEventSerializerIT.txt=phoenix-flume/target/failsafe-reports/org.apache.phoenix.flume.JsonEventSerializerIT.txt, phoenix-core/target/surefire-reports/TEST-org.apache.phoenix.jdbc.PhoenixPreparedStatementTest.xml=phoenix-core/target/surefire-reports/TEST-org.apache.phoenix.jdbc.PhoenixPreparedStatementTest.xml, phoenix-core/target/surefire-reports/TEST-org.apache.phoenix.schema.ImmutableStorageSchemeTest.xml=phoenix-core/target/surefire-reports/TEST-org.apache.phoenix.schema.ImmutableStorageSchemeTest.xml, phoenix-core/target/surefire-reports/org.apache.phoenix.util.PrefixByteEncoderDecoderTest.txt=phoenix-core/target/surefire-reports/org.apache.phoenix.util.PrefixByteEncoderDecoderTest.txt, phoenix-queryserver/target/surefire-reports/TEST-org.apache.phoenix.queryserver.server.RemoteUserExtractorFactoryTest.xml=phoenix-queryserver/target/surefire-reports/TEST-org.apache.phoenix.queryserver.server.RemoteUserExtractorFactoryTest.xml, phoenix-hive/target/dependency/hive-ant-1.2.1.jar=phoenix-hive/target/dependency/hive-ant-1.2.1.jar, phoenix-hive/target/dependency/ST4-4.0.4.jar=phoenix-hive/target/dependency/ST4-4.0.4.jar, phoenix-hive/target/dependency/jackson-core-asl-1.9.2.jar=phoenix-hive/target/dependency/jackson-core-asl-1.9.2.jar, phoenix-core/target/surefire-reports/org.apache.phoenix.expression.ArrayConstructorExpressionTest.txt=phoenix-core/target/surefire-reports/org.apache.phoenix.expression.ArrayConstructorExpressionTest.txt, phoenix-core/target/surefire-reports/org.apache.phoenix.expression.RegexpSubstrFunctionTest.txt=phoenix-core/target/surefire-reports/org.apache.phoenix.expression.RegexpSubstrFunctionTest.txt, phoenix-hive/target/dependency/jsp-api-2.1.jar=phoenix-hive/target/dependency/jsp-api-2.1.jar, phoenix-hive/target/MiniMRCluster_2090392667/MiniMRCluster_2090392667-localDir-nm-0_0/usercache/jenkins/filecache/14/phoenix-4.12.0-HBase-1.3-SNAPSHOT-hive.jar=phoenix-hive/target/MiniMRCluster_2090392667/MiniMRCluster_2090392667-localDir-nm-0_0/usercache/jenkins/filecache/14/phoenix-4.12.0-HBase-1.3-SNAPSHOT-hive.jar, phoenix-hive/target/MiniMRCluster_2090392667/MiniMRCluster_2090392667-localDir-nm-0_1/usercache/jenkins/filecache/53/hadoop-common-2.7.1.jar=phoenix-hive/target/MiniMRCluster_2090392667/MiniMRCluster_2090392667-localDir-nm-0_1/usercache/jenkins/filecache/53/hadoop-common-2.7.1.jar, phoenix-hive/target/dependency/bonecp-0.8.0.RELEASE.jar=phoenix-hive/target/dependency/bonecp-0.8.0.RELEASE.jar, phoenix-hive/target/dependency/hadoop-mapreduce-client-jobclient-2.7.1-tests.jar=phoenix-hive/target/dependency/hadoop-mapreduce-client-jobclient-2.7.1-tests.jar, phoenix-hive/target/dependency/jersey-json-1.9.jar=phoenix-hive/target/dependency/jersey-json-1.9.jar, phoenix-core/target/surefire-reports/org.apache.phoenix.util.MetaDataUtilTest.txt=phoenix-core/target/surefire-reports/org.apache.phoenix.util.MetaDataUtilTest.txt, phoenix-core/target/surefire-reports/org.apache.phoenix.compile.LimitCompilerTest.txt=phoenix-core/target/surefire-reports/org.apache.phoenix.compile.LimitCompilerTest.txt, phoenix-core/target/surefire-reports/org.apache.phoenix.mapreduce.index.IndexScrutinyTableOutputTest.txt=phoenix-core/target/surefire-reports/org.apache.phoenix.mapreduce.index.IndexScrutinyTableOutputTest.txt, phoenix-core/target/surefire-reports/TEST-org.apache.phoenix.expression.LnLogFunctionTest.xml=phoenix-core/target/surefire-reports/TEST-org.apache.phoenix.expression.LnLogFunctionTest.xml, phoenix-spark/target/phoenix-spark-4.12.0-HBase-1.3-SNAPSHOT.jar=phoenix-spark/target/phoenix-spark-4.12.0-HBase-1.3-SNAPSHOT.jar, phoenix-core/target/surefire-reports/org.apache.phoenix.expression.LnLogFunctionTest.txt=phoenix-core/target/surefire-reports/org.apache.phoenix.expression.LnLogFunctionTest.txt, phoenix-hive/target/MiniMRCluster_2090392667/MiniMRCluster_2090392667-localDir-nm-0_2/filecache/10/hadoop-mapreduce-client-jobclient-2.7.1-tests.jar=phoenix-hive/target/MiniMRCluster_2090392667/MiniMRCluster_2090392667-localDir-nm-0_2/filecache/10/hadoop-mapreduce-client-jobclient-2.7.1-tests.jar, phoenix-pherf/target/failsafe-reports/org.apache.phoenix.pherf.SchemaReaderIT.txt=phoenix-pherf/target/failsafe-reports/org.apache.phoenix.pherf.SchemaReaderIT.txt, phoenix-hive/target/hive/hive-localDir-nm-0_2/usercache/jenkins/filecache/39/hive-exec-1.2.1.jar=phoenix-hive/target/hive/hive-localDir-nm-0_2/usercache/jenkins/filecache/39/hive-exec-1.2.1.jar, phoenix-core/target/surefire-reports/TEST-org.apache.phoenix.compile.JoinQueryCompilerTest.xml=phoenix-core/target/surefire-reports/TEST-org.apache.phoenix.compile.JoinQueryCompilerTest.xml, phoenix-hive/target/MiniMRCluster_2090392667/MiniMRCluster_2090392667-localDir-nm-0_2/usercache/jenkins/filecache/62/hadoop-common-2.7.1.jar=phoenix-hive/target/MiniMRCluster_2090392667/MiniMRCluster_2090392667-localDir-nm-0_2/usercache/jenkins/filecache/62/hadoop-common-2.7.1.jar, phoenix-hive/target/dependency/tez-dag-0.8.4.jar=phoenix-hive/target/dependency/tez-dag-0.8.4.jar, phoenix-core/target/surefire-reports/org.apache.phoenix.iterate.RowKeyOrderedAggregateResultIteratorTest.txt=phoenix-core/target/surefire-reports/org.apache.phoenix.iterate.RowKeyOrderedAggregateResultIteratorTest.txt, phoenix-load-balancer/target/phoenix-load-balancer-4.12.0-HBase-1.3-SNAPSHOT-tests.jar=phoenix-load-balancer/target/phoenix-load-balancer-4.12.0-HBase-1.3-SNAPSHOT-tests.jar, phoenix-core/target/surefire-reports/org.apache.phoenix.jdbc.ReadOnlyPropertiesTest.txt=phoenix-core/target/surefire-reports/org.apache.phoenix.jdbc.ReadOnlyPropertiesTest.txt, phoenix-pig/target/phoenix-4.12.0-HBase-1.3-SNAPSHOT-pig.jar=phoenix-pig/target/phoenix-4.12.0-HBase-1.3-SNAPSHOT-pig.jar, phoenix-pherf/target/failsafe-reports/org.apache.phoenix.pherf.PherfMainIT.txt=phoenix-pherf/target/failsafe-reports/org.apache.phoenix.pherf.PherfMainIT.txt, phoenix-core/target/surefire-reports/org.apache.phoenix.compile.SaltedScanRangesTest.txt=phoenix-core/target/surefire-reports/org.apache.phoenix.compile.SaltedScanRangesTest.txt, phoenix-hive/target/MiniMRCluster_2090392667/MiniMRCluster_2090392667-localDir-nm-0_0/usercache/jenkins/filecache/40/hive-exec-1.2.1.jar=phoenix-hive/target/MiniMRCluster_2090392667/MiniMRCluster_2090392667-localDir-nm-0_0/usercache/jenkins/filecache/40/hive-exec-1.2.1.jar, phoenix-core/target/surefire-reports/org.apache.phoenix.schema.SequenceAllocationTest.txt=phoenix-core/target/surefire-reports/org.apache.phoenix.schema.SequenceAllocationTest.txt, phoenix-load-balancer/target/phoenix-load-balancer-4.12.0-HBase-1.3-SNAPSHOT-sources.jar=phoenix-load-balancer/target/phoenix-load-balancer-4.12.0-HBase-1.3-SNAPSHOT-sources.jar, phoenix-core/target/surefire-reports/TEST-org.apache.phoenix.hbase.index.write.TestParalleWriterIndexCommitter.xml=phoenix-core/target/surefire-reports/TEST-org.apache.phoenix.hbase.index.write.TestParalleWriterIndexCommitter.xml, phoenix-pherf/target/surefire-reports/org.apache.phoenix.pherf.ConfigurationParserTest-output.txt=phoenix-pherf/target/surefire-reports/org.apache.phoenix.pherf.ConfigurationParserTest-output.txt, phoenix-hive/target/dependency/calcite-core-1.2.0-incubating.jar=phoenix-hive/target/dependency/calcite-core-1.2.0-incubating.jar, phoenix-hive/target/dependency/hadoop-yarn-server-applicationhistoryservice-2.7.1.jar=phoenix-hive/target/dependency/hadoop-yarn-server-applicationhistoryservice-2.7.1.jar, phoenix-core/target/surefire-reports/TEST-org.apache.phoenix.jdbc.PhoenixEmbeddedDriverTest.xml=phoenix-core/target/surefire-reports/TEST-org.apache.phoenix.jdbc.PhoenixEmbeddedDriverTest.xml, phoenix-hive/target/failsafe-reports/TEST-org.apache.phoenix.hive.HivePhoenixStoreIT.xml=phoenix-hive/target/failsafe-reports/TEST-org.apache.phoenix.hive.HivePhoenixStoreIT.xml, phoenix-spark/target/surefire-reports/TEST-org.apache.phoenix.spark.PhoenixSparkITTenantSpecific.xml=phoenix-spark/target/surefire-reports/TEST-org.apache.phoenix.spark.PhoenixSparkITTenantSpecific.xml} due to internal error; falling back to full archiving
java.lang.IllegalStateException: checksum mismatch after transfer (3545215646 vs. 3034034546); /x1/jenkins/jenkins-home/jobs/Phoenix-master/builds/1806/archive/phoenix-client/target/phoenix-4.12.0-HBase-1.3-SNAPSHOT-client.jar may be corrupted
	at jsync.protocol.FileSequenceReader.read(FileSequenceReader.java:45)
	at com.cloudbees.jenkins.plugins.jsync.archiver.JSyncArtifactManager.remoteSync(JSyncArtifactManager.java:158)
	at com.cloudbees.jenkins.plugins.jsync.archiver.JSyncArtifactManager.archive(JSyncArtifactManager.java:76)
	at hudson.tasks.ArtifactArchiver.perform(ArtifactArchiver.java:244)
	at hudson.tasks.BuildStepCompatibilityLayer.perform(BuildStepCompatibilityLayer.java:81)
	at hudson.tasks.BuildStepMonitor$1.perform(BuildStepMonitor.java:20)
	at hudson.model.AbstractBuild$AbstractBuildExecution.perform(AbstractBuild.java:735)
	at hudson.model.AbstractBuild$AbstractBuildExecution.performAllBuildSteps(AbstractBuild.java:676)
	at hudson.model.Build$BuildExecution.post2(Build.java:186)
	at hudson.model.AbstractBuild$AbstractBuildExecution.post(AbstractBuild.java:621)
	at hudson.model.Run.execute(Run.java:1760)
	at hudson.model.FreeStyleBuild.run(FreeStyleBuild.java:43)
	at hudson.model.ResourceController.execute(ResourceController.java:97)
	at hudson.model.Executor.run(Executor.java:405)
[JIRA] Updating issue PHOENIX-4189
[JIRA] Updating issue PHOENIX-4212
[JIRA] Updating issue PHOENIX-4220
[JIRA] Updating issue PHOENIX-4221
Recording test results

Mime
View raw message