phoenix-commits mailing list archives

Site index · List index
Message view « Date » · « Thread »
Top « Date » · « Thread »
From Apache Jenkins Server <jenk...@builds.apache.org>
Subject Build failed in Jenkins: Phoenix-4.x-HBase-1.2 #190
Date Fri, 29 Sep 2017 23:28:03 GMT
See <https://builds.apache.org/job/Phoenix-4.x-HBase-1.2/190/display/redirect?page=changes>

Changes:

[jtaylor] PHOENIX-4258 Breakup ScanQueryIT into several integration tests so as

[jtaylor] PHOENIX-4238 MR IndexScrutinyTool break with salted tables and indexes

[tdsilva] PHOENIX-4259 Split up IndexExtendedIT

------------------------------------------
[...truncated 132.66 KB...]
[ERROR]   InQueryIT.testDateInList[InQueryIT_2] » IllegalArgument
[ERROR]   InQueryIT.testDateInList[InQueryIT_3] » IllegalArgument
[ERROR]   InQueryIT.testDateInList[InQueryIT_4] » IllegalArgument
[ERROR]   InQueryIT.testDateInList[InQueryIT_5] » IllegalArgument
[ERROR]   InQueryIT.testDateInList[InQueryIT_6] » IllegalArgument
[ERROR]   InQueryIT.testFullyQualifiedRVCInList[InQueryIT_0] » IllegalArgument wrong num...
[ERROR]   InQueryIT.testFullyQualifiedRVCInList[InQueryIT_1] » IllegalArgument wrong num...
[ERROR]   InQueryIT.testFullyQualifiedRVCInList[InQueryIT_2] » IllegalArgument
[ERROR]   InQueryIT.testFullyQualifiedRVCInList[InQueryIT_3] » IllegalArgument
[ERROR]   InQueryIT.testFullyQualifiedRVCInList[InQueryIT_4] » IllegalArgument
[ERROR]   InQueryIT.testFullyQualifiedRVCInList[InQueryIT_5] » IllegalArgument
[ERROR]   InQueryIT.testFullyQualifiedRVCInList[InQueryIT_6] » IllegalArgument
[ERROR]   InQueryIT.testInListSkipScan[InQueryIT_0] » IllegalArgument wrong number of ar...
[ERROR]   InQueryIT.testInListSkipScan[InQueryIT_1] » IllegalArgument wrong number of ar...
[ERROR]   InQueryIT.testInListSkipScan[InQueryIT_2] » IllegalArgument
[ERROR]   InQueryIT.testInListSkipScan[InQueryIT_3] » IllegalArgument
[ERROR]   InQueryIT.testInListSkipScan[InQueryIT_4] » IllegalArgument
[ERROR]   InQueryIT.testInListSkipScan[InQueryIT_5] » IllegalArgument
[ERROR]   InQueryIT.testInListSkipScan[InQueryIT_6] » IllegalArgument
[ERROR]   InQueryIT.testMixedTypeInListStatement[InQueryIT_0] » IllegalArgument wrong nu...
[ERROR]   InQueryIT.testMixedTypeInListStatement[InQueryIT_1] » IllegalArgument wrong nu...
[ERROR]   InQueryIT.testMixedTypeInListStatement[InQueryIT_2] » IllegalArgument
[ERROR]   InQueryIT.testMixedTypeInListStatement[InQueryIT_3] » IllegalArgument
[ERROR]   InQueryIT.testMixedTypeInListStatement[InQueryIT_4] » IllegalArgument
[ERROR]   InQueryIT.testMixedTypeInListStatement[InQueryIT_5] » IllegalArgument
[ERROR]   InQueryIT.testMixedTypeInListStatement[InQueryIT_6] » IllegalArgument
[ERROR]   InQueryIT.testOneInListStatement[InQueryIT_0] » IllegalArgument wrong number o...
[ERROR]   InQueryIT.testOneInListStatement[InQueryIT_1] » IllegalArgument wrong number o...
[ERROR]   InQueryIT.testOneInListStatement[InQueryIT_2] » IllegalArgument
[ERROR]   InQueryIT.testOneInListStatement[InQueryIT_3] » IllegalArgument
[ERROR]   InQueryIT.testOneInListStatement[InQueryIT_4] » IllegalArgument
[ERROR]   InQueryIT.testOneInListStatement[InQueryIT_5] » IllegalArgument
[ERROR]   InQueryIT.testOneInListStatement[InQueryIT_6] » IllegalArgument
[ERROR]   InQueryIT.testPartiallyQualifiedRVCInList[InQueryIT_0] » IllegalArgument wrong...
[ERROR]   InQueryIT.testPartiallyQualifiedRVCInList[InQueryIT_1] » IllegalArgument wrong...
[ERROR]   InQueryIT.testPartiallyQualifiedRVCInList[InQueryIT_2] » IllegalArgument
[ERROR]   InQueryIT.testPartiallyQualifiedRVCInList[InQueryIT_3] » IllegalArgument
[ERROR]   InQueryIT.testPartiallyQualifiedRVCInList[InQueryIT_4] » IllegalArgument
[ERROR]   InQueryIT.testPartiallyQualifiedRVCInList[InQueryIT_5] » IllegalArgument
[ERROR]   InQueryIT.testPartiallyQualifiedRVCInList[InQueryIT_6] » IllegalArgument
[ERROR]   InQueryIT.testRowKeyMultiIn[InQueryIT_0] » IllegalArgument wrong number of arg...
[ERROR]   InQueryIT.testRowKeyMultiIn[InQueryIT_1] » IllegalArgument wrong number of arg...
[ERROR]   InQueryIT.testRowKeyMultiIn[InQueryIT_2] » IllegalArgument
[ERROR]   InQueryIT.testRowKeyMultiIn[InQueryIT_3] » IllegalArgument
[ERROR]   InQueryIT.testRowKeyMultiIn[InQueryIT_4] » IllegalArgument
[ERROR]   InQueryIT.testRowKeyMultiIn[InQueryIT_5] » IllegalArgument
[ERROR]   InQueryIT.testRowKeyMultiIn[InQueryIT_6] » IllegalArgument
[ERROR]   InQueryIT.testRowKeySingleIn[InQueryIT_0] » IllegalArgument wrong number of ar...
[ERROR]   InQueryIT.testRowKeySingleIn[InQueryIT_1] » IllegalArgument
[ERROR]   InQueryIT.testRowKeySingleIn[InQueryIT_2] » IllegalArgument
[ERROR]   InQueryIT.testRowKeySingleIn[InQueryIT_3] » IllegalArgument
[ERROR]   InQueryIT.testRowKeySingleIn[InQueryIT_4] » IllegalArgument
[ERROR]   InQueryIT.testRowKeySingleIn[InQueryIT_5] » IllegalArgument
[ERROR]   InQueryIT.testRowKeySingleIn[InQueryIT_6] » IllegalArgument
[ERROR]   InQueryIT.testSimpleInListStatement[InQueryIT_0] » IllegalArgument wrong numbe...
[ERROR]   InQueryIT.testSimpleInListStatement[InQueryIT_1] » IllegalArgument
[ERROR]   InQueryIT.testSimpleInListStatement[InQueryIT_2] » IllegalArgument
[ERROR]   InQueryIT.testSimpleInListStatement[InQueryIT_3] » IllegalArgument
[ERROR]   InQueryIT.testSimpleInListStatement[InQueryIT_4] » IllegalArgument
[ERROR]   InQueryIT.testSimpleInListStatement[InQueryIT_5] » IllegalArgument
[ERROR]   InQueryIT.testSimpleInListStatement[InQueryIT_6] » IllegalArgument
[INFO] 
[ERROR] Tests run: 3338, Failures: 0, Errors: 63, Skipped: 5
[INFO] 
[INFO] 
[INFO] --- maven-failsafe-plugin:2.20:integration-test (HBaseManagedTimeTests) @ phoenix-core
---
[INFO] 
[INFO] -------------------------------------------------------
[INFO]  T E S T S
[INFO] -------------------------------------------------------
[INFO] 
[INFO] Results:
[INFO] 
[INFO] Tests run: 0, Failures: 0, Errors: 0, Skipped: 0
[INFO] 
[INFO] 
[INFO] --- maven-failsafe-plugin:2.20:integration-test (NeedTheirOwnClusterTests) @ phoenix-core
---
[INFO] 
[INFO] -------------------------------------------------------
[INFO]  T E S T S
[INFO] -------------------------------------------------------
[INFO] Running org.apache.hadoop.hbase.regionserver.wal.WALReplayWithIndexWritesAndCompressedWALIT
[INFO] Running org.apache.phoenix.end2end.ConnectionUtilIT
[INFO] Running org.apache.hadoop.hbase.regionserver.wal.WALRecoveryRegionPostOpenIT
[INFO] Tests run: 1, Failures: 0, Errors: 0, Skipped: 0, Time elapsed: 30.31 s - in org.apache.hadoop.hbase.regionserver.wal.WALReplayWithIndexWritesAndCompressedWALIT
[INFO] Tests run: 1, Failures: 0, Errors: 0, Skipped: 0, Time elapsed: 7.131 s - in org.apache.hadoop.hbase.regionserver.wal.WALRecoveryRegionPostOpenIT
[INFO] Running org.apache.phoenix.end2end.ColumnEncodedMutableTxStatsCollectorIT
[INFO] Running org.apache.phoenix.end2end.ColumnEncodedImmutableNonTxStatsCollectorIT
[INFO] Running org.apache.phoenix.end2end.ColumnEncodedImmutableTxStatsCollectorIT
[INFO] Running org.apache.phoenix.end2end.ColumnEncodedMutableNonTxStatsCollectorIT
[INFO] Running org.apache.phoenix.end2end.ContextClassloaderIT
[INFO] Tests run: 3, Failures: 0, Errors: 0, Skipped: 0, Time elapsed: 2.488 s - in org.apache.phoenix.end2end.ContextClassloaderIT
[INFO] Tests run: 1, Failures: 0, Errors: 0, Skipped: 0, Time elapsed: 25.441 s - in org.apache.phoenix.end2end.ConnectionUtilIT
[INFO] Running org.apache.phoenix.end2end.CountDistinctCompressionIT
[INFO] Tests run: 1, Failures: 0, Errors: 0, Skipped: 0, Time elapsed: 4.732 s - in org.apache.phoenix.end2end.CountDistinctCompressionIT
[INFO] Running org.apache.phoenix.end2end.CsvBulkLoadToolIT
[INFO] Running org.apache.phoenix.end2end.DropSchemaIT
[INFO] Tests run: 2, Failures: 0, Errors: 0, Skipped: 0, Time elapsed: 12.037 s - in org.apache.phoenix.end2end.DropSchemaIT
[INFO] Running org.apache.phoenix.end2end.FlappingLocalIndexIT
[WARNING] Tests run: 24, Failures: 0, Errors: 0, Skipped: 4, Time elapsed: 67.974 s - in org.apache.phoenix.end2end.ColumnEncodedImmutableNonTxStatsCollectorIT
[WARNING] Tests run: 24, Failures: 0, Errors: 0, Skipped: 4, Time elapsed: 68.056 s - in org.apache.phoenix.end2end.ColumnEncodedImmutableTxStatsCollectorIT
[WARNING] Tests run: 24, Failures: 0, Errors: 0, Skipped: 4, Time elapsed: 69.22 s - in org.apache.phoenix.end2end.ColumnEncodedMutableTxStatsCollectorIT
[WARNING] Tests run: 24, Failures: 0, Errors: 0, Skipped: 4, Time elapsed: 69.251 s - in org.apache.phoenix.end2end.ColumnEncodedMutableNonTxStatsCollectorIT
[INFO] Running org.apache.phoenix.end2end.IndexExtendedIT
[INFO] Running org.apache.phoenix.end2end.IndexScrutinyToolIT
[INFO] Running org.apache.phoenix.end2end.IndexToolForPartialBuildIT
[INFO] Running org.apache.phoenix.end2end.IndexToolForPartialBuildWithNamespaceEnabledIT
[INFO] Running org.apache.phoenix.end2end.IndexToolIT
[INFO] Tests run: 12, Failures: 0, Errors: 0, Skipped: 0, Time elapsed: 80.265 s - in org.apache.phoenix.end2end.CsvBulkLoadToolIT
[INFO] Running org.apache.phoenix.end2end.LocalIndexSplitMergeIT
[INFO] Tests run: 2, Failures: 0, Errors: 0, Skipped: 0, Time elapsed: 22.96 s - in org.apache.phoenix.end2end.IndexToolForPartialBuildIT
[INFO] Tests run: 2, Failures: 0, Errors: 0, Skipped: 0, Time elapsed: 22.288 s - in org.apache.phoenix.end2end.IndexToolForPartialBuildWithNamespaceEnabledIT
[INFO] Running org.apache.phoenix.end2end.NonColumnEncodedImmutableNonTxStatsCollectorIT
[INFO] Running org.apache.phoenix.end2end.NonColumnEncodedImmutableTxStatsCollectorIT
[INFO] Tests run: 2, Failures: 0, Errors: 0, Skipped: 0, Time elapsed: 64.117 s - in org.apache.phoenix.end2end.LocalIndexSplitMergeIT
[INFO] Tests run: 12, Failures: 0, Errors: 0, Skipped: 0, Time elapsed: 136.74 s - in org.apache.phoenix.end2end.FlappingLocalIndexIT
[INFO] Running org.apache.phoenix.end2end.QueryTimeoutIT
[INFO] Tests run: 2, Failures: 0, Errors: 0, Skipped: 0, Time elapsed: 14.969 s - in org.apache.phoenix.end2end.QueryTimeoutIT
[INFO] Tests run: 32, Failures: 0, Errors: 0, Skipped: 0, Time elapsed: 142.737 s - in org.apache.phoenix.end2end.IndexExtendedIT
[INFO] Running org.apache.phoenix.end2end.QueryWithLimitIT
[INFO] Tests run: 2, Failures: 0, Errors: 0, Skipped: 0, Time elapsed: 5.085 s - in org.apache.phoenix.end2end.QueryWithLimitIT
[WARNING] Tests run: 24, Failures: 0, Errors: 0, Skipped: 4, Time elapsed: 71.48 s - in org.apache.phoenix.end2end.NonColumnEncodedImmutableNonTxStatsCollectorIT
[WARNING] Tests run: 24, Failures: 0, Errors: 0, Skipped: 4, Time elapsed: 67.446 s - in org.apache.phoenix.end2end.NonColumnEncodedImmutableTxStatsCollectorIT
[INFO] Running org.apache.phoenix.end2end.RebuildIndexConnectionPropsIT
[INFO] Tests run: 1, Failures: 0, Errors: 0, Skipped: 0, Time elapsed: 0.608 s - in org.apache.phoenix.end2end.RebuildIndexConnectionPropsIT
[INFO] Running org.apache.phoenix.end2end.RegexBulkLoadToolIT
[INFO] Running org.apache.phoenix.end2end.SystemTablePermissionsIT
[INFO] Running org.apache.phoenix.end2end.RenewLeaseIT
[INFO] Running org.apache.phoenix.end2end.SpillableGroupByIT
[INFO] Running org.apache.phoenix.end2end.TableSnapshotReadsMapReduceIT
[INFO] Tests run: 1, Failures: 0, Errors: 0, Skipped: 0, Time elapsed: 26.498 s - in org.apache.phoenix.end2end.RenewLeaseIT
[INFO] Running org.apache.phoenix.end2end.SysTableNamespaceMappedStatsCollectorIT
[INFO] Tests run: 2, Failures: 0, Errors: 0, Skipped: 0, Time elapsed: 9.423 s - in org.apache.phoenix.end2end.SpillableGroupByIT
[INFO] Tests run: 20, Failures: 0, Errors: 0, Skipped: 0, Time elapsed: 203.338 s - in org.apache.phoenix.end2end.IndexScrutinyToolIT
[INFO] Tests run: 3, Failures: 0, Errors: 0, Skipped: 0, Time elapsed: 21.268 s - in org.apache.phoenix.end2end.TableSnapshotReadsMapReduceIT
[INFO] Tests run: 10, Failures: 0, Errors: 0, Skipped: 0, Time elapsed: 69.044 s - in org.apache.phoenix.end2end.RegexBulkLoadToolIT
[INFO] Running org.apache.phoenix.end2end.UpdateCacheAcrossDifferentClientsIT
[INFO] Tests run: 2, Failures: 0, Errors: 0, Skipped: 0, Time elapsed: 88.701 s - in org.apache.phoenix.end2end.SystemTablePermissionsIT
[INFO] Running org.apache.phoenix.end2end.UserDefinedFunctionsIT
[INFO] Running org.apache.phoenix.end2end.index.ImmutableIndexIT
[WARNING] Tests run: 24, Failures: 0, Errors: 0, Skipped: 4, Time elapsed: 69.089 s - in org.apache.phoenix.end2end.SysTableNamespaceMappedStatsCollectorIT
[INFO] Running org.apache.phoenix.end2end.index.LocalIndexIT
[INFO] Running org.apache.phoenix.end2end.index.MutableIndexFailureIT
[INFO] Tests run: 6, Failures: 0, Errors: 0, Skipped: 0, Time elapsed: 33.679 s - in org.apache.phoenix.end2end.UpdateCacheAcrossDifferentClientsIT
[INFO] Running org.apache.phoenix.end2end.index.MutableIndexReplicationIT
[INFO] Tests run: 14, Failures: 0, Errors: 0, Skipped: 0, Time elapsed: 53.238 s - in org.apache.phoenix.end2end.UserDefinedFunctionsIT
[INFO] Running org.apache.phoenix.end2end.index.PartialIndexRebuilderIT
[INFO] Tests run: 1, Failures: 0, Errors: 0, Skipped: 0, Time elapsed: 23.933 s - in org.apache.phoenix.end2end.index.MutableIndexReplicationIT
[INFO] Running org.apache.phoenix.end2end.index.txn.TxWriteFailureIT
[INFO] Running org.apache.phoenix.execute.UpsertSelectOverlappingBatchesIT
[INFO] Running org.apache.phoenix.execute.PartialCommitIT
[INFO] Tests run: 12, Failures: 0, Errors: 0, Skipped: 0, Time elapsed: 0.911 s - in org.apache.phoenix.execute.PartialCommitIT
[WARNING] Tests run: 24, Failures: 0, Errors: 0, Skipped: 16, Time elapsed: 115.59 s - in
org.apache.phoenix.end2end.index.ImmutableIndexIT
[INFO] Tests run: 8, Failures: 0, Errors: 0, Skipped: 0, Time elapsed: 57.957 s - in org.apache.phoenix.end2end.index.txn.TxWriteFailureIT
[INFO] Running org.apache.phoenix.hbase.index.FailForUnsupportedHBaseVersionsIT
[INFO] Tests run: 32, Failures: 0, Errors: 0, Skipped: 0, Time elapsed: 387.123 s - in org.apache.phoenix.end2end.IndexToolIT
[INFO] Tests run: 2, Failures: 0, Errors: 0, Skipped: 0, Time elapsed: 19.919 s - in org.apache.phoenix.hbase.index.FailForUnsupportedHBaseVersionsIT
[INFO] Running org.apache.phoenix.iterate.RoundRobinResultIteratorWithStatsIT
[INFO] Running org.apache.phoenix.iterate.ScannerLeaseRenewalIT
[INFO] Tests run: 3, Failures: 0, Errors: 0, Skipped: 0, Time elapsed: 66.837 s - in org.apache.phoenix.execute.UpsertSelectOverlappingBatchesIT
[INFO] Tests run: 1, Failures: 0, Errors: 0, Skipped: 0, Time elapsed: 8.189 s - in org.apache.phoenix.iterate.RoundRobinResultIteratorWithStatsIT
[INFO] Running org.apache.phoenix.monitoring.PhoenixMetricsIT
[INFO] Running org.apache.phoenix.rpc.PhoenixClientRpcIT
[INFO] Tests run: 2, Failures: 0, Errors: 0, Skipped: 0, Time elapsed: 4.056 s - in org.apache.phoenix.rpc.PhoenixClientRpcIT
[INFO] Running org.apache.phoenix.rpc.PhoenixServerRpcIT
[INFO] Tests run: 2, Failures: 0, Errors: 0, Skipped: 0, Time elapsed: 12.923 s - in org.apache.phoenix.rpc.PhoenixServerRpcIT
[INFO] Tests run: 22, Failures: 0, Errors: 0, Skipped: 0, Time elapsed: 65.189 s - in org.apache.phoenix.monitoring.PhoenixMetricsIT
[ERROR] Tests run: 21, Failures: 5, Errors: 0, Skipped: 0, Time elapsed: 277.824 s <<<
FAILURE! - in org.apache.phoenix.end2end.index.MutableIndexFailureIT
[ERROR] testIndexWriteFailure[MutableIndexFailureIT_transactional=false,localIndex=true,isNamespaceMapped=true,disableIndexOnWriteFailure=true,failRebuildTask=false,throwIndexWriteFailure=null](org.apache.phoenix.end2end.index.MutableIndexFailureIT)
 Time elapsed: 9.934 s  <<< FAILURE!
org.junit.ComparisonFailure: expected:<[a]> but was:<[x]>
	at org.apache.phoenix.end2end.index.MutableIndexFailureIT.testIndexWriteFailure(MutableIndexFailureIT.java:308)

[ERROR] testIndexWriteFailure[MutableIndexFailureIT_transactional=false,localIndex=true,isNamespaceMapped=false,disableIndexOnWriteFailure=null,failRebuildTask=false,throwIndexWriteFailure=null](org.apache.phoenix.end2end.index.MutableIndexFailureIT)
 Time elapsed: 10.118 s  <<< FAILURE!
org.junit.ComparisonFailure: expected:<[a]> but was:<[x]>
	at org.apache.phoenix.end2end.index.MutableIndexFailureIT.testIndexWriteFailure(MutableIndexFailureIT.java:308)

[ERROR] testIndexWriteFailure[MutableIndexFailureIT_transactional=false,localIndex=true,isNamespaceMapped=false,disableIndexOnWriteFailure=false,failRebuildTask=false,throwIndexWriteFailure=null](org.apache.phoenix.end2end.index.MutableIndexFailureIT)
 Time elapsed: 8.852 s  <<< FAILURE!
java.lang.AssertionError: Expected equality for V1, but 'x'!='x2'
	at org.apache.phoenix.end2end.index.MutableIndexFailureIT.testIndexWriteFailure(MutableIndexFailureIT.java:338)

[ERROR] testIndexWriteFailure[MutableIndexFailureIT_transactional=false,localIndex=true,isNamespaceMapped=false,disableIndexOnWriteFailure=true,failRebuildTask=false,throwIndexWriteFailure=null](org.apache.phoenix.end2end.index.MutableIndexFailureIT)
 Time elapsed: 8.824 s  <<< FAILURE!
org.junit.ComparisonFailure: expected:<[a]> but was:<[x]>
	at org.apache.phoenix.end2end.index.MutableIndexFailureIT.testIndexWriteFailure(MutableIndexFailureIT.java:308)

[ERROR] testIndexWriteFailure[MutableIndexFailureIT_transactional=false,localIndex=true,isNamespaceMapped=false,disableIndexOnWriteFailure=true,failRebuildTask=false,throwIndexWriteFailure=null](org.apache.phoenix.end2end.index.MutableIndexFailureIT)
 Time elapsed: 8.712 s  <<< FAILURE!
org.junit.ComparisonFailure: expected:<[a]> but was:<[x]>
	at org.apache.phoenix.end2end.index.MutableIndexFailureIT.testIndexWriteFailure(MutableIndexFailureIT.java:308)

[WARNING] Tests run: 24, Failures: 0, Errors: 0, Skipped: 2, Time elapsed: 247.869 s - in
org.apache.phoenix.end2end.index.PartialIndexRebuilderIT
[INFO] Tests run: 2, Failures: 0, Errors: 0, Skipped: 0, Time elapsed: 162.239 s - in org.apache.phoenix.iterate.ScannerLeaseRenewalIT
[INFO] Tests run: 34, Failures: 0, Errors: 0, Skipped: 0, Time elapsed: 333.015 s - in org.apache.phoenix.end2end.index.LocalIndexIT
[INFO] 
[INFO] Results:
[INFO] 
[ERROR] Failures: 
[ERROR]   MutableIndexFailureIT.testIndexWriteFailure:338 Expected equality for V1, but 'x'!='x2'
[ERROR]   MutableIndexFailureIT.testIndexWriteFailure:308 expected:<[a]> but was:<[x]>
[ERROR] org.apache.phoenix.end2end.index.MutableIndexFailureIT.testIndexWriteFailure[MutableIndexFailureIT_transactional=false,localIndex=true,isNamespaceMapped=false,disableIndexOnWriteFailure=true,failRebuildTask=false,throwIndexWriteFailure=null](org.apache.phoenix.end2end.index.MutableIndexFailureIT)
[ERROR]   Run 1: MutableIndexFailureIT.testIndexWriteFailure:308 expected:<[a]> but
was:<[x]>
[ERROR]   Run 2: MutableIndexFailureIT.testIndexWriteFailure:308 expected:<[a]> but
was:<[x]>
[INFO] 
[ERROR]   MutableIndexFailureIT.testIndexWriteFailure:308 expected:<[a]> but was:<[x]>
[INFO] 
[ERROR] Tests run: 491, Failures: 4, Errors: 0, Skipped: 46
[INFO] 
[INFO] 
[INFO] --- maven-failsafe-plugin:2.20:verify (ParallelStatsEnabledTest) @ phoenix-core ---
[INFO] ------------------------------------------------------------------------
[INFO] Reactor Summary:
[INFO] 
[INFO] Apache Phoenix ..................................... SUCCESS [  2.385 s]
[INFO] Phoenix Core ....................................... FAILURE [  01:05 h]
[INFO] Phoenix - Flume .................................... SKIPPED
[INFO] Phoenix - Kafka .................................... SKIPPED
[INFO] Phoenix - Pig ...................................... SKIPPED
[INFO] Phoenix Query Server Client ........................ SKIPPED
[INFO] Phoenix Query Server ............................... SKIPPED
[INFO] Phoenix - Pherf .................................... SKIPPED
[INFO] Phoenix - Spark .................................... SKIPPED
[INFO] Phoenix - Hive ..................................... SKIPPED
[INFO] Phoenix Client ..................................... SKIPPED
[INFO] Phoenix Server ..................................... SKIPPED
[INFO] Phoenix Assembly ................................... SKIPPED
[INFO] Phoenix - Tracing Web Application .................. SKIPPED
[INFO] Phoenix Load Balancer .............................. SKIPPED
[INFO] ------------------------------------------------------------------------
[INFO] BUILD FAILURE
[INFO] ------------------------------------------------------------------------
[INFO] Total time: 01:05 h
[INFO] Finished at: 2017-09-29T23:20:25Z
[INFO] Final Memory: 62M/1537M
[INFO] ------------------------------------------------------------------------
[ERROR] Failed to execute goal org.apache.maven.plugins:maven-failsafe-plugin:2.20:verify
(ParallelStatsEnabledTest) on project phoenix-core: There are test failures.
[ERROR] 
[ERROR] Please refer to <https://builds.apache.org/job/Phoenix-4.x-HBase-1.2/ws/phoenix-core/target/failsafe-reports>
for the individual test results.
[ERROR] Please refer to dump files (if any exist) [date]-jvmRun[N].dump, [date].dumpstream
and [date]-jvmRun[N].dumpstream.
[ERROR] -> [Help 1]
[ERROR] 
[ERROR] To see the full stack trace of the errors, re-run Maven with the -e switch.
[ERROR] Re-run Maven using the -X switch to enable full debug logging.
[ERROR] 
[ERROR] For more information about the errors and possible solutions, please read the following
articles:
[ERROR] [Help 1] http://cwiki.apache.org/confluence/display/MAVEN/MojoFailureException
[ERROR] 
[ERROR] After correcting the problems, you can resume the build with the command
[ERROR]   mvn <goals> -rf :phoenix-core
Build step 'Invoke top-level Maven targets' marked build as failure
Archiving artifacts
Recording test results

Mime
View raw message