phoenix-commits mailing list archives

Site index · List index
Message view « Date » · « Thread »
Top « Date » · « Thread »
From Apache Jenkins Server <jenk...@builds.apache.org>
Subject Build failed in Jenkins: Phoenix-4.x-HBase-1.2 #174
Date Sat, 23 Sep 2017 11:52:10 GMT
See <https://builds.apache.org/job/Phoenix-4.x-HBase-1.2/174/display/redirect?page=changes>

Changes:

[jtaylor] PHOENIX-4226 Server crashes on local index write failure with mix of

------------------------------------------
[...truncated 111.03 KB...]
[ERROR] testGroupByWithLimitOverRowKey(org.apache.phoenix.end2end.UpsertValuesIT)  Time elapsed:
2.598 s  <<< FAILURE!
java.lang.AssertionError: The following tables are not deleted that should be: TESTAUTOMATICALLYSETTINGROWTIMESTAMP
TESTSETTINGROWTIMESTAMPFORIMMUTABLETABLEANDINDEXES

[ERROR] testWithUpsertingRowTimestampColSpecified_asc(org.apache.phoenix.end2end.UpsertValuesIT)
 Time elapsed: 5.159 s  <<< FAILURE!
java.lang.AssertionError: The following tables are not deleted that should be: TESTAUTOMATICALLYSETTINGROWTIMESTAMP
TESTSETTINGROWTIMESTAMPFORIMMUTABLETABLEANDINDEXES TESTUPSERTINGROWTIMESTAMPCOL

[ERROR] testBatchedUpsert(org.apache.phoenix.end2end.UpsertValuesIT)  Time elapsed: 2.582
s  <<< FAILURE!
java.lang.AssertionError: The following tables are not deleted that should be: TESTAUTOMATICALLYSETTINGROWTIMESTAMP
TESTSETTINGROWTIMESTAMPFORIMMUTABLETABLEANDINDEXES TESTUPSERTINGROWTIMESTAMPCOL

[ERROR] testUpsertRandomValues(org.apache.phoenix.end2end.UpsertValuesIT)  Time elapsed: 2.549
s  <<< FAILURE!
java.lang.AssertionError: The following tables are not deleted that should be: TESTAUTOMATICALLYSETTINGROWTIMESTAMP
TESTSETTINGROWTIMESTAMPFORIMMUTABLETABLEANDINDEXES TESTUPSERTINGROWTIMESTAMPCOL

[ERROR] testUpsertValuesWithMoreValuesThanNumColsInTable(org.apache.phoenix.end2end.UpsertValuesIT)
 Time elapsed: 0.221 s  <<< FAILURE!
java.lang.AssertionError: The following tables are not deleted that should be: TESTAUTOMATICALLYSETTINGROWTIMESTAMP
TESTSETTINGROWTIMESTAMPFORIMMUTABLETABLEANDINDEXES TESTUPSERTINGROWTIMESTAMPCOL

[ERROR] testUpsertValuesWithDate(org.apache.phoenix.end2end.UpsertValuesIT)  Time elapsed:
4.596 s  <<< FAILURE!
java.lang.AssertionError: The following tables are not deleted that should be: TESTAUTOMATICALLYSETTINGROWTIMESTAMP
TESTSETTINGROWTIMESTAMPFORIMMUTABLETABLEANDINDEXES TESTUPSERTINGROWTIMESTAMPCOL

[ERROR] testDisallowNegativeValuesForRowTsColumn(org.apache.phoenix.end2end.UpsertValuesIT)
 Time elapsed: 2.532 s  <<< FAILURE!
java.lang.AssertionError: The following tables are not deleted that should be: TESTAUTOMATICALLYSETTINGROWTIMESTAMP
TESTSETTINGROWTIMESTAMPFORIMMUTABLETABLEANDINDEXES TESTUPSERTINGROWTIMESTAMPCOL

[ERROR] testUpsertVarCharWithMaxLength(org.apache.phoenix.end2end.UpsertValuesIT)  Time elapsed:
2.562 s  <<< FAILURE!
java.lang.AssertionError: The following tables are not deleted that should be: TESTAUTOMATICALLYSETTINGROWTIMESTAMP
TESTSETTINGROWTIMESTAMPFORIMMUTABLETABLEANDINDEXES TESTUPSERTINGROWTIMESTAMPCOL

[ERROR] testUpsertDateString(org.apache.phoenix.end2end.UpsertValuesIT)  Time elapsed: 2.557
s  <<< FAILURE!
java.lang.AssertionError: The following tables are not deleted that should be: TESTAUTOMATICALLYSETTINGROWTIMESTAMP
TESTSETTINGROWTIMESTAMPFORIMMUTABLETABLEANDINDEXES TESTUPSERTINGROWTIMESTAMPCOL

[ERROR] testUpsertDateValues(org.apache.phoenix.end2end.UpsertValuesIT)  Time elapsed: 0.285
s  <<< FAILURE!
java.lang.AssertionError: The following tables are not deleted that should be: TESTAUTOMATICALLYSETTINGROWTIMESTAMP
TESTSETTINGROWTIMESTAMPFORIMMUTABLETABLEANDINDEXES TESTUPSERTINGROWTIMESTAMPCOL

[ERROR] testAutomaticallySettingRowTimestampForImmutableTableAndIndexes_asc(org.apache.phoenix.end2end.UpsertValuesIT)
 Time elapsed: 0.127 s  <<< ERROR!
java.sql.SQLException: ERROR 1010 (42M01): Not allowed to mutate table. tableName=TESTSETTINGROWTIMESTAMPFORIMMUTABLETABLEANDINDEXES
	at org.apache.phoenix.end2end.UpsertValuesIT.testAutomaticallySettingRowTimestampForImmutableTableAndIndexes(UpsertValuesIT.java:830)
	at org.apache.phoenix.end2end.UpsertValuesIT.testAutomaticallySettingRowTimestampForImmutableTableAndIndexes_asc(UpsertValuesIT.java:822)

[ERROR] testAutomaticallySettingRowTimestampForImmutableTableAndIndexes_asc(org.apache.phoenix.end2end.UpsertValuesIT)
 Time elapsed: 0.127 s  <<< FAILURE!
java.lang.AssertionError: The following tables are not deleted that should be: TESTAUTOMATICALLYSETTINGROWTIMESTAMP
TESTSETTINGROWTIMESTAMPFORIMMUTABLETABLEANDINDEXES TESTUPSERTINGROWTIMESTAMPCOL

[ERROR] testTimestampAddSubtractArithmetic(org.apache.phoenix.end2end.UpsertValuesIT)  Time
elapsed: 0.295 s  <<< FAILURE!
java.lang.AssertionError: The following tables are not deleted that should be: TESTAUTOMATICALLYSETTINGROWTIMESTAMP
TESTSETTINGROWTIMESTAMPFORIMMUTABLETABLEANDINDEXES TESTUPSERTINGROWTIMESTAMPCOL

[ERROR] testWithUpsertingRowTimestampColSpecified_desc(org.apache.phoenix.end2end.UpsertValuesIT)
 Time elapsed: 0.111 s  <<< ERROR!
java.sql.SQLException: ERROR 1010 (42M01): Not allowed to mutate table. tableName=TESTUPSERTINGROWTIMESTAMPCOL
	at org.apache.phoenix.end2end.UpsertValuesIT.testWithUpsertingRowTimestampColSpecified(UpsertValuesIT.java:696)
	at org.apache.phoenix.end2end.UpsertValuesIT.testWithUpsertingRowTimestampColSpecified_desc(UpsertValuesIT.java:682)

[ERROR] testWithUpsertingRowTimestampColSpecified_desc(org.apache.phoenix.end2end.UpsertValuesIT)
 Time elapsed: 0.111 s  <<< FAILURE!
java.lang.AssertionError: The following tables are not deleted that should be: TESTAUTOMATICALLYSETTINGROWTIMESTAMP
TESTSETTINGROWTIMESTAMPFORIMMUTABLETABLEANDINDEXES TESTUPSERTINGROWTIMESTAMPCOL

[INFO] 
[INFO] Results:
[INFO] 
[ERROR] Failures: 
[ERROR]   UpsertValuesIT>BaseClientManagedTimeIT.cleanUpAfterTest:59->BaseTest.deletePriorMetaData:839->BaseTest.deletePriorTables:847->BaseTest.deletePriorTables:868
The following tables are not deleted that should be: TESTAUTOMATICALLYSETTINGROWTIMESTAMP
TESTSETTINGROWTIMESTAMPFORIMMUTABLETABLEANDINDEXES
[ERROR]   UpsertValuesIT>BaseClientManagedTimeIT.cleanUpAfterTest:59->BaseTest.deletePriorMetaData:839->BaseTest.deletePriorTables:847->BaseTest.deletePriorTables:868
The following tables are not deleted that should be: TESTAUTOMATICALLYSETTINGROWTIMESTAMP
[ERROR]   UpsertValuesIT>BaseClientManagedTimeIT.cleanUpAfterTest:59->BaseTest.deletePriorMetaData:839->BaseTest.deletePriorTables:847->BaseTest.deletePriorTables:868
The following tables are not deleted that should be: TESTAUTOMATICALLYSETTINGROWTIMESTAMP
TESTSETTINGROWTIMESTAMPFORIMMUTABLETABLEANDINDEXES TESTUPSERTINGROWTIMESTAMPCOL
[ERROR]   UpsertValuesIT>BaseClientManagedTimeIT.cleanUpAfterTest:59->BaseTest.deletePriorMetaData:839->BaseTest.deletePriorTables:847->BaseTest.deletePriorTables:868
The following tables are not deleted that should be: TESTAUTOMATICALLYSETTINGROWTIMESTAMP
[ERROR]   UpsertValuesIT>BaseClientManagedTimeIT.cleanUpAfterTest:59->BaseTest.deletePriorMetaData:839->BaseTest.deletePriorTables:847->BaseTest.deletePriorTables:868
The following tables are not deleted that should be: TESTAUTOMATICALLYSETTINGROWTIMESTAMP
TESTSETTINGROWTIMESTAMPFORIMMUTABLETABLEANDINDEXES TESTUPSERTINGROWTIMESTAMPCOL
[ERROR]   UpsertValuesIT>BaseClientManagedTimeIT.cleanUpAfterTest:59->BaseTest.deletePriorMetaData:839->BaseTest.deletePriorTables:847->BaseTest.deletePriorTables:868
The following tables are not deleted that should be: TESTAUTOMATICALLYSETTINGROWTIMESTAMP
TESTSETTINGROWTIMESTAMPFORIMMUTABLETABLEANDINDEXES
[ERROR]   UpsertValuesIT>BaseClientManagedTimeIT.cleanUpAfterTest:59->BaseTest.deletePriorMetaData:839->BaseTest.deletePriorTables:847->BaseTest.deletePriorTables:868
The following tables are not deleted that should be: TESTAUTOMATICALLYSETTINGROWTIMESTAMP
TESTSETTINGROWTIMESTAMPFORIMMUTABLETABLEANDINDEXES TESTUPSERTINGROWTIMESTAMPCOL
[ERROR]   UpsertValuesIT>BaseClientManagedTimeIT.cleanUpAfterTest:59->BaseTest.deletePriorMetaData:839->BaseTest.deletePriorTables:847->BaseTest.deletePriorTables:868
The following tables are not deleted that should be: TESTAUTOMATICALLYSETTINGROWTIMESTAMP
[ERROR]   UpsertValuesIT>BaseClientManagedTimeIT.cleanUpAfterTest:59->BaseTest.deletePriorMetaData:839->BaseTest.deletePriorTables:847->BaseTest.deletePriorTables:868
The following tables are not deleted that should be: TESTAUTOMATICALLYSETTINGROWTIMESTAMP
TESTSETTINGROWTIMESTAMPFORIMMUTABLETABLEANDINDEXES TESTUPSERTINGROWTIMESTAMPCOL
[ERROR]   UpsertValuesIT>BaseClientManagedTimeIT.cleanUpAfterTest:59->BaseTest.deletePriorMetaData:839->BaseTest.deletePriorTables:847->BaseTest.deletePriorTables:868
The following tables are not deleted that should be: TESTAUTOMATICALLYSETTINGROWTIMESTAMP
TESTSETTINGROWTIMESTAMPFORIMMUTABLETABLEANDINDEXES TESTUPSERTINGROWTIMESTAMPCOL
[ERROR]   UpsertValuesIT>BaseClientManagedTimeIT.cleanUpAfterTest:59->BaseTest.deletePriorMetaData:839->BaseTest.deletePriorTables:847->BaseTest.deletePriorTables:868
The following tables are not deleted that should be: TESTAUTOMATICALLYSETTINGROWTIMESTAMP
[ERROR]   UpsertValuesIT>BaseClientManagedTimeIT.cleanUpAfterTest:59->BaseTest.deletePriorMetaData:839->BaseTest.deletePriorTables:847->BaseTest.deletePriorTables:868
The following tables are not deleted that should be: TESTAUTOMATICALLYSETTINGROWTIMESTAMP
TESTSETTINGROWTIMESTAMPFORIMMUTABLETABLEANDINDEXES TESTUPSERTINGROWTIMESTAMPCOL
[ERROR]   UpsertValuesIT>BaseClientManagedTimeIT.cleanUpAfterTest:59->BaseTest.deletePriorMetaData:839->BaseTest.deletePriorTables:847->BaseTest.deletePriorTables:868
The following tables are not deleted that should be: TESTAUTOMATICALLYSETTINGROWTIMESTAMP
TESTSETTINGROWTIMESTAMPFORIMMUTABLETABLEANDINDEXES TESTUPSERTINGROWTIMESTAMPCOL
[ERROR]   UpsertValuesIT>BaseClientManagedTimeIT.cleanUpAfterTest:59->BaseTest.deletePriorMetaData:839->BaseTest.deletePriorTables:847->BaseTest.deletePriorTables:868
The following tables are not deleted that should be: TESTAUTOMATICALLYSETTINGROWTIMESTAMP
[ERROR]   UpsertValuesIT>BaseClientManagedTimeIT.cleanUpAfterTest:59->BaseTest.deletePriorMetaData:839->BaseTest.deletePriorTables:847->BaseTest.deletePriorTables:868
The following tables are not deleted that should be: TESTAUTOMATICALLYSETTINGROWTIMESTAMP
[ERROR]   UpsertValuesIT>BaseClientManagedTimeIT.cleanUpAfterTest:59->BaseTest.deletePriorMetaData:839->BaseTest.deletePriorTables:847->BaseTest.deletePriorTables:868
The following tables are not deleted that should be: TESTAUTOMATICALLYSETTINGROWTIMESTAMP
[ERROR]   UpsertValuesIT>BaseClientManagedTimeIT.cleanUpAfterTest:59->BaseTest.deletePriorMetaData:839->BaseTest.deletePriorTables:847->BaseTest.deletePriorTables:868
The following tables are not deleted that should be: TESTAUTOMATICALLYSETTINGROWTIMESTAMP
TESTSETTINGROWTIMESTAMPFORIMMUTABLETABLEANDINDEXES TESTUPSERTINGROWTIMESTAMPCOL
[ERROR]   UpsertValuesIT>BaseClientManagedTimeIT.cleanUpAfterTest:59->BaseTest.deletePriorMetaData:839->BaseTest.deletePriorTables:847->BaseTest.deletePriorTables:868
The following tables are not deleted that should be: TESTAUTOMATICALLYSETTINGROWTIMESTAMP
TESTSETTINGROWTIMESTAMPFORIMMUTABLETABLEANDINDEXES TESTUPSERTINGROWTIMESTAMPCOL
[ERROR]   UpsertValuesIT>BaseClientManagedTimeIT.cleanUpAfterTest:59->BaseTest.deletePriorMetaData:839->BaseTest.deletePriorTables:847->BaseTest.deletePriorTables:868
The following tables are not deleted that should be: TESTAUTOMATICALLYSETTINGROWTIMESTAMP
TESTSETTINGROWTIMESTAMPFORIMMUTABLETABLEANDINDEXES TESTUPSERTINGROWTIMESTAMPCOL
[ERROR] Errors: 
[ERROR] org.apache.phoenix.end2end.UpsertValuesIT.testAutomaticallySettingRowTimestampForImmutableTableAndIndexes_asc(org.apache.phoenix.end2end.UpsertValuesIT)
[ERROR]   Run 1: UpsertValuesIT.testAutomaticallySettingRowTimestampForImmutableTableAndIndexes_asc:822->testAutomaticallySettingRowTimestampForImmutableTableAndIndexes:830
» SQL
[ERROR]   Run 2: UpsertValuesIT>BaseClientManagedTimeIT.cleanUpAfterTest:59->BaseTest.deletePriorMetaData:839->BaseTest.deletePriorTables:847->BaseTest.deletePriorTables:868
The following tables are not deleted that should be: TESTAUTOMATICALLYSETTINGROWTIMESTAMP
TESTSETTINGROWTIMESTAMPFORIMMUTABLETABLEANDINDEXES TESTUPSERTINGROWTIMESTAMPCOL
[INFO] 
[ERROR] org.apache.phoenix.end2end.UpsertValuesIT.testAutomaticallySettingRowtimestamp_asc(org.apache.phoenix.end2end.UpsertValuesIT)
[ERROR]   Run 1: UpsertValuesIT.testAutomaticallySettingRowtimestamp_asc:763->testAutomaticallySettingRowtimestamp:771
» SQL
[ERROR]   Run 2: UpsertValuesIT>BaseClientManagedTimeIT.cleanUpAfterTest:59->BaseTest.deletePriorMetaData:839->BaseTest.deletePriorTables:847->BaseTest.deletePriorTables:868
The following tables are not deleted that should be: TESTAUTOMATICALLYSETTINGROWTIMESTAMP
[INFO] 
[ERROR] org.apache.phoenix.end2end.UpsertValuesIT.testWithUpsertingRowTimestampColSpecified_desc(org.apache.phoenix.end2end.UpsertValuesIT)
[ERROR]   Run 1: UpsertValuesIT.testWithUpsertingRowTimestampColSpecified_desc:682->testWithUpsertingRowTimestampColSpecified:696
» SQL
[ERROR]   Run 2: UpsertValuesIT>BaseClientManagedTimeIT.cleanUpAfterTest:59->BaseTest.deletePriorMetaData:839->BaseTest.deletePriorTables:847->BaseTest.deletePriorTables:868
The following tables are not deleted that should be: TESTAUTOMATICALLYSETTINGROWTIMESTAMP
TESTSETTINGROWTIMESTAMPFORIMMUTABLETABLEANDINDEXES TESTUPSERTINGROWTIMESTAMPCOL
[INFO] 
[INFO] 
[ERROR] Tests run: 25, Failures: 19, Errors: 3, Skipped: 0
[INFO] 
[INFO] 
[INFO] --- maven-failsafe-plugin:2.20:integration-test (HBaseManagedTimeTests) @ phoenix-core
---
[INFO] 
[INFO] -------------------------------------------------------
[INFO]  T E S T S
[INFO] -------------------------------------------------------
[INFO] 
[INFO] Results:
[INFO] 
[INFO] Tests run: 0, Failures: 0, Errors: 0, Skipped: 0
[INFO] 
[INFO] 
[INFO] --- maven-failsafe-plugin:2.20:integration-test (NeedTheirOwnClusterTests) @ phoenix-core
---
[INFO] 
[INFO] -------------------------------------------------------
[INFO]  T E S T S
[INFO] -------------------------------------------------------
[INFO] Running org.apache.hadoop.hbase.regionserver.wal.WALReplayWithIndexWritesAndCompressedWALIT
[INFO] Running org.apache.phoenix.end2end.ConnectionUtilIT
[INFO] Tests run: 1, Failures: 0, Errors: 0, Skipped: 0, Time elapsed: 35.026 s - in org.apache.hadoop.hbase.regionserver.wal.WALReplayWithIndexWritesAndCompressedWALIT
[INFO] Running org.apache.hadoop.hbase.regionserver.wal.WALRecoveryRegionPostOpenIT
[INFO] Running org.apache.phoenix.end2end.CountDistinctCompressionIT
[INFO] Running org.apache.phoenix.end2end.CsvBulkLoadToolIT
[INFO] Running org.apache.phoenix.end2end.ContextClassloaderIT
[INFO] Tests run: 1, Failures: 0, Errors: 0, Skipped: 0, Time elapsed: 9.666 s - in org.apache.hadoop.hbase.regionserver.wal.WALRecoveryRegionPostOpenIT
[INFO] Tests run: 1, Failures: 0, Errors: 0, Skipped: 0, Time elapsed: 5.04 s - in org.apache.phoenix.end2end.CountDistinctCompressionIT
[INFO] Running org.apache.phoenix.end2end.DropSchemaIT
[INFO] Tests run: 3, Failures: 0, Errors: 0, Skipped: 0, Time elapsed: 4.793 s - in org.apache.phoenix.end2end.ContextClassloaderIT
[INFO] Tests run: 1, Failures: 0, Errors: 0, Skipped: 0, Time elapsed: 41.71 s - in org.apache.phoenix.end2end.ConnectionUtilIT
[INFO] Running org.apache.phoenix.end2end.FlappingLocalIndexIT
[INFO] Tests run: 2, Failures: 0, Errors: 0, Skipped: 0, Time elapsed: 22.727 s - in org.apache.phoenix.end2end.DropSchemaIT
[INFO] Running org.apache.phoenix.end2end.IndexExtendedIT
[INFO] Running org.apache.phoenix.end2end.IndexScrutinyToolIT
[INFO] Running org.apache.phoenix.end2end.IndexToolForPartialBuildIT
[INFO] Running org.apache.phoenix.end2end.IndexToolForPartialBuildWithNamespaceEnabledIT
[INFO] Running org.apache.phoenix.end2end.QueryTimeoutIT
[INFO] Tests run: 2, Failures: 0, Errors: 0, Skipped: 0, Time elapsed: 29.797 s - in org.apache.phoenix.end2end.IndexToolForPartialBuildIT
[INFO] Tests run: 2, Failures: 0, Errors: 0, Skipped: 0, Time elapsed: 30.761 s - in org.apache.phoenix.end2end.IndexToolForPartialBuildWithNamespaceEnabledIT
[INFO] Running org.apache.phoenix.end2end.QueryWithLimitIT
[INFO] Tests run: 2, Failures: 0, Errors: 0, Skipped: 0, Time elapsed: 9.438 s - in org.apache.phoenix.end2end.QueryWithLimitIT
[INFO] Tests run: 2, Failures: 0, Errors: 0, Skipped: 0, Time elapsed: 16.559 s - in org.apache.phoenix.end2end.QueryTimeoutIT
[INFO] Tests run: 12, Failures: 0, Errors: 0, Skipped: 0, Time elapsed: 106.461 s - in org.apache.phoenix.end2end.CsvBulkLoadToolIT
[INFO] Running org.apache.phoenix.end2end.RebuildIndexConnectionPropsIT
[INFO] Tests run: 1, Failures: 0, Errors: 0, Skipped: 0, Time elapsed: 0.617 s - in org.apache.phoenix.end2end.RebuildIndexConnectionPropsIT
[INFO] Running org.apache.phoenix.end2end.RegexBulkLoadToolIT
[INFO] Running org.apache.phoenix.end2end.RenewLeaseIT
[INFO] Running org.apache.phoenix.end2end.SpillableGroupByIT
[INFO] Running org.apache.phoenix.end2end.StatsCollectorIT
[INFO] Tests run: 10, Failures: 0, Errors: 0, Skipped: 0, Time elapsed: 125.934 s - in org.apache.phoenix.end2end.IndexScrutinyToolIT
[INFO] Tests run: 2, Failures: 0, Errors: 0, Skipped: 0, Time elapsed: 11.65 s - in org.apache.phoenix.end2end.SpillableGroupByIT
[INFO] Tests run: 1, Failures: 0, Errors: 0, Skipped: 0, Time elapsed: 28.543 s - in org.apache.phoenix.end2end.RenewLeaseIT
[INFO] Running org.apache.phoenix.end2end.SystemTablePermissionsIT
[INFO] Tests run: 12, Failures: 0, Errors: 0, Skipped: 0, Time elapsed: 199.695 s - in org.apache.phoenix.end2end.FlappingLocalIndexIT
[INFO] Running org.apache.phoenix.end2end.SysTableNamespaceMappedStatsCollectorIT
[INFO] Running org.apache.phoenix.end2end.TableSnapshotReadsMapReduceIT
[INFO] Tests run: 10, Failures: 0, Errors: 0, Skipped: 0, Time elapsed: 100.337 s - in org.apache.phoenix.end2end.RegexBulkLoadToolIT
[INFO] Running org.apache.phoenix.end2end.UpdateCacheAcrossDifferentClientsIT
[INFO] Tests run: 3, Failures: 0, Errors: 0, Skipped: 0, Time elapsed: 26.737 s - in org.apache.phoenix.end2end.TableSnapshotReadsMapReduceIT
[INFO] Running org.apache.phoenix.end2end.UserDefinedFunctionsIT
[INFO] Running org.apache.phoenix.end2end.index.ImmutableIndexIT
[INFO] Tests run: 2, Failures: 0, Errors: 0, Skipped: 0, Time elapsed: 126.318 s - in org.apache.phoenix.end2end.SystemTablePermissionsIT
[INFO] Tests run: 6, Failures: 0, Errors: 0, Skipped: 0, Time elapsed: 54.125 s - in org.apache.phoenix.end2end.UpdateCacheAcrossDifferentClientsIT
[INFO] Running org.apache.phoenix.end2end.index.LocalIndexIT
[INFO] Running org.apache.phoenix.end2end.index.MutableIndexFailureIT
[INFO] Tests run: 14, Failures: 0, Errors: 0, Skipped: 0, Time elapsed: 99.223 s - in org.apache.phoenix.end2end.UserDefinedFunctionsIT
[INFO] Running org.apache.phoenix.end2end.index.MutableIndexReplicationIT
[INFO] Tests run: 1, Failures: 0, Errors: 0, Skipped: 0, Time elapsed: 42.058 s - in org.apache.phoenix.end2end.index.MutableIndexReplicationIT
[INFO] Running org.apache.phoenix.end2end.index.PartialIndexRebuilderIT
[WARNING] Tests run: 24, Failures: 0, Errors: 0, Skipped: 16, Time elapsed: 145.88 s - in
org.apache.phoenix.end2end.index.ImmutableIndexIT
[INFO] Running org.apache.phoenix.end2end.index.txn.TxWriteFailureIT
[INFO] Running org.apache.phoenix.execute.PartialCommitIT
[INFO] Tests run: 12, Failures: 0, Errors: 0, Skipped: 0, Time elapsed: 0.906 s - in org.apache.phoenix.execute.PartialCommitIT
[INFO] Tests run: 8, Failures: 0, Errors: 0, Skipped: 0, Time elapsed: 84.603 s - in org.apache.phoenix.end2end.index.txn.TxWriteFailureIT
[INFO] Running org.apache.phoenix.hbase.index.FailForUnsupportedHBaseVersionsIT
[INFO] Running org.apache.phoenix.execute.UpsertSelectOverlappingBatchesIT
[INFO] Tests run: 2, Failures: 0, Errors: 0, Skipped: 0, Time elapsed: 25.634 s - in org.apache.phoenix.hbase.index.FailForUnsupportedHBaseVersionsIT
[INFO] Running org.apache.phoenix.hbase.index.covered.EndToEndCoveredColumnsIndexBuilderIT
[INFO] Tests run: 1, Failures: 0, Errors: 0, Skipped: 0, Time elapsed: 27.406 s - in org.apache.phoenix.execute.UpsertSelectOverlappingBatchesIT
[INFO] Tests run: 2, Failures: 0, Errors: 0, Skipped: 0, Time elapsed: 22.232 s - in org.apache.phoenix.hbase.index.covered.EndToEndCoveredColumnsIndexBuilderIT
[INFO] Running org.apache.phoenix.hbase.index.covered.FailWithoutRetriesIT
[INFO] Tests run: 1, Failures: 0, Errors: 0, Skipped: 0, Time elapsed: 5.735 s - in org.apache.phoenix.hbase.index.covered.FailWithoutRetriesIT
[INFO] Tests run: 140, Failures: 0, Errors: 0, Skipped: 0, Time elapsed: 638.365 s - in org.apache.phoenix.end2end.IndexExtendedIT
[INFO] Running org.apache.phoenix.iterate.RoundRobinResultIteratorWithStatsIT
[INFO] Running org.apache.phoenix.iterate.ScannerLeaseRenewalIT
[INFO] Tests run: 1, Failures: 0, Errors: 0, Skipped: 0, Time elapsed: 10.65 s - in org.apache.phoenix.iterate.RoundRobinResultIteratorWithStatsIT
[INFO] Running org.apache.phoenix.monitoring.PhoenixMetricsIT
[INFO] Tests run: 21, Failures: 0, Errors: 0, Skipped: 0, Time elapsed: 394.451 s - in org.apache.phoenix.end2end.index.MutableIndexFailureIT
[INFO] Running org.apache.phoenix.rpc.PhoenixClientRpcIT
[INFO] Tests run: 2, Failures: 0, Errors: 0, Skipped: 0, Time elapsed: 9.477 s - in org.apache.phoenix.rpc.PhoenixClientRpcIT
[INFO] Tests run: 34, Failures: 0, Errors: 0, Skipped: 0, Time elapsed: 467.569 s - in org.apache.phoenix.end2end.index.LocalIndexIT
[ERROR] Tests run: 24, Failures: 2, Errors: 0, Skipped: 0, Time elapsed: 379.268 s <<<
FAILURE! - in org.apache.phoenix.end2end.index.PartialIndexRebuilderIT
[ERROR] testIndexWriteFailureDisablingIndex(org.apache.phoenix.end2end.index.PartialIndexRebuilderIT)
 Time elapsed: 16.199 s  <<< FAILURE!
java.lang.AssertionError
	at org.apache.phoenix.end2end.index.PartialIndexRebuilderIT.testIndexWriteFailureDuringRebuild(PartialIndexRebuilderIT.java:910)
	at org.apache.phoenix.end2end.index.PartialIndexRebuilderIT.testIndexWriteFailureDisablingIndex(PartialIndexRebuilderIT.java:827)

[ERROR] testIndexWriteFailureLeavingIndexActive(org.apache.phoenix.end2end.index.PartialIndexRebuilderIT)
 Time elapsed: 15.49 s  <<< FAILURE!
java.lang.AssertionError
	at org.apache.phoenix.end2end.index.PartialIndexRebuilderIT.testIndexWriteFailureDuringRebuild(PartialIndexRebuilderIT.java:900)
	at org.apache.phoenix.end2end.index.PartialIndexRebuilderIT.testIndexWriteFailureLeavingIndexActive(PartialIndexRebuilderIT.java:832)

[WARNING] Tests run: 132, Failures: 0, Errors: 0, Skipped: 24, Time elapsed: 659.507 s - in
org.apache.phoenix.end2end.StatsCollectorIT
[INFO] Running org.apache.phoenix.rpc.PhoenixServerRpcIT
[INFO] Tests run: 2, Failures: 0, Errors: 0, Skipped: 0, Time elapsed: 21.778 s - in org.apache.phoenix.rpc.PhoenixServerRpcIT
[WARNING] Tests run: 132, Failures: 0, Errors: 0, Skipped: 24, Time elapsed: 650.923 s - in
org.apache.phoenix.end2end.SysTableNamespaceMappedStatsCollectorIT
[INFO] Tests run: 22, Failures: 0, Errors: 0, Skipped: 0, Time elapsed: 114.441 s - in org.apache.phoenix.monitoring.PhoenixMetricsIT
[INFO] Tests run: 2, Failures: 0, Errors: 0, Skipped: 0, Time elapsed: 169.206 s - in org.apache.phoenix.iterate.ScannerLeaseRenewalIT
[INFO] 
[INFO] Results:
[INFO] 
[ERROR] Failures: 
[ERROR]   PartialIndexRebuilderIT.testIndexWriteFailureDisablingIndex:827->testIndexWriteFailureDuringRebuild:910
[ERROR]   PartialIndexRebuilderIT.testIndexWriteFailureLeavingIndexActive:832->testIndexWriteFailureDuringRebuild:900
[INFO] 
[ERROR] Tests run: 653, Failures: 2, Errors: 0, Skipped: 64
[INFO] 
[INFO] 
[INFO] --- maven-failsafe-plugin:2.20:verify (ParallelStatsEnabledTest) @ phoenix-core ---
[INFO] ------------------------------------------------------------------------
[INFO] Reactor Summary:
[INFO] 
[INFO] Apache Phoenix ..................................... SUCCESS [  2.014 s]
[INFO] Phoenix Core ....................................... FAILURE [  02:15 h]
[INFO] Phoenix - Flume .................................... SKIPPED
[INFO] Phoenix - Kafka .................................... SKIPPED
[INFO] Phoenix - Pig ...................................... SKIPPED
[INFO] Phoenix Query Server Client ........................ SKIPPED
[INFO] Phoenix Query Server ............................... SKIPPED
[INFO] Phoenix - Pherf .................................... SKIPPED
[INFO] Phoenix - Spark .................................... SKIPPED
[INFO] Phoenix - Hive ..................................... SKIPPED
[INFO] Phoenix Client ..................................... SKIPPED
[INFO] Phoenix Server ..................................... SKIPPED
[INFO] Phoenix Assembly ................................... SKIPPED
[INFO] Phoenix - Tracing Web Application .................. SKIPPED
[INFO] Phoenix Load Balancer .............................. SKIPPED
[INFO] ------------------------------------------------------------------------
[INFO] BUILD FAILURE
[INFO] ------------------------------------------------------------------------
[INFO] Total time: 02:15 h
[INFO] Finished at: 2017-09-23T11:36:32Z
[INFO] Final Memory: 60M/1602M
[INFO] ------------------------------------------------------------------------
[ERROR] Failed to execute goal org.apache.maven.plugins:maven-failsafe-plugin:2.20:verify
(ParallelStatsEnabledTest) on project phoenix-core: There are test failures.
[ERROR] 
[ERROR] Please refer to <https://builds.apache.org/job/Phoenix-4.x-HBase-1.2/ws/phoenix-core/target/failsafe-reports>
for the individual test results.
[ERROR] Please refer to dump files (if any exist) [date]-jvmRun[N].dump, [date].dumpstream
and [date]-jvmRun[N].dumpstream.
[ERROR] -> [Help 1]
[ERROR] 
[ERROR] To see the full stack trace of the errors, re-run Maven with the -e switch.
[ERROR] Re-run Maven using the -X switch to enable full debug logging.
[ERROR] 
[ERROR] For more information about the errors and possible solutions, please read the following
articles:
[ERROR] [Help 1] http://cwiki.apache.org/confluence/display/MAVEN/MojoFailureException
[ERROR] 
[ERROR] After correcting the problems, you can resume the build with the command
[ERROR]   mvn <goals> -rf :phoenix-core
Build step 'Invoke top-level Maven targets' marked build as failure
Archiving artifacts
[Fast Archiver] Compressed 2.97 GB of artifacts by 54.4% relative to #172
Recording test results

Mime
View raw message