phoenix-commits mailing list archives

Site index · List index
Message view « Date » · « Thread »
Top « Date » · « Thread »
From Apache Jenkins Server <jenk...@builds.apache.org>
Subject Build failed in Jenkins: Phoenix | Master #1825
Date Fri, 29 Sep 2017 22:15:06 GMT
See <https://builds.apache.org/job/Phoenix-master/1825/display/redirect?page=changes>

Changes:

[jtaylor] PHOENIX-4258 Breakup ScanQueryIT into several integration tests so as

[jtaylor] Revert "PHOENIX-4214 Scans which write should not block region split or

[jtaylor] PHOENIX-4214 Scans which write should not block region split or close

[jtaylor] PHOENIX-4239 Ignore flapping PartialIndexRebuilderIT tests until fix is

[jtaylor] PHOENIX-4258 Breakup ScanQueryIT into several integration tests so as

[samarth] PHOENIX-4260 Breakup NotQueryIT into multiple test classes

------------------------------------------
[...truncated 143.50 KB...]
[INFO] 
[INFO] Results:
[INFO] 
[ERROR] Failures: 
[ERROR]   CaseStatementIT.testUnfoundSingleColumnCaseStatement:276
[ERROR]   CaseStatementIT.testUnfoundSingleColumnCaseStatement:276
[ERROR]   CaseStatementIT.testUnfoundSingleColumnCaseStatement:276
[ERROR]   CaseStatementIT.testUnfoundSingleColumnCaseStatement:276
[ERROR]   CaseStatementIT.testUnfoundSingleColumnCaseStatement:276
[ERROR]   CaseStatementIT.testUnfoundSingleColumnCaseStatement:276
[ERROR]   CaseStatementIT.testUnfoundSingleColumnCaseStatement:276
[ERROR]   GroupByIT.testGroupByCondition:359->BaseTest.assertValueEqualsResultSet:1585->BaseTest.assertValuesEqualsResultSet:1609
Could not find [8] in expected results: [[1], [1], [7]] with actual results: [[8]]
[ERROR]   GroupByIT.testGroupByCondition:359->BaseTest.assertValueEqualsResultSet:1585->BaseTest.assertValuesEqualsResultSet:1609
Could not find [8] in expected results: [[1], [1], [7]] with actual results: [[8]]
[ERROR]   GroupByIT.testGroupByCondition:359->BaseTest.assertValueEqualsResultSet:1585->BaseTest.assertValuesEqualsResultSet:1609
Could not find [8] in expected results: [[1], [1], [7]] with actual results: [[8]]
[ERROR]   GroupByIT.testGroupByCondition:359->BaseTest.assertValueEqualsResultSet:1585->BaseTest.assertValuesEqualsResultSet:1609
Could not find [8] in expected results: [[1], [1], [7]] with actual results: [[8]]
[ERROR]   GroupByIT.testGroupByCondition:359->BaseTest.assertValueEqualsResultSet:1585->BaseTest.assertValuesEqualsResultSet:1609
Could not find [8] in expected results: [[1], [1], [7]] with actual results: [[8]]
[ERROR]   GroupByIT.testGroupByCondition:359->BaseTest.assertValueEqualsResultSet:1585->BaseTest.assertValuesEqualsResultSet:1609
Could not find [8] in expected results: [[1], [1], [7]] with actual results: [[8]]
[ERROR]   GroupByIT.testGroupByCondition:359->BaseTest.assertValueEqualsResultSet:1585->BaseTest.assertValuesEqualsResultSet:1609
Could not find [8] in expected results: [[1], [1], [7]] with actual results: [[8]]
[ERROR]   UngroupedIT.testSumOverNullIntegerColumn:222 expected:<42> but was:<45>
[ERROR]   UngroupedIT.testSumOverNullIntegerColumn:222 expected:<42> but was:<45>
[ERROR]   UngroupedIT.testSumOverNullIntegerColumn:222 expected:<42> but was:<45>
[ERROR]   UngroupedIT.testSumOverNullIntegerColumn:222 expected:<42> but was:<45>
[ERROR]   UngroupedIT.testSumOverNullIntegerColumn:222 expected:<42> but was:<45>
[ERROR]   UngroupedIT.testSumOverNullIntegerColumn:222 expected:<42> but was:<45>
[ERROR]   UngroupedIT.testSumOverNullIntegerColumn:222 expected:<42> but was:<45>
[ERROR] Errors: 
[ERROR]   InQueryIT.testDateInList[InQueryIT_0] » IllegalArgument wrong number of argume...
[ERROR]   InQueryIT.testDateInList[InQueryIT_1] » IllegalArgument wrong number of argume...
[ERROR]   InQueryIT.testDateInList[InQueryIT_2] » IllegalArgument
[ERROR]   InQueryIT.testDateInList[InQueryIT_3] » IllegalArgument
[ERROR]   InQueryIT.testDateInList[InQueryIT_4] » IllegalArgument
[ERROR]   InQueryIT.testDateInList[InQueryIT_5] » IllegalArgument
[ERROR]   InQueryIT.testDateInList[InQueryIT_6] » IllegalArgument
[ERROR]   InQueryIT.testFullyQualifiedRVCInList[InQueryIT_0] » IllegalArgument wrong num...
[ERROR]   InQueryIT.testFullyQualifiedRVCInList[InQueryIT_1] » IllegalArgument wrong num...
[ERROR]   InQueryIT.testFullyQualifiedRVCInList[InQueryIT_2] » IllegalArgument
[ERROR]   InQueryIT.testFullyQualifiedRVCInList[InQueryIT_3] » IllegalArgument
[ERROR]   InQueryIT.testFullyQualifiedRVCInList[InQueryIT_4] » IllegalArgument
[ERROR]   InQueryIT.testFullyQualifiedRVCInList[InQueryIT_5] » IllegalArgument
[ERROR]   InQueryIT.testFullyQualifiedRVCInList[InQueryIT_6] » IllegalArgument
[ERROR]   InQueryIT.testInListSkipScan[InQueryIT_0] » IllegalArgument wrong number of ar...
[ERROR]   InQueryIT.testInListSkipScan[InQueryIT_1] » IllegalArgument wrong number of ar...
[ERROR]   InQueryIT.testInListSkipScan[InQueryIT_2] » IllegalArgument
[ERROR]   InQueryIT.testInListSkipScan[InQueryIT_3] » IllegalArgument
[ERROR]   InQueryIT.testInListSkipScan[InQueryIT_4] » IllegalArgument
[ERROR]   InQueryIT.testInListSkipScan[InQueryIT_5] » IllegalArgument
[ERROR]   InQueryIT.testInListSkipScan[InQueryIT_6] » IllegalArgument
[ERROR]   InQueryIT.testMixedTypeInListStatement[InQueryIT_0] » IllegalArgument wrong nu...
[ERROR]   InQueryIT.testMixedTypeInListStatement[InQueryIT_1] » IllegalArgument wrong nu...
[ERROR]   InQueryIT.testMixedTypeInListStatement[InQueryIT_2] » IllegalArgument
[ERROR]   InQueryIT.testMixedTypeInListStatement[InQueryIT_3] » IllegalArgument
[ERROR]   InQueryIT.testMixedTypeInListStatement[InQueryIT_4] » IllegalArgument
[ERROR]   InQueryIT.testMixedTypeInListStatement[InQueryIT_5] » IllegalArgument
[ERROR]   InQueryIT.testMixedTypeInListStatement[InQueryIT_6] » IllegalArgument
[ERROR]   InQueryIT.testOneInListStatement[InQueryIT_0] » IllegalArgument wrong number o...
[ERROR]   InQueryIT.testOneInListStatement[InQueryIT_1] » IllegalArgument wrong number o...
[ERROR]   InQueryIT.testOneInListStatement[InQueryIT_2] » IllegalArgument
[ERROR]   InQueryIT.testOneInListStatement[InQueryIT_3] » IllegalArgument
[ERROR]   InQueryIT.testOneInListStatement[InQueryIT_4] » IllegalArgument
[ERROR]   InQueryIT.testOneInListStatement[InQueryIT_5] » IllegalArgument
[ERROR]   InQueryIT.testOneInListStatement[InQueryIT_6] » IllegalArgument
[ERROR]   InQueryIT.testPartiallyQualifiedRVCInList[InQueryIT_0] » IllegalArgument wrong...
[ERROR]   InQueryIT.testPartiallyQualifiedRVCInList[InQueryIT_1] » IllegalArgument wrong...
[ERROR]   InQueryIT.testPartiallyQualifiedRVCInList[InQueryIT_2] » IllegalArgument
[ERROR]   InQueryIT.testPartiallyQualifiedRVCInList[InQueryIT_3] » IllegalArgument
[ERROR]   InQueryIT.testPartiallyQualifiedRVCInList[InQueryIT_4] » IllegalArgument
[ERROR]   InQueryIT.testPartiallyQualifiedRVCInList[InQueryIT_5] » IllegalArgument
[ERROR]   InQueryIT.testPartiallyQualifiedRVCInList[InQueryIT_6] » IllegalArgument
[ERROR]   InQueryIT.testRowKeyMultiIn[InQueryIT_0] » IllegalArgument wrong number of arg...
[ERROR]   InQueryIT.testRowKeyMultiIn[InQueryIT_1] » IllegalArgument wrong number of arg...
[ERROR]   InQueryIT.testRowKeyMultiIn[InQueryIT_2] » IllegalArgument
[ERROR]   InQueryIT.testRowKeyMultiIn[InQueryIT_3] » IllegalArgument
[ERROR]   InQueryIT.testRowKeyMultiIn[InQueryIT_4] » IllegalArgument
[ERROR]   InQueryIT.testRowKeyMultiIn[InQueryIT_5] » IllegalArgument
[ERROR]   InQueryIT.testRowKeyMultiIn[InQueryIT_6] » IllegalArgument
[ERROR]   InQueryIT.testRowKeySingleIn[InQueryIT_0] » IllegalArgument wrong number of ar...
[ERROR]   InQueryIT.testRowKeySingleIn[InQueryIT_1] » IllegalArgument
[ERROR]   InQueryIT.testRowKeySingleIn[InQueryIT_2] » IllegalArgument
[ERROR]   InQueryIT.testRowKeySingleIn[InQueryIT_3] » IllegalArgument
[ERROR]   InQueryIT.testRowKeySingleIn[InQueryIT_4] » IllegalArgument
[ERROR]   InQueryIT.testRowKeySingleIn[InQueryIT_5] » IllegalArgument
[ERROR]   InQueryIT.testRowKeySingleIn[InQueryIT_6] » IllegalArgument
[ERROR]   InQueryIT.testSimpleInListStatement[InQueryIT_0] » IllegalArgument wrong numbe...
[ERROR]   InQueryIT.testSimpleInListStatement[InQueryIT_1] » IllegalArgument
[ERROR]   InQueryIT.testSimpleInListStatement[InQueryIT_2] » IllegalArgument
[ERROR]   InQueryIT.testSimpleInListStatement[InQueryIT_3] » IllegalArgument
[ERROR]   InQueryIT.testSimpleInListStatement[InQueryIT_4] » IllegalArgument
[ERROR]   InQueryIT.testSimpleInListStatement[InQueryIT_5] » IllegalArgument
[ERROR]   InQueryIT.testSimpleInListStatement[InQueryIT_6] » IllegalArgument
[INFO] 
[ERROR] Tests run: 3341, Failures: 21, Errors: 63, Skipped: 5
[INFO] 
[INFO] 
[INFO] --- maven-failsafe-plugin:2.20:integration-test (HBaseManagedTimeTests) @ phoenix-core
---
[INFO] 
[INFO] -------------------------------------------------------
[INFO]  T E S T S
[INFO] -------------------------------------------------------
[INFO] 
[INFO] Results:
[INFO] 
[INFO] Tests run: 0, Failures: 0, Errors: 0, Skipped: 0
[INFO] 
[INFO] 
[INFO] --- maven-failsafe-plugin:2.20:integration-test (NeedTheirOwnClusterTests) @ phoenix-core
---
[INFO] 
[INFO] -------------------------------------------------------
[INFO]  T E S T S
[INFO] -------------------------------------------------------
[INFO] Running org.apache.hadoop.hbase.regionserver.wal.WALReplayWithIndexWritesAndCompressedWALIT
[INFO] Running org.apache.phoenix.end2end.ConnectionUtilIT
[INFO] Running org.apache.hadoop.hbase.regionserver.wal.WALRecoveryRegionPostOpenIT
[INFO] Tests run: 1, Failures: 0, Errors: 0, Skipped: 0, Time elapsed: 55.394 s - in org.apache.hadoop.hbase.regionserver.wal.WALReplayWithIndexWritesAndCompressedWALIT
[INFO] Tests run: 1, Failures: 0, Errors: 0, Skipped: 0, Time elapsed: 6.652 s - in org.apache.hadoop.hbase.regionserver.wal.WALRecoveryRegionPostOpenIT
[INFO] Running org.apache.phoenix.end2end.ColumnEncodedMutableNonTxStatsCollectorIT
[INFO] Running org.apache.phoenix.end2end.ColumnEncodedImmutableTxStatsCollectorIT
[INFO] Running org.apache.phoenix.end2end.ColumnEncodedImmutableNonTxStatsCollectorIT
[INFO] Running org.apache.phoenix.end2end.ColumnEncodedMutableTxStatsCollectorIT
[INFO] Running org.apache.phoenix.end2end.ContextClassloaderIT
[INFO] Tests run: 1, Failures: 0, Errors: 0, Skipped: 0, Time elapsed: 27.24 s - in org.apache.phoenix.end2end.ConnectionUtilIT
[INFO] Tests run: 3, Failures: 0, Errors: 0, Skipped: 0, Time elapsed: 3.046 s - in org.apache.phoenix.end2end.ContextClassloaderIT
[INFO] Running org.apache.phoenix.end2end.CountDistinctCompressionIT
[INFO] Tests run: 1, Failures: 0, Errors: 0, Skipped: 0, Time elapsed: 5.342 s - in org.apache.phoenix.end2end.CountDistinctCompressionIT
[INFO] Running org.apache.phoenix.end2end.CsvBulkLoadToolIT
[INFO] Running org.apache.phoenix.end2end.DropSchemaIT
[WARNING] Tests run: 24, Failures: 0, Errors: 0, Skipped: 4, Time elapsed: 76.904 s - in org.apache.phoenix.end2end.ColumnEncodedMutableNonTxStatsCollectorIT
[WARNING] Tests run: 24, Failures: 0, Errors: 0, Skipped: 4, Time elapsed: 81.723 s - in org.apache.phoenix.end2end.ColumnEncodedImmutableNonTxStatsCollectorIT
[INFO] Tests run: 2, Failures: 0, Errors: 0, Skipped: 0, Time elapsed: 19.62 s - in org.apache.phoenix.end2end.DropSchemaIT
[INFO] Running org.apache.phoenix.end2end.FlappingLocalIndexIT
[WARNING] Tests run: 24, Failures: 0, Errors: 0, Skipped: 4, Time elapsed: 98.381 s - in org.apache.phoenix.end2end.ColumnEncodedImmutableTxStatsCollectorIT
[WARNING] Tests run: 24, Failures: 0, Errors: 0, Skipped: 4, Time elapsed: 100.689 s - in
org.apache.phoenix.end2end.ColumnEncodedMutableTxStatsCollectorIT
[INFO] Running org.apache.phoenix.end2end.IndexExtendedIT
[INFO] Running org.apache.phoenix.end2end.IndexScrutinyToolIT
[INFO] Running org.apache.phoenix.end2end.IndexToolForPartialBuildIT
[INFO] Tests run: 12, Failures: 0, Errors: 0, Skipped: 0, Time elapsed: 95.957 s - in org.apache.phoenix.end2end.CsvBulkLoadToolIT
[INFO] Running org.apache.phoenix.end2end.IndexToolForPartialBuildWithNamespaceEnabledIT
[INFO] Tests run: 1, Failures: 0, Errors: 0, Skipped: 0, Time elapsed: 17.769 s - in org.apache.phoenix.end2end.IndexToolForPartialBuildIT
[INFO] Running org.apache.phoenix.end2end.NonColumnEncodedImmutableNonTxStatsCollectorIT
[INFO] Running org.apache.phoenix.end2end.NonColumnEncodedImmutableTxStatsCollectorIT
[INFO] Tests run: 2, Failures: 0, Errors: 0, Skipped: 0, Time elapsed: 27.619 s - in org.apache.phoenix.end2end.IndexToolForPartialBuildWithNamespaceEnabledIT
[INFO] Running org.apache.phoenix.end2end.QueryWithLimitIT
[INFO] Running org.apache.phoenix.end2end.QueryTimeoutIT
[INFO] Tests run: 2, Failures: 0, Errors: 0, Skipped: 0, Time elapsed: 5.757 s - in org.apache.phoenix.end2end.QueryWithLimitIT
[INFO] Tests run: 10, Failures: 0, Errors: 0, Skipped: 0, Time elapsed: 111.347 s - in org.apache.phoenix.end2end.IndexScrutinyToolIT
[INFO] Running org.apache.phoenix.end2end.RebuildIndexConnectionPropsIT
[INFO] Tests run: 1, Failures: 0, Errors: 0, Skipped: 0, Time elapsed: 1.449 s - in org.apache.phoenix.end2end.RebuildIndexConnectionPropsIT
[WARNING] Tests run: 24, Failures: 0, Errors: 0, Skipped: 4, Time elapsed: 77.015 s - in org.apache.phoenix.end2end.NonColumnEncodedImmutableNonTxStatsCollectorIT
[INFO] Tests run: 12, Failures: 0, Errors: 0, Skipped: 0, Time elapsed: 156.683 s - in org.apache.phoenix.end2end.FlappingLocalIndexIT
[WARNING] Tests run: 24, Failures: 0, Errors: 0, Skipped: 4, Time elapsed: 97.263 s - in org.apache.phoenix.end2end.NonColumnEncodedImmutableTxStatsCollectorIT
[INFO] Tests run: 2, Failures: 0, Errors: 0, Skipped: 0, Time elapsed: 46.331 s - in org.apache.phoenix.end2end.QueryTimeoutIT
[INFO] Running org.apache.phoenix.end2end.SystemTablePermissionsIT
[INFO] Running org.apache.phoenix.end2end.RegexBulkLoadToolIT
[INFO] Running org.apache.phoenix.end2end.RenewLeaseIT
[INFO] Running org.apache.phoenix.end2end.SpillableGroupByIT
[INFO] Running org.apache.phoenix.end2end.TableSnapshotReadsMapReduceIT
[INFO] Running org.apache.phoenix.end2end.SysTableNamespaceMappedStatsCollectorIT
[INFO] Tests run: 2, Failures: 0, Errors: 0, Skipped: 0, Time elapsed: 12.7 s - in org.apache.phoenix.end2end.SpillableGroupByIT
[INFO] Tests run: 1, Failures: 0, Errors: 0, Skipped: 0, Time elapsed: 26.66 s - in org.apache.phoenix.end2end.RenewLeaseIT
[INFO] Tests run: 3, Failures: 0, Errors: 0, Skipped: 0, Time elapsed: 19.548 s - in org.apache.phoenix.end2end.TableSnapshotReadsMapReduceIT
[INFO] Running org.apache.phoenix.end2end.UpdateCacheAcrossDifferentClientsIT
[INFO] Tests run: 10, Failures: 0, Errors: 0, Skipped: 0, Time elapsed: 76.56 s - in org.apache.phoenix.end2end.RegexBulkLoadToolIT
[INFO] Tests run: 2, Failures: 0, Errors: 0, Skipped: 0, Time elapsed: 95.687 s - in org.apache.phoenix.end2end.SystemTablePermissionsIT
[INFO] Tests run: 6, Failures: 0, Errors: 0, Skipped: 0, Time elapsed: 33.624 s - in org.apache.phoenix.end2end.UpdateCacheAcrossDifferentClientsIT
[INFO] Running org.apache.phoenix.end2end.UserDefinedFunctionsIT
[WARNING] Tests run: 24, Failures: 0, Errors: 0, Skipped: 4, Time elapsed: 78.014 s - in org.apache.phoenix.end2end.SysTableNamespaceMappedStatsCollectorIT
[INFO] Running org.apache.phoenix.end2end.index.ImmutableIndexIT
[INFO] Running org.apache.phoenix.end2end.index.LocalIndexIT
[INFO] Running org.apache.phoenix.end2end.index.MutableIndexFailureIT
[INFO] Running org.apache.phoenix.end2end.index.MutableIndexReplicationIT
[INFO] Running org.apache.phoenix.end2end.index.PartialIndexRebuilderIT
[INFO] Tests run: 14, Failures: 0, Errors: 0, Skipped: 0, Time elapsed: 56.237 s - in org.apache.phoenix.end2end.UserDefinedFunctionsIT
[INFO] Tests run: 1, Failures: 0, Errors: 0, Skipped: 0, Time elapsed: 25.865 s - in org.apache.phoenix.end2end.index.MutableIndexReplicationIT
[INFO] Running org.apache.phoenix.end2end.index.txn.TxWriteFailureIT
[INFO] Tests run: 8, Failures: 0, Errors: 0, Skipped: 0, Time elapsed: 55.729 s - in org.apache.phoenix.end2end.index.txn.TxWriteFailureIT
[WARNING] Tests run: 24, Failures: 0, Errors: 0, Skipped: 16, Time elapsed: 116.218 s - in
org.apache.phoenix.end2end.index.ImmutableIndexIT
[INFO] Running org.apache.phoenix.execute.UpsertSelectOverlappingBatchesIT
[INFO] Running org.apache.phoenix.hbase.index.FailForUnsupportedHBaseVersionsIT
[INFO] Running org.apache.phoenix.execute.PartialCommitIT
[INFO] Tests run: 12, Failures: 0, Errors: 0, Skipped: 0, Time elapsed: 2.18 s - in org.apache.phoenix.execute.PartialCommitIT
[INFO] Tests run: 2, Failures: 0, Errors: 0, Skipped: 0, Time elapsed: 43.418 s - in org.apache.phoenix.hbase.index.FailForUnsupportedHBaseVersionsIT
[INFO] Running org.apache.phoenix.iterate.RoundRobinResultIteratorWithStatsIT
[INFO] Tests run: 3, Failures: 0, Errors: 0, Skipped: 0, Time elapsed: 74.114 s - in org.apache.phoenix.execute.UpsertSelectOverlappingBatchesIT
[INFO] Running org.apache.phoenix.iterate.ScannerLeaseRenewalIT
[INFO] Running org.apache.phoenix.monitoring.PhoenixMetricsIT
[INFO] Tests run: 1, Failures: 0, Errors: 0, Skipped: 0, Time elapsed: 31.85 s - in org.apache.phoenix.iterate.RoundRobinResultIteratorWithStatsIT
[INFO] Running org.apache.phoenix.rpc.PhoenixClientRpcIT
[INFO] Tests run: 2, Failures: 0, Errors: 0, Skipped: 0, Time elapsed: 7.717 s - in org.apache.phoenix.rpc.PhoenixClientRpcIT
[INFO] Running org.apache.phoenix.rpc.PhoenixServerRpcIT
[INFO] Tests run: 2, Failures: 0, Errors: 0, Skipped: 0, Time elapsed: 19.083 s - in org.apache.phoenix.rpc.PhoenixServerRpcIT
[INFO] Tests run: 22, Failures: 0, Errors: 0, Skipped: 0, Time elapsed: 86.123 s - in org.apache.phoenix.monitoring.PhoenixMetricsIT
[INFO] Tests run: 2, Failures: 0, Errors: 0, Skipped: 0, Time elapsed: 163.656 s - in org.apache.phoenix.iterate.ScannerLeaseRenewalIT
[INFO] Tests run: 34, Failures: 0, Errors: 0, Skipped: 0, Time elapsed: 364.878 s - in org.apache.phoenix.end2end.index.LocalIndexIT
[INFO] Tests run: 21, Failures: 0, Errors: 0, Skipped: 0, Time elapsed: 364.947 s - in org.apache.phoenix.end2end.index.MutableIndexFailureIT
[WARNING] Tests run: 24, Failures: 0, Errors: 0, Skipped: 2, Time elapsed: 358.628 s - in
org.apache.phoenix.end2end.index.PartialIndexRebuilderIT
[INFO] Tests run: 140, Failures: 0, Errors: 0, Skipped: 0, Time elapsed: 846.776 s - in org.apache.phoenix.end2end.IndexExtendedIT
[INFO] 
[INFO] Results:
[INFO] 
[WARNING] Tests run: 555, Failures: 0, Errors: 0, Skipped: 46
[INFO] 
[INFO] 
[INFO] --- maven-failsafe-plugin:2.20:verify (ParallelStatsEnabledTest) @ phoenix-core ---
[INFO] ------------------------------------------------------------------------
[INFO] Reactor Summary:
[INFO] 
[INFO] Apache Phoenix ..................................... SUCCESS [  4.329 s]
[INFO] Phoenix Core ....................................... FAILURE [  01:16 h]
[INFO] Phoenix - Flume .................................... SKIPPED
[INFO] Phoenix - Kafka .................................... SKIPPED
[INFO] Phoenix - Pig ...................................... SKIPPED
[INFO] Phoenix Query Server Client ........................ SKIPPED
[INFO] Phoenix Query Server ............................... SKIPPED
[INFO] Phoenix - Pherf .................................... SKIPPED
[INFO] Phoenix - Spark .................................... SKIPPED
[INFO] Phoenix - Hive ..................................... SKIPPED
[INFO] Phoenix Client ..................................... SKIPPED
[INFO] Phoenix Server ..................................... SKIPPED
[INFO] Phoenix Assembly ................................... SKIPPED
[INFO] Phoenix - Tracing Web Application .................. SKIPPED
[INFO] Phoenix Load Balancer .............................. SKIPPED
[INFO] ------------------------------------------------------------------------
[INFO] BUILD FAILURE
[INFO] ------------------------------------------------------------------------
[INFO] Total time: 01:16 h
[INFO] Finished at: 2017-09-29T21:47:09Z
[INFO] Final Memory: 60M/1023M
[INFO] ------------------------------------------------------------------------
[ERROR] Failed to execute goal org.apache.maven.plugins:maven-failsafe-plugin:2.20:verify
(ParallelStatsEnabledTest) on project phoenix-core: There are test failures.
[ERROR] 
[ERROR] Please refer to <https://builds.apache.org/job/Phoenix-master/ws/phoenix-core/target/failsafe-reports>
for the individual test results.
[ERROR] Please refer to dump files (if any exist) [date]-jvmRun[N].dump, [date].dumpstream
and [date]-jvmRun[N].dumpstream.
[ERROR] -> [Help 1]
[ERROR] 
[ERROR] To see the full stack trace of the errors, re-run Maven with the -e switch.
[ERROR] Re-run Maven using the -X switch to enable full debug logging.
[ERROR] 
[ERROR] For more information about the errors and possible solutions, please read the following
articles:
[ERROR] [Help 1] http://cwiki.apache.org/confluence/display/MAVEN/MojoFailureException
[ERROR] 
[ERROR] After correcting the problems, you can resume the build with the command
[ERROR]   mvn <goals> -rf :phoenix-core
Build step 'Invoke top-level Maven targets' marked build as failure
Archiving artifacts
[Fast Archiver] Compressed 3.20 GB of artifacts by 58.4% relative to #1807
[JIRA] Updating issue PHOENIX-4258
[JIRA] Updating issue PHOENIX-4214
[JIRA] Updating issue PHOENIX-4239
[JIRA] Updating issue PHOENIX-4260
Recording test results

Mime
View raw message