phoenix-commits mailing list archives

Site index · List index
Message view « Date » · « Thread »
Top « Date » · « Thread »
From Apache Jenkins Server <jenk...@builds.apache.org>
Subject Build failed in Jenkins: Phoenix-4.x-HBase-1.1 #597
Date Wed, 27 Sep 2017 21:35:09 GMT
See <https://builds.apache.org/job/Phoenix-4.x-HBase-1.1/597/display/redirect?page=changes>

Changes:

[ssa] PHOENIX-4225 Using Google cache may lead to lock up on RS side.

------------------------------------------
[...truncated 110.43 KB...]
java.lang.AssertionError: The following tables are not deleted that should be: TESTAUTOMATICALLYSETTINGROWTIMESTAMP

[ERROR] testUpsertValuesWithDescDecimal(org.apache.phoenix.end2end.UpsertValuesIT)  Time elapsed:
4.666 s  <<< FAILURE!
java.lang.AssertionError: The following tables are not deleted that should be: TESTAUTOMATICALLYSETTINGROWTIMESTAMP

[ERROR] testUpsertIntoFloat(org.apache.phoenix.end2end.UpsertValuesIT)  Time elapsed: 4.6
s  <<< FAILURE!
java.lang.AssertionError: The following tables are not deleted that should be: TESTAUTOMATICALLYSETTINGROWTIMESTAMP

[ERROR] testUpsertValuesWithExpression(org.apache.phoenix.end2end.UpsertValuesIT)  Time elapsed:
4.746 s  <<< FAILURE!
java.lang.AssertionError: The following tables are not deleted that should be: TESTAUTOMATICALLYSETTINGROWTIMESTAMP

[ERROR] testAutomaticallySettingRowTimestampForImmutableTableAndIndexes_desc(org.apache.phoenix.end2end.UpsertValuesIT)
 Time elapsed: 8.972 s  <<< FAILURE!
java.lang.AssertionError: The following tables are not deleted that should be: TESTAUTOMATICALLYSETTINGROWTIMESTAMP
TESTSETTINGROWTIMESTAMPFORIMMUTABLETABLEANDINDEXES

[ERROR] testGroupByWithLimitOverRowKey(org.apache.phoenix.end2end.UpsertValuesIT)  Time elapsed:
2.671 s  <<< FAILURE!
java.lang.AssertionError: The following tables are not deleted that should be: TESTAUTOMATICALLYSETTINGROWTIMESTAMP
TESTSETTINGROWTIMESTAMPFORIMMUTABLETABLEANDINDEXES

[ERROR] testWithUpsertingRowTimestampColSpecified_asc(org.apache.phoenix.end2end.UpsertValuesIT)
 Time elapsed: 9.031 s  <<< FAILURE!
java.lang.AssertionError: The following tables are not deleted that should be: TESTAUTOMATICALLYSETTINGROWTIMESTAMP
TESTSETTINGROWTIMESTAMPFORIMMUTABLETABLEANDINDEXES TESTUPSERTINGROWTIMESTAMPCOL

[ERROR] testBatchedUpsert(org.apache.phoenix.end2end.UpsertValuesIT)  Time elapsed: 4.532
s  <<< FAILURE!
java.lang.AssertionError: The following tables are not deleted that should be: TESTAUTOMATICALLYSETTINGROWTIMESTAMP
TESTSETTINGROWTIMESTAMPFORIMMUTABLETABLEANDINDEXES TESTUPSERTINGROWTIMESTAMPCOL

[ERROR] testUpsertRandomValues(org.apache.phoenix.end2end.UpsertValuesIT)  Time elapsed: 4.578
s  <<< FAILURE!
java.lang.AssertionError: The following tables are not deleted that should be: TESTAUTOMATICALLYSETTINGROWTIMESTAMP
TESTSETTINGROWTIMESTAMPFORIMMUTABLETABLEANDINDEXES TESTUPSERTINGROWTIMESTAMPCOL

[ERROR] testUpsertValuesWithMoreValuesThanNumColsInTable(org.apache.phoenix.end2end.UpsertValuesIT)
 Time elapsed: 0.231 s  <<< FAILURE!
java.lang.AssertionError: The following tables are not deleted that should be: TESTAUTOMATICALLYSETTINGROWTIMESTAMP
TESTSETTINGROWTIMESTAMPFORIMMUTABLETABLEANDINDEXES TESTUPSERTINGROWTIMESTAMPCOL

[ERROR] testUpsertValuesWithDate(org.apache.phoenix.end2end.UpsertValuesIT)  Time elapsed:
4.573 s  <<< FAILURE!
java.lang.AssertionError: The following tables are not deleted that should be: TESTAUTOMATICALLYSETTINGROWTIMESTAMP
TESTSETTINGROWTIMESTAMPFORIMMUTABLETABLEANDINDEXES TESTUPSERTINGROWTIMESTAMPCOL

[ERROR] testDisallowNegativeValuesForRowTsColumn(org.apache.phoenix.end2end.UpsertValuesIT)
 Time elapsed: 2.652 s  <<< FAILURE!
java.lang.AssertionError: The following tables are not deleted that should be: TESTAUTOMATICALLYSETTINGROWTIMESTAMP
TESTSETTINGROWTIMESTAMPFORIMMUTABLETABLEANDINDEXES TESTUPSERTINGROWTIMESTAMPCOL

[ERROR] testUpsertVarCharWithMaxLength(org.apache.phoenix.end2end.UpsertValuesIT)  Time elapsed:
4.672 s  <<< FAILURE!
java.lang.AssertionError: The following tables are not deleted that should be: TESTAUTOMATICALLYSETTINGROWTIMESTAMP
TESTSETTINGROWTIMESTAMPFORIMMUTABLETABLEANDINDEXES TESTUPSERTINGROWTIMESTAMPCOL

[ERROR] testUpsertDateString(org.apache.phoenix.end2end.UpsertValuesIT)  Time elapsed: 4.714
s  <<< FAILURE!
java.lang.AssertionError: The following tables are not deleted that should be: TESTAUTOMATICALLYSETTINGROWTIMESTAMP
TESTSETTINGROWTIMESTAMPFORIMMUTABLETABLEANDINDEXES TESTUPSERTINGROWTIMESTAMPCOL

[ERROR] testUpsertDateValues(org.apache.phoenix.end2end.UpsertValuesIT)  Time elapsed: 0.27
s  <<< FAILURE!
java.lang.AssertionError: The following tables are not deleted that should be: TESTAUTOMATICALLYSETTINGROWTIMESTAMP
TESTSETTINGROWTIMESTAMPFORIMMUTABLETABLEANDINDEXES TESTUPSERTINGROWTIMESTAMPCOL

[ERROR] testAutomaticallySettingRowTimestampForImmutableTableAndIndexes_asc(org.apache.phoenix.end2end.UpsertValuesIT)
 Time elapsed: 0.101 s  <<< ERROR!
java.sql.SQLException: ERROR 1010 (42M01): Not allowed to mutate table. tableName=TESTSETTINGROWTIMESTAMPFORIMMUTABLETABLEANDINDEXES
	at org.apache.phoenix.end2end.UpsertValuesIT.testAutomaticallySettingRowTimestampForImmutableTableAndIndexes(UpsertValuesIT.java:830)
	at org.apache.phoenix.end2end.UpsertValuesIT.testAutomaticallySettingRowTimestampForImmutableTableAndIndexes_asc(UpsertValuesIT.java:822)

[ERROR] testAutomaticallySettingRowTimestampForImmutableTableAndIndexes_asc(org.apache.phoenix.end2end.UpsertValuesIT)
 Time elapsed: 0.102 s  <<< FAILURE!
java.lang.AssertionError: The following tables are not deleted that should be: TESTAUTOMATICALLYSETTINGROWTIMESTAMP
TESTSETTINGROWTIMESTAMPFORIMMUTABLETABLEANDINDEXES TESTUPSERTINGROWTIMESTAMPCOL

[ERROR] testTimestampAddSubtractArithmetic(org.apache.phoenix.end2end.UpsertValuesIT)  Time
elapsed: 0.276 s  <<< FAILURE!
java.lang.AssertionError: The following tables are not deleted that should be: TESTAUTOMATICALLYSETTINGROWTIMESTAMP
TESTSETTINGROWTIMESTAMPFORIMMUTABLETABLEANDINDEXES TESTUPSERTINGROWTIMESTAMPCOL

[ERROR] testWithUpsertingRowTimestampColSpecified_desc(org.apache.phoenix.end2end.UpsertValuesIT)
 Time elapsed: 0.078 s  <<< ERROR!
java.sql.SQLException: ERROR 1010 (42M01): Not allowed to mutate table. tableName=TESTUPSERTINGROWTIMESTAMPCOL
	at org.apache.phoenix.end2end.UpsertValuesIT.testWithUpsertingRowTimestampColSpecified(UpsertValuesIT.java:696)
	at org.apache.phoenix.end2end.UpsertValuesIT.testWithUpsertingRowTimestampColSpecified_desc(UpsertValuesIT.java:682)

[ERROR] testWithUpsertingRowTimestampColSpecified_desc(org.apache.phoenix.end2end.UpsertValuesIT)
 Time elapsed: 0.078 s  <<< FAILURE!
java.lang.AssertionError: The following tables are not deleted that should be: TESTAUTOMATICALLYSETTINGROWTIMESTAMP
TESTSETTINGROWTIMESTAMPFORIMMUTABLETABLEANDINDEXES TESTUPSERTINGROWTIMESTAMPCOL

[INFO] 
[INFO] Results:
[INFO] 
[ERROR] Failures: 
[ERROR]   UpsertValuesIT>BaseClientManagedTimeIT.cleanUpAfterTest:59->BaseTest.deletePriorMetaData:840->BaseTest.deletePriorTables:848->BaseTest.deletePriorTables:869
The following tables are not deleted that should be: TESTAUTOMATICALLYSETTINGROWTIMESTAMP
TESTSETTINGROWTIMESTAMPFORIMMUTABLETABLEANDINDEXES
[ERROR]   UpsertValuesIT>BaseClientManagedTimeIT.cleanUpAfterTest:59->BaseTest.deletePriorMetaData:840->BaseTest.deletePriorTables:848->BaseTest.deletePriorTables:869
The following tables are not deleted that should be: TESTAUTOMATICALLYSETTINGROWTIMESTAMP
[ERROR]   UpsertValuesIT>BaseClientManagedTimeIT.cleanUpAfterTest:59->BaseTest.deletePriorMetaData:840->BaseTest.deletePriorTables:848->BaseTest.deletePriorTables:869
The following tables are not deleted that should be: TESTAUTOMATICALLYSETTINGROWTIMESTAMP
TESTSETTINGROWTIMESTAMPFORIMMUTABLETABLEANDINDEXES TESTUPSERTINGROWTIMESTAMPCOL
[ERROR]   UpsertValuesIT>BaseClientManagedTimeIT.cleanUpAfterTest:59->BaseTest.deletePriorMetaData:840->BaseTest.deletePriorTables:848->BaseTest.deletePriorTables:869
The following tables are not deleted that should be: TESTAUTOMATICALLYSETTINGROWTIMESTAMP
[ERROR]   UpsertValuesIT>BaseClientManagedTimeIT.cleanUpAfterTest:59->BaseTest.deletePriorMetaData:840->BaseTest.deletePriorTables:848->BaseTest.deletePriorTables:869
The following tables are not deleted that should be: TESTAUTOMATICALLYSETTINGROWTIMESTAMP
TESTSETTINGROWTIMESTAMPFORIMMUTABLETABLEANDINDEXES TESTUPSERTINGROWTIMESTAMPCOL
[ERROR]   UpsertValuesIT>BaseClientManagedTimeIT.cleanUpAfterTest:59->BaseTest.deletePriorMetaData:840->BaseTest.deletePriorTables:848->BaseTest.deletePriorTables:869
The following tables are not deleted that should be: TESTAUTOMATICALLYSETTINGROWTIMESTAMP
TESTSETTINGROWTIMESTAMPFORIMMUTABLETABLEANDINDEXES
[ERROR]   UpsertValuesIT>BaseClientManagedTimeIT.cleanUpAfterTest:59->BaseTest.deletePriorMetaData:840->BaseTest.deletePriorTables:848->BaseTest.deletePriorTables:869
The following tables are not deleted that should be: TESTAUTOMATICALLYSETTINGROWTIMESTAMP
TESTSETTINGROWTIMESTAMPFORIMMUTABLETABLEANDINDEXES TESTUPSERTINGROWTIMESTAMPCOL
[ERROR]   UpsertValuesIT>BaseClientManagedTimeIT.cleanUpAfterTest:59->BaseTest.deletePriorMetaData:840->BaseTest.deletePriorTables:848->BaseTest.deletePriorTables:869
The following tables are not deleted that should be: TESTAUTOMATICALLYSETTINGROWTIMESTAMP
[ERROR]   UpsertValuesIT>BaseClientManagedTimeIT.cleanUpAfterTest:59->BaseTest.deletePriorMetaData:840->BaseTest.deletePriorTables:848->BaseTest.deletePriorTables:869
The following tables are not deleted that should be: TESTAUTOMATICALLYSETTINGROWTIMESTAMP
TESTSETTINGROWTIMESTAMPFORIMMUTABLETABLEANDINDEXES TESTUPSERTINGROWTIMESTAMPCOL
[ERROR]   UpsertValuesIT>BaseClientManagedTimeIT.cleanUpAfterTest:59->BaseTest.deletePriorMetaData:840->BaseTest.deletePriorTables:848->BaseTest.deletePriorTables:869
The following tables are not deleted that should be: TESTAUTOMATICALLYSETTINGROWTIMESTAMP
TESTSETTINGROWTIMESTAMPFORIMMUTABLETABLEANDINDEXES TESTUPSERTINGROWTIMESTAMPCOL
[ERROR]   UpsertValuesIT>BaseClientManagedTimeIT.cleanUpAfterTest:59->BaseTest.deletePriorMetaData:840->BaseTest.deletePriorTables:848->BaseTest.deletePriorTables:869
The following tables are not deleted that should be: TESTAUTOMATICALLYSETTINGROWTIMESTAMP
[ERROR]   UpsertValuesIT>BaseClientManagedTimeIT.cleanUpAfterTest:59->BaseTest.deletePriorMetaData:840->BaseTest.deletePriorTables:848->BaseTest.deletePriorTables:869
The following tables are not deleted that should be: TESTAUTOMATICALLYSETTINGROWTIMESTAMP
TESTSETTINGROWTIMESTAMPFORIMMUTABLETABLEANDINDEXES TESTUPSERTINGROWTIMESTAMPCOL
[ERROR]   UpsertValuesIT>BaseClientManagedTimeIT.cleanUpAfterTest:59->BaseTest.deletePriorMetaData:840->BaseTest.deletePriorTables:848->BaseTest.deletePriorTables:869
The following tables are not deleted that should be: TESTAUTOMATICALLYSETTINGROWTIMESTAMP
TESTSETTINGROWTIMESTAMPFORIMMUTABLETABLEANDINDEXES TESTUPSERTINGROWTIMESTAMPCOL
[ERROR]   UpsertValuesIT>BaseClientManagedTimeIT.cleanUpAfterTest:59->BaseTest.deletePriorMetaData:840->BaseTest.deletePriorTables:848->BaseTest.deletePriorTables:869
The following tables are not deleted that should be: TESTAUTOMATICALLYSETTINGROWTIMESTAMP
[ERROR]   UpsertValuesIT>BaseClientManagedTimeIT.cleanUpAfterTest:59->BaseTest.deletePriorMetaData:840->BaseTest.deletePriorTables:848->BaseTest.deletePriorTables:869
The following tables are not deleted that should be: TESTAUTOMATICALLYSETTINGROWTIMESTAMP
[ERROR]   UpsertValuesIT>BaseClientManagedTimeIT.cleanUpAfterTest:59->BaseTest.deletePriorMetaData:840->BaseTest.deletePriorTables:848->BaseTest.deletePriorTables:869
The following tables are not deleted that should be: TESTAUTOMATICALLYSETTINGROWTIMESTAMP
[ERROR]   UpsertValuesIT>BaseClientManagedTimeIT.cleanUpAfterTest:59->BaseTest.deletePriorMetaData:840->BaseTest.deletePriorTables:848->BaseTest.deletePriorTables:869
The following tables are not deleted that should be: TESTAUTOMATICALLYSETTINGROWTIMESTAMP
TESTSETTINGROWTIMESTAMPFORIMMUTABLETABLEANDINDEXES TESTUPSERTINGROWTIMESTAMPCOL
[ERROR]   UpsertValuesIT>BaseClientManagedTimeIT.cleanUpAfterTest:59->BaseTest.deletePriorMetaData:840->BaseTest.deletePriorTables:848->BaseTest.deletePriorTables:869
The following tables are not deleted that should be: TESTAUTOMATICALLYSETTINGROWTIMESTAMP
TESTSETTINGROWTIMESTAMPFORIMMUTABLETABLEANDINDEXES TESTUPSERTINGROWTIMESTAMPCOL
[ERROR]   UpsertValuesIT>BaseClientManagedTimeIT.cleanUpAfterTest:59->BaseTest.deletePriorMetaData:840->BaseTest.deletePriorTables:848->BaseTest.deletePriorTables:869
The following tables are not deleted that should be: TESTAUTOMATICALLYSETTINGROWTIMESTAMP
TESTSETTINGROWTIMESTAMPFORIMMUTABLETABLEANDINDEXES TESTUPSERTINGROWTIMESTAMPCOL
[ERROR] Errors: 
[ERROR] org.apache.phoenix.end2end.UpsertValuesIT.testAutomaticallySettingRowTimestampForImmutableTableAndIndexes_asc(org.apache.phoenix.end2end.UpsertValuesIT)
[ERROR]   Run 1: UpsertValuesIT.testAutomaticallySettingRowTimestampForImmutableTableAndIndexes_asc:822->testAutomaticallySettingRowTimestampForImmutableTableAndIndexes:830
» SQL
[ERROR]   Run 2: UpsertValuesIT>BaseClientManagedTimeIT.cleanUpAfterTest:59->BaseTest.deletePriorMetaData:840->BaseTest.deletePriorTables:848->BaseTest.deletePriorTables:869
The following tables are not deleted that should be: TESTAUTOMATICALLYSETTINGROWTIMESTAMP
TESTSETTINGROWTIMESTAMPFORIMMUTABLETABLEANDINDEXES TESTUPSERTINGROWTIMESTAMPCOL
[INFO] 
[ERROR] org.apache.phoenix.end2end.UpsertValuesIT.testAutomaticallySettingRowtimestamp_asc(org.apache.phoenix.end2end.UpsertValuesIT)
[ERROR]   Run 1: UpsertValuesIT.testAutomaticallySettingRowtimestamp_asc:763->testAutomaticallySettingRowtimestamp:771
» SQL
[ERROR]   Run 2: UpsertValuesIT>BaseClientManagedTimeIT.cleanUpAfterTest:59->BaseTest.deletePriorMetaData:840->BaseTest.deletePriorTables:848->BaseTest.deletePriorTables:869
The following tables are not deleted that should be: TESTAUTOMATICALLYSETTINGROWTIMESTAMP
[INFO] 
[ERROR] org.apache.phoenix.end2end.UpsertValuesIT.testWithUpsertingRowTimestampColSpecified_desc(org.apache.phoenix.end2end.UpsertValuesIT)
[ERROR]   Run 1: UpsertValuesIT.testWithUpsertingRowTimestampColSpecified_desc:682->testWithUpsertingRowTimestampColSpecified:696
» SQL
[ERROR]   Run 2: UpsertValuesIT>BaseClientManagedTimeIT.cleanUpAfterTest:59->BaseTest.deletePriorMetaData:840->BaseTest.deletePriorTables:848->BaseTest.deletePriorTables:869
The following tables are not deleted that should be: TESTAUTOMATICALLYSETTINGROWTIMESTAMP
TESTSETTINGROWTIMESTAMPFORIMMUTABLETABLEANDINDEXES TESTUPSERTINGROWTIMESTAMPCOL
[INFO] 
[INFO] 
[ERROR] Tests run: 25, Failures: 19, Errors: 3, Skipped: 0
[INFO] 
[INFO] 
[INFO] --- maven-failsafe-plugin:2.20:integration-test (HBaseManagedTimeTests) @ phoenix-core
---
[INFO] 
[INFO] -------------------------------------------------------
[INFO]  T E S T S
[INFO] -------------------------------------------------------
[INFO] 
[INFO] Results:
[INFO] 
[INFO] Tests run: 0, Failures: 0, Errors: 0, Skipped: 0
[INFO] 
[INFO] 
[INFO] --- maven-failsafe-plugin:2.20:integration-test (NeedTheirOwnClusterTests) @ phoenix-core
---
[INFO] 
[INFO] -------------------------------------------------------
[INFO]  T E S T S
[INFO] -------------------------------------------------------
[INFO] Running org.apache.hadoop.hbase.regionserver.wal.WALReplayWithIndexWritesAndCompressedWALIT
[INFO] Running org.apache.phoenix.end2end.ConnectionUtilIT
[INFO] Tests run: 1, Failures: 0, Errors: 0, Skipped: 0, Time elapsed: 35.544 s - in org.apache.hadoop.hbase.regionserver.wal.WALReplayWithIndexWritesAndCompressedWALIT
[INFO] Running org.apache.hadoop.hbase.regionserver.wal.WALRecoveryRegionPostOpenIT
[INFO] Running org.apache.phoenix.end2end.CountDistinctCompressionIT
[INFO] Tests run: 1, Failures: 0, Errors: 0, Skipped: 0, Time elapsed: 9.52 s - in org.apache.hadoop.hbase.regionserver.wal.WALRecoveryRegionPostOpenIT
[INFO] Running org.apache.phoenix.end2end.CsvBulkLoadToolIT
[INFO] Tests run: 1, Failures: 0, Errors: 0, Skipped: 0, Time elapsed: 4.606 s - in org.apache.phoenix.end2end.CountDistinctCompressionIT
[INFO] Running org.apache.phoenix.end2end.ContextClassloaderIT
[INFO] Tests run: 1, Failures: 0, Errors: 0, Skipped: 0, Time elapsed: 41.5 s - in org.apache.phoenix.end2end.ConnectionUtilIT
[INFO] Tests run: 3, Failures: 0, Errors: 0, Skipped: 0, Time elapsed: 2.728 s - in org.apache.phoenix.end2end.ContextClassloaderIT
[INFO] Running org.apache.phoenix.end2end.DropSchemaIT
[INFO] Tests run: 2, Failures: 0, Errors: 0, Skipped: 0, Time elapsed: 24.363 s - in org.apache.phoenix.end2end.DropSchemaIT
[INFO] Running org.apache.phoenix.end2end.FlappingLocalIndexIT
[INFO] Running org.apache.phoenix.end2end.IndexExtendedIT
[INFO] Running org.apache.phoenix.end2end.IndexScrutinyToolIT
[INFO] Running org.apache.phoenix.end2end.IndexToolForPartialBuildIT
[INFO] Tests run: 2, Failures: 0, Errors: 0, Skipped: 0, Time elapsed: 30.08 s - in org.apache.phoenix.end2end.IndexToolForPartialBuildIT
[INFO] Tests run: 12, Failures: 0, Errors: 0, Skipped: 0, Time elapsed: 115.938 s - in org.apache.phoenix.end2end.CsvBulkLoadToolIT
[INFO] Running org.apache.phoenix.end2end.IndexToolForPartialBuildWithNamespaceEnabledIT
[INFO] Tests run: 2, Failures: 0, Errors: 0, Skipped: 0, Time elapsed: 25.776 s - in org.apache.phoenix.end2end.IndexToolForPartialBuildWithNamespaceEnabledIT
[INFO] Running org.apache.phoenix.end2end.QueryTimeoutIT
[INFO] Running org.apache.phoenix.end2end.QueryWithLimitIT
[INFO] Tests run: 2, Failures: 0, Errors: 0, Skipped: 0, Time elapsed: 7.622 s - in org.apache.phoenix.end2end.QueryWithLimitIT
[INFO] Tests run: 10, Failures: 0, Errors: 0, Skipped: 0, Time elapsed: 120.833 s - in org.apache.phoenix.end2end.IndexScrutinyToolIT
[INFO] Tests run: 2, Failures: 0, Errors: 0, Skipped: 0, Time elapsed: 16.587 s - in org.apache.phoenix.end2end.QueryTimeoutIT
[INFO] Running org.apache.phoenix.end2end.RebuildIndexConnectionPropsIT
[INFO] Tests run: 1, Failures: 0, Errors: 0, Skipped: 0, Time elapsed: 0.692 s - in org.apache.phoenix.end2end.RebuildIndexConnectionPropsIT
[INFO] Running org.apache.phoenix.end2end.RegexBulkLoadToolIT
[INFO] Tests run: 12, Failures: 0, Errors: 0, Skipped: 0, Time elapsed: 181.268 s - in org.apache.phoenix.end2end.FlappingLocalIndexIT
[INFO] Running org.apache.phoenix.end2end.RenewLeaseIT
[INFO] Running org.apache.phoenix.end2end.SpillableGroupByIT
[INFO] Running org.apache.phoenix.end2end.StatsCollectorIT
[INFO] Tests run: 2, Failures: 0, Errors: 0, Skipped: 0, Time elapsed: 11.719 s - in org.apache.phoenix.end2end.SpillableGroupByIT
[INFO] Running org.apache.phoenix.end2end.SystemTablePermissionsIT
[INFO] Tests run: 1, Failures: 0, Errors: 0, Skipped: 0, Time elapsed: 28.854 s - in org.apache.phoenix.end2end.RenewLeaseIT
[INFO] Running org.apache.phoenix.end2end.SysTableNamespaceMappedStatsCollectorIT
[INFO] Running org.apache.phoenix.end2end.TableSnapshotReadsMapReduceIT
[INFO] Tests run: 10, Failures: 0, Errors: 0, Skipped: 0, Time elapsed: 91.962 s - in org.apache.phoenix.end2end.RegexBulkLoadToolIT
[INFO] Tests run: 3, Failures: 0, Errors: 0, Skipped: 0, Time elapsed: 22.498 s - in org.apache.phoenix.end2end.TableSnapshotReadsMapReduceIT
[INFO] Tests run: 2, Failures: 0, Errors: 0, Skipped: 0, Time elapsed: 122.825 s - in org.apache.phoenix.end2end.SystemTablePermissionsIT
[INFO] Running org.apache.phoenix.end2end.UpdateCacheAcrossDifferentClientsIT
[INFO] Running org.apache.phoenix.end2end.UserDefinedFunctionsIT
[INFO] Tests run: 6, Failures: 0, Errors: 0, Skipped: 0, Time elapsed: 53.809 s - in org.apache.phoenix.end2end.UpdateCacheAcrossDifferentClientsIT
[INFO] Running org.apache.phoenix.end2end.index.ImmutableIndexIT
[INFO] Tests run: 14, Failures: 0, Errors: 0, Skipped: 0, Time elapsed: 81.516 s - in org.apache.phoenix.end2end.UserDefinedFunctionsIT
[INFO] Running org.apache.phoenix.end2end.index.MutableIndexFailureIT
[WARNING] Tests run: 1, Failures: 0, Errors: 0, Skipped: 1, Time elapsed: 0.002 s - in org.apache.phoenix.end2end.index.MutableIndexFailureIT
[INFO] Running org.apache.phoenix.end2end.index.LocalIndexIT
[INFO] Running org.apache.phoenix.end2end.index.MutableIndexReplicationIT
[WARNING] Tests run: 24, Failures: 0, Errors: 0, Skipped: 16, Time elapsed: 129.025 s - in
org.apache.phoenix.end2end.index.ImmutableIndexIT
[INFO] Tests run: 1, Failures: 0, Errors: 0, Skipped: 0, Time elapsed: 38.577 s - in org.apache.phoenix.end2end.index.MutableIndexReplicationIT
[INFO] Running org.apache.phoenix.end2end.index.txn.TxWriteFailureIT
[INFO] Running org.apache.phoenix.end2end.index.PartialIndexRebuilderIT
[INFO] Tests run: 140, Failures: 0, Errors: 0, Skipped: 0, Time elapsed: 631.03 s - in org.apache.phoenix.end2end.IndexExtendedIT
[INFO] Tests run: 8, Failures: 0, Errors: 0, Skipped: 0, Time elapsed: 79.643 s - in org.apache.phoenix.end2end.index.txn.TxWriteFailureIT
[INFO] Running org.apache.phoenix.execute.UpsertSelectOverlappingBatchesIT
[INFO] Running org.apache.phoenix.execute.PartialCommitIT
[INFO] Tests run: 12, Failures: 0, Errors: 0, Skipped: 0, Time elapsed: 1.36 s - in org.apache.phoenix.execute.PartialCommitIT
[INFO] Running org.apache.phoenix.hbase.index.FailForUnsupportedHBaseVersionsIT
[INFO] Tests run: 1, Failures: 0, Errors: 0, Skipped: 0, Time elapsed: 23.937 s - in org.apache.phoenix.execute.UpsertSelectOverlappingBatchesIT
[INFO] Tests run: 2, Failures: 0, Errors: 0, Skipped: 0, Time elapsed: 21.376 s - in org.apache.phoenix.hbase.index.FailForUnsupportedHBaseVersionsIT
[INFO] Running org.apache.phoenix.hbase.index.covered.EndToEndCoveredColumnsIndexBuilderIT
[INFO] Running org.apache.phoenix.hbase.index.covered.FailWithoutRetriesIT
[INFO] Tests run: 1, Failures: 0, Errors: 0, Skipped: 0, Time elapsed: 4.504 s - in org.apache.phoenix.hbase.index.covered.FailWithoutRetriesIT
[INFO] Tests run: 2, Failures: 0, Errors: 0, Skipped: 0, Time elapsed: 22.237 s - in org.apache.phoenix.hbase.index.covered.EndToEndCoveredColumnsIndexBuilderIT
[INFO] Running org.apache.phoenix.iterate.RoundRobinResultIteratorWithStatsIT
[INFO] Tests run: 1, Failures: 0, Errors: 0, Skipped: 0, Time elapsed: 8.764 s - in org.apache.phoenix.iterate.RoundRobinResultIteratorWithStatsIT
[INFO] Running org.apache.phoenix.iterate.ScannerLeaseRenewalIT
[WARNING] Tests run: 144, Failures: 0, Errors: 0, Skipped: 24, Time elapsed: 675.811 s - in
org.apache.phoenix.end2end.StatsCollectorIT
[INFO] Tests run: 34, Failures: 0, Errors: 0, Skipped: 0, Time elapsed: 426.063 s - in org.apache.phoenix.end2end.index.LocalIndexIT
[INFO] Running org.apache.phoenix.monitoring.PhoenixMetricsIT
[WARNING] Tests run: 144, Failures: 0, Errors: 0, Skipped: 24, Time elapsed: 672.831 s - in
org.apache.phoenix.end2end.SysTableNamespaceMappedStatsCollectorIT
[INFO] Tests run: 24, Failures: 0, Errors: 0, Skipped: 0, Time elapsed: 348.851 s - in org.apache.phoenix.end2end.index.PartialIndexRebuilderIT
[INFO] Running org.apache.phoenix.rpc.PhoenixClientRpcIT
[INFO] Tests run: 2, Failures: 0, Errors: 0, Skipped: 0, Time elapsed: 7.407 s - in org.apache.phoenix.rpc.PhoenixClientRpcIT
[INFO] Running org.apache.phoenix.rpc.PhoenixServerRpcIT
[INFO] Tests run: 2, Failures: 0, Errors: 0, Skipped: 0, Time elapsed: 19.83 s - in org.apache.phoenix.rpc.PhoenixServerRpcIT
[INFO] Tests run: 2, Failures: 0, Errors: 0, Skipped: 0, Time elapsed: 165.286 s - in org.apache.phoenix.iterate.ScannerLeaseRenewalIT
[INFO] Tests run: 22, Failures: 0, Errors: 0, Skipped: 0, Time elapsed: 111.37 s - in org.apache.phoenix.monitoring.PhoenixMetricsIT
[INFO] 
[INFO] Results:
[INFO] 
[WARNING] Tests run: 657, Failures: 0, Errors: 0, Skipped: 65
[INFO] 
[INFO] 
[INFO] --- maven-failsafe-plugin:2.20:verify (ParallelStatsEnabledTest) @ phoenix-core ---
[INFO] ------------------------------------------------------------------------
[INFO] Reactor Summary:
[INFO] 
[INFO] Apache Phoenix ..................................... SUCCESS [  1.979 s]
[INFO] Phoenix Core ....................................... FAILURE [  02:42 h]
[INFO] Phoenix - Flume .................................... SKIPPED
[INFO] Phoenix - Kafka .................................... SKIPPED
[INFO] Phoenix - Pig ...................................... SKIPPED
[INFO] Phoenix Query Server Client ........................ SKIPPED
[INFO] Phoenix Query Server ............................... SKIPPED
[INFO] Phoenix - Pherf .................................... SKIPPED
[INFO] Phoenix - Spark .................................... SKIPPED
[INFO] Phoenix - Hive ..................................... SKIPPED
[INFO] Phoenix Client ..................................... SKIPPED
[INFO] Phoenix Server ..................................... SKIPPED
[INFO] Phoenix Assembly ................................... SKIPPED
[INFO] Phoenix - Tracing Web Application .................. SKIPPED
[INFO] Phoenix Load Balancer .............................. SKIPPED
[INFO] ------------------------------------------------------------------------
[INFO] BUILD FAILURE
[INFO] ------------------------------------------------------------------------
[INFO] Total time: 02:42 h
[INFO] Finished at: 2017-09-27T21:27:43Z
[INFO] Final Memory: 63M/1579M
[INFO] ------------------------------------------------------------------------
[ERROR] Failed to execute goal org.apache.maven.plugins:maven-failsafe-plugin:2.20:verify
(ParallelStatsEnabledTest) on project phoenix-core: There are test failures.
[ERROR] 
[ERROR] Please refer to <https://builds.apache.org/job/Phoenix-4.x-HBase-1.1/ws/phoenix-core/target/failsafe-reports>
for the individual test results.
[ERROR] Please refer to dump files (if any exist) [date]-jvmRun[N].dump, [date].dumpstream
and [date]-jvmRun[N].dumpstream.
[ERROR] -> [Help 1]
[ERROR] 
[ERROR] To see the full stack trace of the errors, re-run Maven with the -e switch.
[ERROR] Re-run Maven using the -X switch to enable full debug logging.
[ERROR] 
[ERROR] For more information about the errors and possible solutions, please read the following
articles:
[ERROR] [Help 1] http://cwiki.apache.org/confluence/display/MAVEN/MojoFailureException
[ERROR] 
[ERROR] After correcting the problems, you can resume the build with the command
[ERROR]   mvn <goals> -rf :phoenix-core
Build step 'Invoke top-level Maven targets' marked build as failure
Archiving artifacts
[Fast Archiver] Compressed 2.86 GB of artifacts by 61.9% relative to #590
Recording test results

Mime
View raw message