phoenix-commits mailing list archives

Site index · List index
Message view « Date » · « Thread »
Top « Date » · « Thread »
From Apache Jenkins Server <jenk...@builds.apache.org>
Subject Build failed in Jenkins: Phoenix | Master #1821
Date Fri, 29 Sep 2017 08:47:17 GMT
See <https://builds.apache.org/job/Phoenix-master/1821/display/redirect?page=changes>

Changes:

[samarth] PHOENIX-4243 Using rowtimestamp column with RVC causes an exception

------------------------------------------
[...truncated 100.16 KB...]
[INFO] Running org.apache.phoenix.end2end.index.GlobalIndexOptimizationIT
[INFO] Tests run: 12, Failures: 0, Errors: 0, Skipped: 0, Time elapsed: 280.771 s - in org.apache.phoenix.end2end.UpgradeIT
[INFO] Tests run: 6, Failures: 0, Errors: 0, Skipped: 0, Time elapsed: 39.688 s - in org.apache.phoenix.end2end.index.GlobalIndexOptimizationIT
[INFO] Running org.apache.phoenix.end2end.index.IndexMaintenanceIT
[INFO] Running org.apache.phoenix.end2end.index.GlobalMutableTxIndexIT
[INFO] Tests run: 40, Failures: 0, Errors: 0, Skipped: 0, Time elapsed: 194.518 s - in org.apache.phoenix.end2end.index.GlobalImmutableNonTxIndexIT
[INFO] Running org.apache.phoenix.end2end.index.IndexMetadataIT
[INFO] Tests run: 14, Failures: 0, Errors: 0, Skipped: 0, Time elapsed: 96.356 s - in org.apache.phoenix.end2end.index.IndexMaintenanceIT
[INFO] Tests run: 119, Failures: 0, Errors: 0, Skipped: 0, Time elapsed: 884.373 s - in org.apache.phoenix.end2end.ScanQueryIT
[INFO] Tests run: 40, Failures: 0, Errors: 0, Skipped: 0, Time elapsed: 202.488 s - in org.apache.phoenix.end2end.index.GlobalImmutableTxIndexIT
[INFO] Tests run: 14, Failures: 0, Errors: 0, Skipped: 0, Time elapsed: 83.096 s - in org.apache.phoenix.end2end.index.IndexMetadataIT
[INFO] Running org.apache.phoenix.end2end.index.LocalImmutableTxIndexIT
[INFO] Running org.apache.phoenix.end2end.index.IndexUsageIT
[INFO] Running org.apache.phoenix.end2end.index.IndexWithTableSchemaChangeIT
[INFO] Tests run: 16, Failures: 0, Errors: 0, Skipped: 0, Time elapsed: 339.152 s - in org.apache.phoenix.end2end.index.DropColumnIT
[INFO] Tests run: 40, Failures: 0, Errors: 0, Skipped: 0, Time elapsed: 187.135 s - in org.apache.phoenix.end2end.index.GlobalMutableNonTxIndexIT
[INFO] Running org.apache.phoenix.end2end.index.LocalImmutableNonTxIndexIT
[INFO] Running org.apache.phoenix.end2end.index.LocalMutableNonTxIndexIT
[INFO] Running org.apache.phoenix.end2end.index.LocalMutableTxIndexIT
[INFO] Tests run: 40, Failures: 0, Errors: 0, Skipped: 0, Time elapsed: 194.296 s - in org.apache.phoenix.end2end.index.GlobalMutableTxIndexIT
[INFO] Running org.apache.phoenix.end2end.index.MutableIndexIT
[INFO] Tests run: 245, Failures: 0, Errors: 0, Skipped: 0, Time elapsed: 2,223.103 s - in
org.apache.phoenix.end2end.ClientTimeArithmeticQueryIT
[INFO] Tests run: 18, Failures: 0, Errors: 0, Skipped: 0, Time elapsed: 167.507 s - in org.apache.phoenix.end2end.index.IndexWithTableSchemaChangeIT
[INFO] Running org.apache.phoenix.end2end.index.MutableIndexSplitReverseScanIT
[INFO] Running org.apache.phoenix.end2end.index.MutableIndexSplitForwardScanIT
[INFO] Tests run: 37, Failures: 0, Errors: 0, Skipped: 0, Time elapsed: 228.896 s - in org.apache.phoenix.end2end.index.IndexUsageIT
[INFO] Running org.apache.phoenix.end2end.index.SaltedIndexIT
[INFO] Tests run: 3, Failures: 0, Errors: 0, Skipped: 0, Time elapsed: 16.143 s - in org.apache.phoenix.end2end.index.SaltedIndexIT
[INFO] Running org.apache.phoenix.end2end.index.ViewIndexIT
[INFO] Tests run: 8, Failures: 0, Errors: 0, Skipped: 0, Time elapsed: 55.467 s - in org.apache.phoenix.end2end.index.ViewIndexIT
[INFO] Running org.apache.phoenix.end2end.index.txn.MutableRollbackIT
[INFO] Tests run: 40, Failures: 0, Errors: 0, Skipped: 0, Time elapsed: 369.43 s - in org.apache.phoenix.end2end.index.LocalImmutableTxIndexIT
[INFO] Tests run: 40, Failures: 0, Errors: 0, Skipped: 0, Time elapsed: 343.077 s - in org.apache.phoenix.end2end.index.LocalImmutableNonTxIndexIT
[INFO] Tests run: 40, Failures: 0, Errors: 0, Skipped: 0, Time elapsed: 345.08 s - in org.apache.phoenix.end2end.index.LocalMutableNonTxIndexIT
[INFO] Running org.apache.phoenix.end2end.index.txn.RollbackIT
[INFO] Running org.apache.phoenix.end2end.join.HashJoinCacheIT
[INFO] Tests run: 1, Failures: 0, Errors: 0, Skipped: 0, Time elapsed: 7.678 s - in org.apache.phoenix.end2end.join.HashJoinCacheIT
[INFO] Running org.apache.phoenix.end2end.join.HashJoinLocalIndexIT
[INFO] Tests run: 40, Failures: 0, Errors: 0, Skipped: 0, Time elapsed: 364.484 s - in org.apache.phoenix.end2end.index.LocalMutableTxIndexIT
[INFO] Running org.apache.phoenix.end2end.join.HashJoinGlobalIndexIT
[INFO] Tests run: 6, Failures: 0, Errors: 0, Skipped: 0, Time elapsed: 64.871 s - in org.apache.phoenix.end2end.index.txn.MutableRollbackIT
[INFO] Running org.apache.phoenix.end2end.join.HashJoinNoIndexIT
[INFO] Running org.apache.phoenix.end2end.join.HashJoinMoreIT
[INFO] Tests run: 8, Failures: 0, Errors: 0, Skipped: 0, Time elapsed: 50.264 s - in org.apache.phoenix.end2end.index.txn.RollbackIT
[INFO] Running org.apache.phoenix.end2end.join.SortMergeJoinGlobalIndexIT
[INFO] Tests run: 8, Failures: 0, Errors: 0, Skipped: 0, Time elapsed: 52.696 s - in org.apache.phoenix.end2end.join.HashJoinMoreIT
[INFO] Running org.apache.phoenix.end2end.join.SortMergeJoinLocalIndexIT
[INFO] Tests run: 64, Failures: 0, Errors: 0, Skipped: 0, Time elapsed: 487.619 s - in org.apache.phoenix.end2end.index.MutableIndexIT
[INFO] Tests run: 33, Failures: 0, Errors: 0, Skipped: 0, Time elapsed: 181.68 s - in org.apache.phoenix.end2end.join.HashJoinNoIndexIT
[INFO] Running org.apache.phoenix.end2end.join.SortMergeJoinNoIndexIT
[INFO] Running org.apache.phoenix.end2end.join.SubqueryIT
[INFO] Tests run: 33, Failures: 0, Errors: 0, Skipped: 0, Time elapsed: 298.936 s - in org.apache.phoenix.end2end.join.HashJoinGlobalIndexIT
[INFO] Running org.apache.phoenix.end2end.join.SubqueryUsingSortMergeJoinIT
[INFO] Tests run: 34, Failures: 0, Errors: 0, Skipped: 0, Time elapsed: 303.377 s - in org.apache.phoenix.end2end.join.SortMergeJoinGlobalIndexIT
[INFO] Running org.apache.phoenix.end2end.salted.SaltedTableIT
[INFO] Tests run: 8, Failures: 0, Errors: 0, Skipped: 0, Time elapsed: 17.121 s - in org.apache.phoenix.end2end.salted.SaltedTableIT
[INFO] Running org.apache.phoenix.end2end.salted.SaltedTableUpsertSelectIT
[INFO] Tests run: 34, Failures: 0, Errors: 0, Skipped: 0, Time elapsed: 184.027 s - in org.apache.phoenix.end2end.join.SortMergeJoinNoIndexIT
[INFO] Tests run: 6, Failures: 0, Errors: 0, Skipped: 0, Time elapsed: 29.214 s - in org.apache.phoenix.end2end.salted.SaltedTableUpsertSelectIT
[INFO] Running org.apache.phoenix.iterate.PhoenixQueryTimeoutIT
[INFO] Tests run: 2, Failures: 0, Errors: 0, Skipped: 0, Time elapsed: 5.873 s - in org.apache.phoenix.iterate.PhoenixQueryTimeoutIT
[INFO] Running org.apache.phoenix.iterate.RoundRobinResultIteratorIT
[INFO] Running org.apache.phoenix.end2end.salted.SaltedTableVarLengthRowKeyIT
[INFO] Tests run: 1, Failures: 0, Errors: 0, Skipped: 0, Time elapsed: 4.367 s - in org.apache.phoenix.end2end.salted.SaltedTableVarLengthRowKeyIT
[INFO] Running org.apache.phoenix.replication.SystemCatalogWALEntryFilterIT
[INFO] Tests run: 2, Failures: 0, Errors: 0, Skipped: 0, Time elapsed: 0.113 s - in org.apache.phoenix.replication.SystemCatalogWALEntryFilterIT
[INFO] Running org.apache.phoenix.rpc.UpdateCacheIT
[INFO] Tests run: 21, Failures: 0, Errors: 0, Skipped: 0, Time elapsed: 211.903 s - in org.apache.phoenix.end2end.join.SubqueryIT
[INFO] Tests run: 7, Failures: 0, Errors: 0, Skipped: 0, Time elapsed: 29.735 s - in org.apache.phoenix.rpc.UpdateCacheIT
[INFO] Running org.apache.phoenix.trace.PhoenixTracingEndToEndIT
[INFO] Running org.apache.phoenix.trace.PhoenixTableMetricsWriterIT
[INFO] Tests run: 9, Failures: 0, Errors: 0, Skipped: 0, Time elapsed: 54.008 s - in org.apache.phoenix.iterate.RoundRobinResultIteratorIT
[INFO] Tests run: 4, Failures: 0, Errors: 0, Skipped: 0, Time elapsed: 662.221 s - in org.apache.phoenix.end2end.index.MutableIndexSplitForwardScanIT
[INFO] Running org.apache.phoenix.tx.ParameterizedTransactionIT
[INFO] Tests run: 2, Failures: 0, Errors: 0, Skipped: 0, Time elapsed: 12.523 s - in org.apache.phoenix.trace.PhoenixTableMetricsWriterIT
[INFO] Running org.apache.phoenix.tx.TransactionIT
[INFO] Tests run: 4, Failures: 0, Errors: 0, Skipped: 0, Time elapsed: 694.419 s - in org.apache.phoenix.end2end.index.MutableIndexSplitReverseScanIT
[INFO] Running org.apache.phoenix.tx.TxCheckpointIT
[INFO] Tests run: 15, Failures: 0, Errors: 0, Skipped: 0, Time elapsed: 162.497 s - in org.apache.phoenix.end2end.join.SubqueryUsingSortMergeJoinIT
[INFO] Running org.apache.phoenix.tx.FlappingTransactionIT
[INFO] Tests run: 4, Failures: 0, Errors: 0, Skipped: 0, Time elapsed: 9.315 s - in org.apache.phoenix.tx.FlappingTransactionIT
[INFO] Running org.apache.phoenix.util.IndexScrutinyIT
[INFO] Tests run: 8, Failures: 0, Errors: 0, Skipped: 0, Time elapsed: 51.308 s - in org.apache.phoenix.tx.TransactionIT
[INFO] Tests run: 3, Failures: 0, Errors: 0, Skipped: 0, Time elapsed: 14.235 s - in org.apache.phoenix.util.IndexScrutinyIT
[INFO] Tests run: 8, Failures: 0, Errors: 0, Skipped: 0, Time elapsed: 89.949 s - in org.apache.phoenix.trace.PhoenixTracingEndToEndIT
[INFO] Tests run: 34, Failures: 0, Errors: 0, Skipped: 0, Time elapsed: 578.667 s - in org.apache.phoenix.end2end.join.HashJoinLocalIndexIT
[INFO] Tests run: 34, Failures: 0, Errors: 0, Skipped: 0, Time elapsed: 577.376 s - in org.apache.phoenix.end2end.join.SortMergeJoinLocalIndexIT
[WARNING] Tests run: 52, Failures: 0, Errors: 0, Skipped: 4, Time elapsed: 198.291 s - in
org.apache.phoenix.tx.ParameterizedTransactionIT
[INFO] Tests run: 40, Failures: 0, Errors: 0, Skipped: 0, Time elapsed: 269.376 s - in org.apache.phoenix.tx.TxCheckpointIT
[INFO] 
[INFO] Results:
[INFO] 
[WARNING] Tests run: 3546, Failures: 0, Errors: 0, Skipped: 5
[INFO] 
[INFO] 
[INFO] --- maven-failsafe-plugin:2.20:integration-test (HBaseManagedTimeTests) @ phoenix-core
---
[INFO] 
[INFO] -------------------------------------------------------
[INFO]  T E S T S
[INFO] -------------------------------------------------------
[INFO] 
[INFO] Results:
[INFO] 
[INFO] Tests run: 0, Failures: 0, Errors: 0, Skipped: 0
[INFO] 
[INFO] 
[INFO] --- maven-failsafe-plugin:2.20:integration-test (NeedTheirOwnClusterTests) @ phoenix-core
---
[INFO] 
[INFO] -------------------------------------------------------
[INFO]  T E S T S
[INFO] -------------------------------------------------------
[INFO] Running org.apache.hadoop.hbase.regionserver.wal.WALReplayWithIndexWritesAndCompressedWALIT
[INFO] Running org.apache.phoenix.end2end.ConnectionUtilIT
[INFO] Tests run: 1, Failures: 0, Errors: 0, Skipped: 0, Time elapsed: 63.294 s - in org.apache.hadoop.hbase.regionserver.wal.WALReplayWithIndexWritesAndCompressedWALIT
[INFO] Running org.apache.hadoop.hbase.regionserver.wal.WALRecoveryRegionPostOpenIT
[INFO] Tests run: 1, Failures: 0, Errors: 0, Skipped: 0, Time elapsed: 9.44 s - in org.apache.hadoop.hbase.regionserver.wal.WALRecoveryRegionPostOpenIT
[INFO] Running org.apache.phoenix.end2end.CsvBulkLoadToolIT
[INFO] Running org.apache.phoenix.end2end.CountDistinctCompressionIT
[INFO] Running org.apache.phoenix.end2end.ContextClassloaderIT
[INFO] Tests run: 1, Failures: 0, Errors: 0, Skipped: 0, Time elapsed: 5.656 s - in org.apache.phoenix.end2end.CountDistinctCompressionIT
[INFO] Tests run: 3, Failures: 0, Errors: 0, Skipped: 0, Time elapsed: 3.59 s - in org.apache.phoenix.end2end.ContextClassloaderIT
[INFO] Tests run: 1, Failures: 0, Errors: 0, Skipped: 0, Time elapsed: 32.908 s - in org.apache.phoenix.end2end.ConnectionUtilIT
[INFO] Running org.apache.phoenix.end2end.DropSchemaIT
[INFO] Tests run: 2, Failures: 0, Errors: 0, Skipped: 0, Time elapsed: 22.438 s - in org.apache.phoenix.end2end.DropSchemaIT
[INFO] Running org.apache.phoenix.end2end.FlappingLocalIndexIT
[INFO] Running org.apache.phoenix.end2end.IndexExtendedIT
[INFO] Running org.apache.phoenix.end2end.IndexScrutinyToolIT
[INFO] Running org.apache.phoenix.end2end.IndexToolForPartialBuildWithNamespaceEnabledIT
[INFO] Running org.apache.phoenix.end2end.IndexToolForPartialBuildIT
[INFO] Tests run: 1, Failures: 0, Errors: 0, Skipped: 0, Time elapsed: 25.668 s - in org.apache.phoenix.end2end.IndexToolForPartialBuildIT
[INFO] Tests run: 2, Failures: 0, Errors: 0, Skipped: 0, Time elapsed: 37.266 s - in org.apache.phoenix.end2end.IndexToolForPartialBuildWithNamespaceEnabledIT
[INFO] Running org.apache.phoenix.end2end.QueryTimeoutIT
[INFO] Running org.apache.phoenix.end2end.QueryWithLimitIT
[INFO] Tests run: 2, Failures: 0, Errors: 0, Skipped: 0, Time elapsed: 6.585 s - in org.apache.phoenix.end2end.QueryWithLimitIT
[INFO] Tests run: 12, Failures: 0, Errors: 0, Skipped: 0, Time elapsed: 146.8 s - in org.apache.phoenix.end2end.CsvBulkLoadToolIT
[INFO] Running org.apache.phoenix.end2end.RebuildIndexConnectionPropsIT
[INFO] Tests run: 1, Failures: 0, Errors: 0, Skipped: 0, Time elapsed: 1.879 s - in org.apache.phoenix.end2end.RebuildIndexConnectionPropsIT
[INFO] Running org.apache.phoenix.end2end.RegexBulkLoadToolIT
[INFO] Tests run: 2, Failures: 0, Errors: 0, Skipped: 0, Time elapsed: 53.962 s - in org.apache.phoenix.end2end.QueryTimeoutIT
[INFO] Tests run: 12, Failures: 0, Errors: 0, Skipped: 0, Time elapsed: 160.302 s - in org.apache.phoenix.end2end.FlappingLocalIndexIT
[INFO] Running org.apache.phoenix.end2end.RenewLeaseIT
[INFO] Running org.apache.phoenix.end2end.SystemTablePermissionsIT
[INFO] Tests run: 10, Failures: 0, Errors: 0, Skipped: 0, Time elapsed: 159.594 s - in org.apache.phoenix.end2end.IndexScrutinyToolIT
[INFO] Tests run: 1, Failures: 0, Errors: 0, Skipped: 0, Time elapsed: 26.93 s - in org.apache.phoenix.end2end.RenewLeaseIT
[INFO] Running org.apache.phoenix.end2end.StatsCollectorIT
[INFO] Running org.apache.phoenix.end2end.SysTableNamespaceMappedStatsCollectorIT
[INFO] Tests run: 10, Failures: 0, Errors: 0, Skipped: 0, Time elapsed: 109.611 s - in org.apache.phoenix.end2end.RegexBulkLoadToolIT
[INFO] Running org.apache.phoenix.end2end.TableSnapshotReadsMapReduceIT
[INFO] Tests run: 3, Failures: 0, Errors: 0, Skipped: 0, Time elapsed: 24.715 s - in org.apache.phoenix.end2end.TableSnapshotReadsMapReduceIT
[INFO] Tests run: 2, Failures: 0, Errors: 0, Skipped: 0, Time elapsed: 105.322 s - in org.apache.phoenix.end2end.SystemTablePermissionsIT
[INFO] Running org.apache.phoenix.end2end.UpdateCacheAcrossDifferentClientsIT
[INFO] Tests run: 6, Failures: 0, Errors: 0, Skipped: 0, Time elapsed: 35.157 s - in org.apache.phoenix.end2end.UpdateCacheAcrossDifferentClientsIT
[INFO] Running org.apache.phoenix.end2end.UserDefinedFunctionsIT
[INFO] Running org.apache.phoenix.end2end.index.ImmutableIndexIT
[INFO] Running org.apache.phoenix.end2end.index.LocalIndexIT
[INFO] Running org.apache.phoenix.end2end.SpillableGroupByIT
[ERROR] Tests run: 1, Failures: 0, Errors: 1, Skipped: 0, Time elapsed: 0.038 s <<<
FAILURE! - in org.apache.phoenix.end2end.SpillableGroupByIT
[ERROR] org.apache.phoenix.end2end.SpillableGroupByIT  Time elapsed: 0.03 s  <<<
ERROR!
java.lang.RuntimeException: java.io.IOException: Shutting down
	at org.apache.phoenix.end2end.SpillableGroupByIT.doSetup(SpillableGroupByIT.java:80)
Caused by: java.io.IOException: Shutting down
	at org.apache.phoenix.end2end.SpillableGroupByIT.doSetup(SpillableGroupByIT.java:80)
Caused by: java.lang.RuntimeException: Master not initialized after 200000ms seconds
	at org.apache.phoenix.end2end.SpillableGroupByIT.doSetup(SpillableGroupByIT.java:80)

[INFO] Running org.apache.phoenix.end2end.index.MutableIndexFailureIT
[INFO] Tests run: 14, Failures: 0, Errors: 0, Skipped: 0, Time elapsed: 58.735 s - in org.apache.phoenix.end2end.UserDefinedFunctionsIT
[INFO] Running org.apache.phoenix.end2end.index.MutableIndexReplicationIT
[INFO] Running org.apache.phoenix.end2end.index.PartialIndexRebuilderIT
[WARNING] Tests run: 24, Failures: 0, Errors: 0, Skipped: 16, Time elapsed: 122.255 s - in
org.apache.phoenix.end2end.index.ImmutableIndexIT
[INFO] Tests run: 1, Failures: 0, Errors: 0, Skipped: 0, Time elapsed: 30.848 s - in org.apache.phoenix.end2end.index.MutableIndexReplicationIT
[INFO] Running org.apache.phoenix.end2end.index.txn.TxWriteFailureIT
[INFO] Running org.apache.phoenix.execute.PartialCommitIT
[INFO] Tests run: 12, Failures: 0, Errors: 0, Skipped: 0, Time elapsed: 2.621 s - in org.apache.phoenix.execute.PartialCommitIT
[INFO] Tests run: 8, Failures: 0, Errors: 0, Skipped: 0, Time elapsed: 65.199 s - in org.apache.phoenix.end2end.index.txn.TxWriteFailureIT
[INFO] Running org.apache.phoenix.hbase.index.FailForUnsupportedHBaseVersionsIT
[INFO] Tests run: 2, Failures: 0, Errors: 0, Skipped: 0, Time elapsed: 31.781 s - in org.apache.phoenix.hbase.index.FailForUnsupportedHBaseVersionsIT
[INFO] Running org.apache.phoenix.execute.UpsertSelectOverlappingBatchesIT
[INFO] Running org.apache.phoenix.iterate.RoundRobinResultIteratorWithStatsIT
[INFO] Tests run: 1, Failures: 0, Errors: 0, Skipped: 0, Time elapsed: 28.084 s - in org.apache.phoenix.iterate.RoundRobinResultIteratorWithStatsIT
[WARNING] Tests run: 144, Failures: 0, Errors: 0, Skipped: 24, Time elapsed: 532.918 s - in
org.apache.phoenix.end2end.StatsCollectorIT
[INFO] Tests run: 3, Failures: 0, Errors: 0, Skipped: 0, Time elapsed: 72.092 s - in org.apache.phoenix.execute.UpsertSelectOverlappingBatchesIT
[WARNING] Tests run: 144, Failures: 0, Errors: 0, Skipped: 24, Time elapsed: 540.042 s - in
org.apache.phoenix.end2end.SysTableNamespaceMappedStatsCollectorIT
[INFO] Tests run: 21, Failures: 0, Errors: 0, Skipped: 0, Time elapsed: 385.449 s - in org.apache.phoenix.end2end.index.MutableIndexFailureIT
[INFO] Tests run: 34, Failures: 0, Errors: 0, Skipped: 0, Time elapsed: 417.635 s - in org.apache.phoenix.end2end.index.LocalIndexIT
[INFO] Running org.apache.phoenix.iterate.ScannerLeaseRenewalIT
[INFO] Running org.apache.phoenix.monitoring.PhoenixMetricsIT
[INFO] Running org.apache.phoenix.rpc.PhoenixClientRpcIT
[INFO] Tests run: 2, Failures: 0, Errors: 0, Skipped: 0, Time elapsed: 7.632 s - in org.apache.phoenix.rpc.PhoenixClientRpcIT
[INFO] Running org.apache.phoenix.rpc.PhoenixServerRpcIT
[INFO] Tests run: 2, Failures: 0, Errors: 0, Skipped: 0, Time elapsed: 18.611 s - in org.apache.phoenix.rpc.PhoenixServerRpcIT
[INFO] Tests run: 24, Failures: 0, Errors: 0, Skipped: 0, Time elapsed: 422.764 s - in org.apache.phoenix.end2end.index.PartialIndexRebuilderIT
[INFO] Tests run: 22, Failures: 0, Errors: 0, Skipped: 0, Time elapsed: 84.782 s - in org.apache.phoenix.monitoring.PhoenixMetricsIT
[INFO] Tests run: 2, Failures: 0, Errors: 0, Skipped: 0, Time elapsed: 163.831 s - in org.apache.phoenix.iterate.ScannerLeaseRenewalIT
[INFO] Tests run: 140, Failures: 0, Errors: 0, Skipped: 0, Time elapsed: 998.095 s - in org.apache.phoenix.end2end.IndexExtendedIT
[INFO] 
[INFO] Results:
[INFO] 
[ERROR] Errors: 
[ERROR]   SpillableGroupByIT.doSetup:80->BaseTest.setUpTestDriver:514->BaseTest.setUpTestDriver:520->BaseTest.checkClusterInitialized:428->BaseTest.setUpTestCluster:446->BaseTest.initMiniCluster:549
ยป Runtime
[INFO] 
[ERROR] Tests run: 674, Failures: 0, Errors: 1, Skipped: 64
[INFO] 
[INFO] 
[INFO] --- maven-failsafe-plugin:2.20:verify (ParallelStatsEnabledTest) @ phoenix-core ---
[INFO] ------------------------------------------------------------------------
[INFO] Reactor Summary:
[INFO] 
[INFO] Apache Phoenix ..................................... SUCCESS [  4.640 s]
[INFO] Phoenix Core ....................................... FAILURE [  01:28 h]
[INFO] Phoenix - Flume .................................... SKIPPED
[INFO] Phoenix - Kafka .................................... SKIPPED
[INFO] Phoenix - Pig ...................................... SKIPPED
[INFO] Phoenix Query Server Client ........................ SKIPPED
[INFO] Phoenix Query Server ............................... SKIPPED
[INFO] Phoenix - Pherf .................................... SKIPPED
[INFO] Phoenix - Spark .................................... SKIPPED
[INFO] Phoenix - Hive ..................................... SKIPPED
[INFO] Phoenix Client ..................................... SKIPPED
[INFO] Phoenix Server ..................................... SKIPPED
[INFO] Phoenix Assembly ................................... SKIPPED
[INFO] Phoenix - Tracing Web Application .................. SKIPPED
[INFO] Phoenix Load Balancer .............................. SKIPPED
[INFO] ------------------------------------------------------------------------
[INFO] BUILD FAILURE
[INFO] ------------------------------------------------------------------------
[INFO] Total time: 01:28 h
[INFO] Finished at: 2017-09-29T08:12:12Z
[INFO] Final Memory: 60M/690M
[INFO] ------------------------------------------------------------------------
[ERROR] Failed to execute goal org.apache.maven.plugins:maven-failsafe-plugin:2.20:verify
(ParallelStatsEnabledTest) on project phoenix-core: There are test failures.
[ERROR] 
[ERROR] Please refer to <https://builds.apache.org/job/Phoenix-master/ws/phoenix-core/target/failsafe-reports>
for the individual test results.
[ERROR] Please refer to dump files (if any exist) [date]-jvmRun[N].dump, [date].dumpstream
and [date]-jvmRun[N].dumpstream.
[ERROR] -> [Help 1]
[ERROR] 
[ERROR] To see the full stack trace of the errors, re-run Maven with the -e switch.
[ERROR] Re-run Maven using the -X switch to enable full debug logging.
[ERROR] 
[ERROR] For more information about the errors and possible solutions, please read the following
articles:
[ERROR] [Help 1] http://cwiki.apache.org/confluence/display/MAVEN/MojoFailureException
[ERROR] 
[ERROR] After correcting the problems, you can resume the build with the command
[ERROR]   mvn <goals> -rf :phoenix-core
Build step 'Invoke top-level Maven targets' marked build as failure
Archiving artifacts
[Fast Archiver] Compressed 3.30 GB of artifacts by 56.7% relative to #1807
[JIRA] Updating issue PHOENIX-4243
Recording test results

Mime
View raw message