phoenix-commits mailing list archives

Site index · List index
Message view « Date » · « Thread »
Top « Date » · « Thread »
From Apache Jenkins Server <jenk...@builds.apache.org>
Subject Build failed in Jenkins: Phoenix Compile Compatibility with HBase #375
Date Mon, 14 Aug 2017 09:24:14 GMT
See <https://builds.apache.org/job/Phoenix_Compile_Compat_wHBase/375/display/redirect>

------------------------------------------
Started by timer
[EnvInject] - Loading node environment variables.
Building remotely on H25 (couchdbtest ubuntu xenial) in workspace <https://builds.apache.org/job/Phoenix_Compile_Compat_wHBase/ws/>
[Phoenix_Compile_Compat_wHBase] $ /bin/bash /tmp/jenkins790690078455102542.sh
core file size          (blocks, -c) 0
data seg size           (kbytes, -d) unlimited
scheduling priority             (-e) 0
file size               (blocks, -f) unlimited
pending signals                 (-i) 386417
max locked memory       (kbytes, -l) 64
max memory size         (kbytes, -m) unlimited
open files                      (-n) 60000
pipe size            (512 bytes, -p) 8
POSIX message queues     (bytes, -q) 819200
real-time priority              (-r) 0
stack size              (kbytes, -s) 8192
cpu time               (seconds, -t) unlimited
max user processes              (-u) 10240
virtual memory          (kbytes, -v) unlimited
file locks                      (-x) unlimited
core id		: 0
core id		: 1
core id		: 2
core id		: 3
core id		: 4
core id		: 5
physical id	: 0
physical id	: 1
MemTotal:       98958120 kB
MemFree:        25705828 kB
Filesystem      Size  Used Avail Use% Mounted on
udev             48G     0   48G   0% /dev
tmpfs           9.5G 1002M  8.5G  11% /run
/dev/sda1       364G  143G  203G  42% /
tmpfs            48G  516K   48G   1% /dev/shm
tmpfs           5.0M     0  5.0M   0% /run/lock
tmpfs            48G     0   48G   0% /sys/fs/cgroup
tmpfs           9.5G     0  9.5G   0% /run/user/10025
apache-maven-2.2.1
apache-maven-3.0.4
apache-maven-3.0.5
apache-maven-3.2.1
apache-maven-3.2.5
apache-maven-3.3.3
apache-maven-3.3.9
apache-maven-3.5.0
latest
latest2
latest3


===========================================================================================
Verifying compile level compatibility with HBase 0.98 with Phoenix 4.x-HBase-0.98
===========================================================================================

Cloning into 'hbase'...
Switched to a new branch '0.98'
Branch 0.98 set up to track remote branch 0.98 from origin.

main:
     [exec] ~/jenkins-slave/workspace/Phoenix_Compile_Compat_wHBase/hbase/hbase-common ~/jenkins-slave/workspace/Phoenix_Compile_Compat_wHBase/hbase/hbase-common
     [exec] ~/jenkins-slave/workspace/Phoenix_Compile_Compat_wHBase/hbase/hbase-common

main:
    [mkdir] Created dir: <https://builds.apache.org/job/Phoenix_Compile_Compat_wHBase/ws/hbase/hbase-common/target/nativelib>
     [exec] tar: hadoop-snappy-nativelibs.tar: Cannot open: No such file or directory
     [exec] tar: Error is not recoverable: exiting now
     [exec] Result: 2

main:
    [mkdir] Created dir: <https://builds.apache.org/job/Phoenix_Compile_Compat_wHBase/ws/hbase/hbase-server/target/hbase-webapps>
     [copy] Copying 20 files to <https://builds.apache.org/job/Phoenix_Compile_Compat_wHBase/ws/hbase/hbase-server/target/hbase-webapps>
    [mkdir] Created dir: <https://builds.apache.org/job/Phoenix_Compile_Compat_wHBase/ws/hbase/hbase-server/target/hbase-webapps/master/WEB-INF>
    [mkdir] Created dir: <https://builds.apache.org/job/Phoenix_Compile_Compat_wHBase/ws/hbase/hbase-server/target/hbase-webapps/regionserver/WEB-INF>

main:
    [mkdir] Created dir: <https://builds.apache.org/job/Phoenix_Compile_Compat_wHBase/ws/hbase/hbase-thrift/target/hbase-webapps>
     [copy] Copying 17 files to <https://builds.apache.org/job/Phoenix_Compile_Compat_wHBase/ws/hbase/hbase-thrift/target/hbase-webapps>
    [mkdir] Created dir: <https://builds.apache.org/job/Phoenix_Compile_Compat_wHBase/ws/hbase/hbase-thrift/target/hbase-webapps/thrift/WEB-INF>

main:
    [mkdir] Created dir: <https://builds.apache.org/job/Phoenix_Compile_Compat_wHBase/ws/hbase/hbase-rest/target/hbase-webapps>
     [copy] Copying 1 file to <https://builds.apache.org/job/Phoenix_Compile_Compat_wHBase/ws/hbase/hbase-rest/target/hbase-webapps>
    [mkdir] Created dir: <https://builds.apache.org/job/Phoenix_Compile_Compat_wHBase/ws/hbase/hbase-rest/target/hbase-webapps/rest/WEB-INF>

HBase pom.xml:

Got HBase version as 0.98.25-SNAPSHOT
Cloning into 'phoenix'...
Switched to a new branch '4.x-HBase-0.98'
Branch 4.x-HBase-0.98 set up to track remote branch 4.x-HBase-0.98 from origin.
ANTLR Parser Generator  Version 3.5.2
Output file <https://builds.apache.org/job/Phoenix_Compile_Compat_wHBase/ws/phoenix/phoenix-core/target/generated-sources/antlr3/org/apache/phoenix/parse/PhoenixSQLParser.java>
does not exist: must build <https://builds.apache.org/job/Phoenix_Compile_Compat_wHBase/ws/phoenix/phoenix-core/src/main/antlr3/PhoenixSQL.g>
PhoenixSQL.g


===========================================================================================
Verifying compile level compatibility with HBase branch-1.3 with Phoenix master
===========================================================================================

Cloning into 'hbase'...
Switched to a new branch 'branch-1.3'
Branch branch-1.3 set up to track remote branch branch-1.3 from origin.

main:
     [exec] ~/jenkins-slave/workspace/Phoenix_Compile_Compat_wHBase/phoenix/hbase/hbase-common
~/jenkins-slave/workspace/Phoenix_Compile_Compat_wHBase/phoenix/hbase/hbase-common
     [exec] ~/jenkins-slave/workspace/Phoenix_Compile_Compat_wHBase/phoenix/hbase/hbase-common

main:

main:
    [mkdir] Created dir: <https://builds.apache.org/job/Phoenix_Compile_Compat_wHBase/ws/phoenix/hbase/hbase-server/target/hbase-webapps>
     [copy] Copying 20 files to <https://builds.apache.org/job/Phoenix_Compile_Compat_wHBase/ws/phoenix/hbase/hbase-server/target/hbase-webapps>
    [mkdir] Created dir: <https://builds.apache.org/job/Phoenix_Compile_Compat_wHBase/ws/phoenix/hbase/hbase-server/target/hbase-webapps/master/WEB-INF>
    [mkdir] Created dir: <https://builds.apache.org/job/Phoenix_Compile_Compat_wHBase/ws/phoenix/hbase/hbase-server/target/hbase-webapps/regionserver/WEB-INF>

main:

main:

main:
    [mkdir] Created dir: <https://builds.apache.org/job/Phoenix_Compile_Compat_wHBase/ws/phoenix/hbase/hbase-thrift/target/hbase-webapps>
     [copy] Copying 17 files to <https://builds.apache.org/job/Phoenix_Compile_Compat_wHBase/ws/phoenix/hbase/hbase-thrift/target/hbase-webapps>
    [mkdir] Created dir: <https://builds.apache.org/job/Phoenix_Compile_Compat_wHBase/ws/phoenix/hbase/hbase-thrift/target/hbase-webapps/thrift/WEB-INF>

main:
    [mkdir] Created dir: <https://builds.apache.org/job/Phoenix_Compile_Compat_wHBase/ws/phoenix/hbase/hbase-rest/target/hbase-webapps>
     [copy] Copying 1 file to <https://builds.apache.org/job/Phoenix_Compile_Compat_wHBase/ws/phoenix/hbase/hbase-rest/target/hbase-webapps>
    [mkdir] Created dir: <https://builds.apache.org/job/Phoenix_Compile_Compat_wHBase/ws/phoenix/hbase/hbase-rest/target/hbase-webapps/rest/WEB-INF>
Warning:  org.apache.xerces.parsers.SAXParser: Feature 'http://javax.xml.XMLConstants/feature/secure-processing'
is not recognized.
Warning:  org.apache.xerces.parsers.SAXParser: Property 'http://javax.xml.XMLConstants/property/accessExternalDTD'
is not recognized.
Warning:  org.apache.xerces.parsers.SAXParser: Property 'http://www.oracle.com/xml/jaxp/properties/entityExpansionLimit'
is not recognized.
Warning:  org.apache.xerces.parsers.SAXParser: Feature 'http://javax.xml.XMLConstants/feature/secure-processing'
is not recognized.
Warning:  org.apache.xerces.parsers.SAXParser: Property 'http://javax.xml.XMLConstants/property/accessExternalDTD'
is not recognized.
Warning:  org.apache.xerces.parsers.SAXParser: Property 'http://www.oracle.com/xml/jaxp/properties/entityExpansionLimit'
is not recognized.
<https://builds.apache.org/job/Phoenix_Compile_Compat_wHBase/ws/phoenix/hbase/hbase-archetypes/hbase-archetype-builder/createArchetypes.sh>:
26: <https://builds.apache.org/job/Phoenix_Compile_Compat_wHBase/ws/phoenix/hbase/hbase-archetypes/hbase-archetype-builder/createArchetypes.sh>:
mvn: not found
[ERROR] Failed to execute goal org.codehaus.mojo:exec-maven-plugin:1.4.0:exec (run-createArchetypes-script)
on project hbase-archetype-builder: Command execution failed.: Process exited with an error:
127 (Exit value: 127) -> [Help 1]
[ERROR] 
[ERROR] To see the full stack trace of the errors, re-run Maven with the -e switch.
[ERROR] Re-run Maven using the -X switch to enable full debug logging.
[ERROR] 
[ERROR] For more information about the errors and possible solutions, please read the following
articles:
[ERROR] [Help 1] http://cwiki.apache.org/confluence/display/MAVEN/MojoExecutionException
[ERROR] 
[ERROR] After correcting the problems, you can resume the build with the command
[ERROR]   mvn <goals> -rf :hbase-archetype-builder
Build step 'Execute shell' marked build as failure

Mime
View raw message