phoenix-commits mailing list archives

Site index · List index
Message view « Date » · « Thread »
Top « Date » · « Thread »
From Apache Jenkins Server <jenk...@builds.apache.org>
Subject Build failed in Jenkins: Phoenix-4.x-HBase-1.1 #532
Date Fri, 18 Aug 2017 21:39:53 GMT
See <https://builds.apache.org/job/Phoenix-4.x-HBase-1.1/532/display/redirect?page=changes>

Changes:

[samarth] PHOENIX-4102 Convert ArrayIT to extend BaseUniqueNamesOwnClusterIT

------------------------------------------
[...truncated 102.36 KB...]
[INFO] Tests run: 18, Failures: 0, Errors: 0, Skipped: 0, Time elapsed: 9.182 s - in org.apache.phoenix.end2end.ToNumberFunctionIT
[INFO] Running org.apache.phoenix.end2end.TruncateFunctionIT
[INFO] Tests run: 54, Failures: 0, Errors: 0, Skipped: 0, Time elapsed: 56.526 s - in org.apache.phoenix.end2end.SequenceIT
[INFO] Tests run: 1, Failures: 0, Errors: 0, Skipped: 0, Time elapsed: 5.917 s - in org.apache.phoenix.end2end.TruncateFunctionIT
[INFO] Running org.apache.phoenix.end2end.UpsertValuesIT
[INFO] Running org.apache.phoenix.end2end.TopNIT
[INFO] Tests run: 4, Failures: 0, Errors: 0, Skipped: 0, Time elapsed: 6.426 s - in org.apache.phoenix.end2end.TopNIT
[INFO] Running org.apache.phoenix.end2end.salted.SaltedTableIT
[INFO] Tests run: 8, Failures: 0, Errors: 0, Skipped: 0, Time elapsed: 6.668 s - in org.apache.phoenix.end2end.salted.SaltedTableIT
[INFO] Running org.apache.phoenix.rpc.UpdateCacheWithScnIT
[INFO] Tests run: 1, Failures: 0, Errors: 0, Skipped: 0, Time elapsed: 6.184 s - in org.apache.phoenix.rpc.UpdateCacheWithScnIT
[INFO] Running org.apache.phoenix.end2end.VariableLengthPKIT
[INFO] Tests run: 46, Failures: 0, Errors: 0, Skipped: 0, Time elapsed: 125.937 s - in org.apache.phoenix.end2end.RowValueConstructorIT
[INFO] Tests run: 19, Failures: 0, Errors: 0, Skipped: 0, Time elapsed: 143.449 s - in org.apache.phoenix.end2end.QueryDatabaseMetaDataIT
[INFO] Tests run: 50, Failures: 0, Errors: 0, Skipped: 0, Time elapsed: 45.741 s - in org.apache.phoenix.end2end.VariableLengthPKIT
[INFO] Tests run: 21, Failures: 0, Errors: 0, Skipped: 0, Time elapsed: 198.938 s - in org.apache.phoenix.end2end.CreateTableIT
[INFO] Tests run: 25, Failures: 0, Errors: 0, Skipped: 0, Time elapsed: 123.079 s - in org.apache.phoenix.end2end.UpsertValuesIT
[INFO] 
[INFO] Results:
[INFO] 
[INFO] Tests run: 417, Failures: 0, Errors: 0, Skipped: 0
[INFO] 
[INFO] 
[INFO] --- maven-failsafe-plugin:2.20:integration-test (HBaseManagedTimeTests) @ phoenix-core
---
[INFO] 
[INFO] -------------------------------------------------------
[INFO]  T E S T S
[INFO] -------------------------------------------------------
[INFO] 
[INFO] Results:
[INFO] 
[INFO] Tests run: 0, Failures: 0, Errors: 0, Skipped: 0
[INFO] 
[INFO] 
[INFO] --- maven-failsafe-plugin:2.20:integration-test (NeedTheirOwnClusterTests) @ phoenix-core
---
[INFO] 
[INFO] -------------------------------------------------------
[INFO]  T E S T S
[INFO] -------------------------------------------------------
[INFO] Running org.apache.hadoop.hbase.regionserver.wal.WALReplayWithIndexWritesAndCompressedWALIT
[INFO] Running org.apache.phoenix.end2end.ConnectionUtilIT
[INFO] Running org.apache.hadoop.hbase.regionserver.wal.WALRecoveryRegionPostOpenIT
[INFO] Tests run: 1, Failures: 0, Errors: 0, Skipped: 0, Time elapsed: 28.295 s - in org.apache.hadoop.hbase.regionserver.wal.WALReplayWithIndexWritesAndCompressedWALIT
[INFO] Tests run: 1, Failures: 0, Errors: 0, Skipped: 0, Time elapsed: 4.612 s - in org.apache.hadoop.hbase.regionserver.wal.WALRecoveryRegionPostOpenIT
[INFO] Running org.apache.phoenix.end2end.ArrayIT
[INFO] Running org.apache.phoenix.end2end.ConcurrentMutationsIT
[INFO] Running org.apache.phoenix.end2end.ContextClassloaderIT
[INFO] Tests run: 3, Failures: 0, Errors: 0, Skipped: 0, Time elapsed: 1.522 s - in org.apache.phoenix.end2end.ContextClassloaderIT
[INFO] Tests run: 1, Failures: 0, Errors: 0, Skipped: 0, Time elapsed: 26.268 s - in org.apache.phoenix.end2end.ConnectionUtilIT
[INFO] Running org.apache.phoenix.end2end.CountDistinctCompressionIT
[INFO] Tests run: 1, Failures: 0, Errors: 0, Skipped: 0, Time elapsed: 2.557 s - in org.apache.phoenix.end2end.CountDistinctCompressionIT
[INFO] Running org.apache.phoenix.end2end.CsvBulkLoadToolIT
[INFO] Running org.apache.phoenix.end2end.FlappingLocalIndexIT
[INFO] Running org.apache.phoenix.end2end.IndexToolForPartialBuildIT
[INFO] Running org.apache.phoenix.end2end.IndexExtendedIT
[ERROR] Tests run: 2, Failures: 2, Errors: 0, Skipped: 0, Time elapsed: 15.749 s <<<
FAILURE! - in org.apache.phoenix.end2end.IndexToolForPartialBuildIT
[ERROR] testSecondaryIndex[localIndex = false](org.apache.phoenix.end2end.IndexToolForPartialBuildIT)
 Time elapsed: 6.061 s  <<< FAILURE!
java.lang.AssertionError
	at org.apache.phoenix.end2end.IndexToolForPartialBuildIT.testSecondaryIndex(IndexToolForPartialBuildIT.java:203)

[ERROR] testSecondaryIndex[localIndex = true](org.apache.phoenix.end2end.IndexToolForPartialBuildIT)
 Time elapsed: 9.683 s  <<< FAILURE!
java.lang.AssertionError
	at org.apache.phoenix.end2end.IndexToolForPartialBuildIT.testSecondaryIndex(IndexToolForPartialBuildIT.java:203)

[INFO] Tests run: 11, Failures: 0, Errors: 0, Skipped: 0, Time elapsed: 75.395 s - in org.apache.phoenix.end2end.CsvBulkLoadToolIT
[INFO] Running org.apache.phoenix.end2end.IndexToolForPartialBuildWithNamespaceEnabledIT
[ERROR] Tests run: 2, Failures: 2, Errors: 0, Skipped: 0, Time elapsed: 15.503 s <<<
FAILURE! - in org.apache.phoenix.end2end.IndexToolForPartialBuildWithNamespaceEnabledIT
[ERROR] testSecondaryIndex[localIndex = false , isNamespaceEnabled = true](org.apache.phoenix.end2end.IndexToolForPartialBuildWithNamespaceEnabledIT)
 Time elapsed: 5.672 s  <<< FAILURE!
java.lang.AssertionError

[ERROR] testSecondaryIndex[localIndex = true , isNamespaceEnabled = false](org.apache.phoenix.end2end.IndexToolForPartialBuildWithNamespaceEnabledIT)
 Time elapsed: 9.828 s  <<< FAILURE!
java.lang.AssertionError

[INFO] Tests run: 8, Failures: 0, Errors: 0, Skipped: 0, Time elapsed: 78.097 s - in org.apache.phoenix.end2end.FlappingLocalIndexIT
[INFO] Running org.apache.phoenix.end2end.QueryWithLimitIT
[INFO] Running org.apache.phoenix.end2end.QueryTimeoutIT
[INFO] Tests run: 2, Failures: 0, Errors: 0, Skipped: 0, Time elapsed: 5.205 s - in org.apache.phoenix.end2end.QueryWithLimitIT
[INFO] Running org.apache.phoenix.end2end.RebuildIndexConnectionPropsIT
[INFO] Tests run: 1, Failures: 0, Errors: 0, Skipped: 0, Time elapsed: 0.54 s - in org.apache.phoenix.end2end.RebuildIndexConnectionPropsIT
[INFO] Tests run: 2, Failures: 0, Errors: 0, Skipped: 0, Time elapsed: 14.078 s - in org.apache.phoenix.end2end.QueryTimeoutIT
[INFO] Tests run: 80, Failures: 0, Errors: 0, Skipped: 0, Time elapsed: 185.906 s - in org.apache.phoenix.end2end.ArrayIT
[INFO] Running org.apache.phoenix.end2end.RegexBulkLoadToolIT
[INFO] Running org.apache.phoenix.end2end.RenewLeaseIT
[INFO] Running org.apache.phoenix.end2end.SpillableGroupByIT
[INFO] Running org.apache.phoenix.end2end.StatsCollectorIT
[INFO] Tests run: 2, Failures: 0, Errors: 0, Skipped: 0, Time elapsed: 7.738 s - in org.apache.phoenix.end2end.SpillableGroupByIT
[INFO] Tests run: 1, Failures: 0, Errors: 0, Skipped: 0, Time elapsed: 26.383 s - in org.apache.phoenix.end2end.RenewLeaseIT
[INFO] Tests run: 10, Failures: 0, Errors: 0, Skipped: 0, Time elapsed: 68.337 s - in org.apache.phoenix.end2end.RegexBulkLoadToolIT
[INFO] Running org.apache.phoenix.end2end.SysTableNamespaceMappedStatsCollectorIT
[INFO] Running org.apache.phoenix.end2end.UpdateCacheAcrossDifferentClientsIT
[INFO] Running org.apache.phoenix.end2end.UserDefinedFunctionsIT
[INFO] Tests run: 6, Failures: 0, Errors: 0, Skipped: 0, Time elapsed: 31.868 s - in org.apache.phoenix.end2end.UpdateCacheAcrossDifferentClientsIT
[INFO] Running org.apache.phoenix.end2end.index.ImmutableIndexIT
[INFO] Tests run: 14, Failures: 0, Errors: 0, Skipped: 0, Time elapsed: 55.331 s - in org.apache.phoenix.end2end.UserDefinedFunctionsIT
[INFO] Running org.apache.phoenix.end2end.index.LocalIndexIT
[INFO] Tests run: 140, Failures: 0, Errors: 0, Skipped: 0, Time elapsed: 492.871 s - in org.apache.phoenix.end2end.IndexExtendedIT
[INFO] Running org.apache.phoenix.end2end.index.MutableIndexFailureIT
[WARNING] Tests run: 1, Failures: 0, Errors: 0, Skipped: 1, Time elapsed: 0.002 s - in org.apache.phoenix.end2end.index.MutableIndexFailureIT
[INFO] Tests run: 30, Failures: 0, Errors: 0, Skipped: 0, Time elapsed: 576.618 s - in org.apache.phoenix.end2end.ConcurrentMutationsIT
[INFO] Running org.apache.phoenix.end2end.index.MutableIndexReplicationIT
[WARNING] Tests run: 132, Failures: 0, Errors: 0, Skipped: 24, Time elapsed: 378.514 s - in
org.apache.phoenix.end2end.StatsCollectorIT
[INFO] Running org.apache.phoenix.end2end.index.PartialIndexRebuilderIT
[INFO] Tests run: 1, Failures: 0, Errors: 0, Skipped: 0, Time elapsed: 24.084 s - in org.apache.phoenix.end2end.index.MutableIndexReplicationIT
[INFO] Tests run: 24, Failures: 0, Errors: 0, Skipped: 0, Time elapsed: 299.113 s - in org.apache.phoenix.end2end.index.ImmutableIndexIT
[WARNING] Tests run: 132, Failures: 0, Errors: 0, Skipped: 24, Time elapsed: 382.356 s - in
org.apache.phoenix.end2end.SysTableNamespaceMappedStatsCollectorIT
[INFO] Running org.apache.phoenix.end2end.index.txn.TxWriteFailureIT
[INFO] Running org.apache.phoenix.execute.PartialCommitIT
[INFO] Tests run: 12, Failures: 0, Errors: 0, Skipped: 0, Time elapsed: 0.802 s - in org.apache.phoenix.execute.PartialCommitIT
[INFO] Running org.apache.phoenix.hbase.index.FailForUnsupportedHBaseVersionsIT
[INFO] Running org.apache.phoenix.execute.UpsertSelectOverlappingBatchesIT
[INFO] Tests run: 32, Failures: 0, Errors: 0, Skipped: 0, Time elapsed: 291.116 s - in org.apache.phoenix.end2end.index.LocalIndexIT
[INFO] Running org.apache.phoenix.hbase.index.covered.EndToEndCoveredColumnsIndexBuilderIT
[INFO] Tests run: 2, Failures: 0, Errors: 0, Skipped: 0, Time elapsed: 19.049 s - in org.apache.phoenix.hbase.index.FailForUnsupportedHBaseVersionsIT
[INFO] Tests run: 2, Failures: 0, Errors: 0, Skipped: 0, Time elapsed: 11.849 s - in org.apache.phoenix.hbase.index.covered.EndToEndCoveredColumnsIndexBuilderIT
[INFO] Tests run: 8, Failures: 0, Errors: 0, Skipped: 0, Time elapsed: 56.964 s - in org.apache.phoenix.end2end.index.txn.TxWriteFailureIT
[INFO] Tests run: 1, Failures: 0, Errors: 0, Skipped: 0, Time elapsed: 23.622 s - in org.apache.phoenix.execute.UpsertSelectOverlappingBatchesIT
[INFO] Running org.apache.phoenix.hbase.index.covered.FailWithoutRetriesIT
[INFO] Tests run: 1, Failures: 0, Errors: 0, Skipped: 0, Time elapsed: 4.376 s - in org.apache.phoenix.hbase.index.covered.FailWithoutRetriesIT
[INFO] Running org.apache.phoenix.iterate.RoundRobinResultIteratorWithStatsIT
[INFO] Running org.apache.phoenix.rpc.PhoenixClientRpcIT
[INFO] Running org.apache.phoenix.iterate.ScannerLeaseRenewalIT
[INFO] Running org.apache.phoenix.monitoring.PhoenixMetricsIT
[INFO] Tests run: 1, Failures: 0, Errors: 0, Skipped: 0, Time elapsed: 8.431 s - in org.apache.phoenix.iterate.RoundRobinResultIteratorWithStatsIT
[INFO] Running org.apache.phoenix.rpc.PhoenixServerRpcIT
[INFO] Tests run: 2, Failures: 0, Errors: 0, Skipped: 0, Time elapsed: 12.233 s - in org.apache.phoenix.rpc.PhoenixClientRpcIT
[INFO] Tests run: 2, Failures: 0, Errors: 0, Skipped: 0, Time elapsed: 12.888 s - in org.apache.phoenix.rpc.PhoenixServerRpcIT
[INFO] Tests run: 22, Failures: 0, Errors: 0, Skipped: 0, Time elapsed: 63.699 s - in org.apache.phoenix.monitoring.PhoenixMetricsIT
[INFO] Tests run: 2, Failures: 0, Errors: 0, Skipped: 0, Time elapsed: 162.232 s - in org.apache.phoenix.iterate.ScannerLeaseRenewalIT
[ERROR] Tests run: 30, Failures: 4, Errors: 0, Skipped: 0, Time elapsed: 657.497 s <<<
FAILURE! - in org.apache.phoenix.end2end.index.PartialIndexRebuilderIT
[ERROR] testMultiValuesAtSameTS(org.apache.phoenix.end2end.index.PartialIndexRebuilderIT)
 Time elapsed: 65.145 s  <<< FAILURE!
java.lang.AssertionError
	at org.apache.phoenix.end2end.index.PartialIndexRebuilderIT.testMultiValuesAtSameTS(PartialIndexRebuilderIT.java:371)

[ERROR] testWriteWhileRebuilding(org.apache.phoenix.end2end.index.PartialIndexRebuilderIT)
 Time elapsed: 29.889 s  <<< FAILURE!
java.lang.AssertionError
	at org.apache.phoenix.end2end.index.PartialIndexRebuilderIT.testWriteWhileRebuilding(PartialIndexRebuilderIT.java:210)

[ERROR] testUpsertNullAfterFailure(org.apache.phoenix.end2end.index.PartialIndexRebuilderIT)
 Time elapsed: 64.741 s  <<< FAILURE!
java.lang.AssertionError
	at org.apache.phoenix.end2end.index.PartialIndexRebuilderIT.testUpsertNullAfterFailure(PartialIndexRebuilderIT.java:265)

[ERROR] testMultiVersionsAfterFailure(org.apache.phoenix.end2end.index.PartialIndexRebuilderIT)
 Time elapsed: 63.831 s  <<< FAILURE!
java.lang.AssertionError
	at org.apache.phoenix.end2end.index.PartialIndexRebuilderIT.testMultiVersionsAfterFailure(PartialIndexRebuilderIT.java:238)

[INFO] 
[INFO] Results:
[INFO] 
[ERROR] Failures: 
[ERROR]   IndexToolForPartialBuildIT.testSecondaryIndex:203
[ERROR]   IndexToolForPartialBuildIT.testSecondaryIndex:203
[ERROR]   IndexToolForPartialBuildWithNamespaceEnabledIT>IndexToolForPartialBuildIT.testSecondaryIndex:203
[ERROR]   IndexToolForPartialBuildWithNamespaceEnabledIT>IndexToolForPartialBuildIT.testSecondaryIndex:203
[ERROR]   PartialIndexRebuilderIT.testMultiValuesAtSameTS:371
[ERROR]   PartialIndexRebuilderIT.testMultiVersionsAfterFailure:238
[ERROR]   PartialIndexRebuilderIT.testUpsertNullAfterFailure:265
[ERROR]   PartialIndexRebuilderIT.testWriteWhileRebuilding:210
[INFO] 
[ERROR] Tests run: 725, Failures: 8, Errors: 0, Skipped: 49
[INFO] 
[INFO] 
[INFO] --- maven-failsafe-plugin:2.20:verify (ParallelStatsEnabledTest) @ phoenix-core ---
[INFO] ------------------------------------------------------------------------
[INFO] Reactor Summary:
[INFO] 
[INFO] Apache Phoenix ..................................... SUCCESS [  1.995 s]
[INFO] Phoenix Core ....................................... FAILURE [  01:55 h]
[INFO] Phoenix - Flume .................................... SKIPPED
[INFO] Phoenix - Kafka .................................... SKIPPED
[INFO] Phoenix - Pig ...................................... SKIPPED
[INFO] Phoenix Query Server Client ........................ SKIPPED
[INFO] Phoenix Query Server ............................... SKIPPED
[INFO] Phoenix - Pherf .................................... SKIPPED
[INFO] Phoenix - Spark .................................... SKIPPED
[INFO] Phoenix - Hive ..................................... SKIPPED
[INFO] Phoenix Client ..................................... SKIPPED
[INFO] Phoenix Server ..................................... SKIPPED
[INFO] Phoenix Assembly ................................... SKIPPED
[INFO] Phoenix - Tracing Web Application .................. SKIPPED
[INFO] ------------------------------------------------------------------------
[INFO] BUILD FAILURE
[INFO] ------------------------------------------------------------------------
[INFO] Total time: 01:55 h
[INFO] Finished at: 2017-08-18T21:20:43Z
[INFO] Final Memory: 60M/1401M
[INFO] ------------------------------------------------------------------------
[ERROR] Failed to execute goal org.apache.maven.plugins:maven-failsafe-plugin:2.20:verify
(ParallelStatsEnabledTest) on project phoenix-core: There are test failures.
[ERROR] 
[ERROR] Please refer to <https://builds.apache.org/job/Phoenix-4.x-HBase-1.1/ws/phoenix-core/target/failsafe-reports>
for the individual test results.
[ERROR] Please refer to dump files (if any exist) [date]-jvmRun[N].dump, [date].dumpstream
and [date]-jvmRun[N].dumpstream.
[ERROR] org.apache.maven.surefire.booter.SurefireBooterForkException: ExecutionException The
forked VM terminated without properly saying goodbye. VM crash or System.exit called?
[ERROR] Command was /bin/sh -c cd <https://builds.apache.org/job/Phoenix-4.x-HBase-1.1/ws/phoenix-core>
&& /usr/local/asfpackages/java/jdk1.7.0_80/jre/bin/java -enableassertions -Xmx3000m
-XX:MaxPermSize=300m -Djava.security.egd=file:/dev/./urandom '-Djava.library.path=${hadoop.library.path}:/usr/java/packages/lib/amd64:/usr/lib64:/lib64:/lib:/usr/lib'
-XX:+HeapDumpOnOutOfMemoryError -XX:HeapDumpPath=./target/ -jar <https://builds.apache.org/job/Phoenix-4.x-HBase-1.1/532/artifact/phoenix-core/target/surefire/surefirebooter418341197577649363.jar>
<https://builds.apache.org/job/Phoenix-4.x-HBase-1.1/ws/phoenix-core/target/surefire>
2017-08-18T19-26-33_470-jvmRun3 surefire8106372068023748633tmp surefire_988991906479305929869tmp
[ERROR] Process Exit Code: 0
[ERROR] 	at org.apache.maven.plugin.surefire.booterclient.ForkStarter.awaitResultsDone(ForkStarter.java:494)
[ERROR] 	at org.apache.maven.plugin.surefire.booterclient.ForkStarter.runSuitesForkPerTestSet(ForkStarter.java:441)
[ERROR] 	at org.apache.maven.plugin.surefire.booterclient.ForkStarter.run(ForkStarter.java:292)
[ERROR] 	at org.apache.maven.plugin.surefire.booterclient.ForkStarter.run(ForkStarter.java:243)
[ERROR] 	at org.apache.maven.plugin.surefire.AbstractSurefireMojo.executeProvider(AbstractSurefireMojo.java:1077)
[ERROR] 	at org.apache.maven.plugin.surefire.AbstractSurefireMojo.executeAfterPreconditionsChecked(AbstractSurefireMojo.java:907)
[ERROR] 	at org.apache.maven.plugin.surefire.AbstractSurefireMojo.execute(AbstractSurefireMojo.java:785)
[ERROR] 	at org.apache.maven.plugin.DefaultBuildPluginManager.executeMojo(DefaultBuildPluginManager.java:134)
[ERROR] 	at org.apache.maven.lifecycle.internal.MojoExecutor.execute(MojoExecutor.java:208)
[ERROR] 	at org.apache.maven.lifecycle.internal.MojoExecutor.execute(MojoExecutor.java:154)
[ERROR] 	at org.apache.maven.lifecycle.internal.MojoExecutor.execute(MojoExecutor.java:146)
[ERROR] 	at org.apache.maven.lifecycle.internal.LifecycleModuleBuilder.buildProject(LifecycleModuleBuilder.java:117)
[ERROR] 	at org.apache.maven.lifecycle.internal.LifecycleModuleBuilder.buildProject(LifecycleModuleBuilder.java:81)
[ERROR] 	at org.apache.maven.lifecycle.internal.builder.singlethreaded.SingleThreadedBuilder.build(SingleThreadedBuilder.java:51)
[ERROR] 	at org.apache.maven.lifecycle.internal.LifecycleStarter.execute(LifecycleStarter.java:128)
[ERROR] 	at org.apache.maven.DefaultMaven.doExecute(DefaultMaven.java:309)
[ERROR] 	at org.apache.maven.DefaultMaven.doExecute(DefaultMaven.java:194)
[ERROR] 	at org.apache.maven.DefaultMaven.execute(DefaultMaven.java:107)
[ERROR] 	at org.apache.maven.cli.MavenCli.execute(MavenCli.java:993)
[ERROR] 	at org.apache.maven.cli.MavenCli.doMain(MavenCli.java:345)
[ERROR] 	at org.apache.maven.cli.MavenCli.main(MavenCli.java:191)
[ERROR] 	at sun.reflect.NativeMethodAccessorImpl.invoke0(Native Method)
[ERROR] 	at sun.reflect.NativeMethodAccessorImpl.invoke(NativeMethodAccessorImpl.java:57)
[ERROR] 	at sun.reflect.DelegatingMethodAccessorImpl.invoke(DelegatingMethodAccessorImpl.java:43)
[ERROR] 	at java.lang.reflect.Method.invoke(Method.java:606)
[ERROR] 	at org.codehaus.plexus.classworlds.launcher.Launcher.launchEnhanced(Launcher.java:289)
[ERROR] 	at org.codehaus.plexus.classworlds.launcher.Launcher.launch(Launcher.java:229)
[ERROR] 	at org.codehaus.plexus.classworlds.launcher.Launcher.mainWithExitCode(Launcher.java:415)
[ERROR] 	at org.codehaus.plexus.classworlds.launcher.Launcher.main(Launcher.java:356)
[ERROR] Caused by: org.apache.maven.surefire.booter.SurefireBooterForkException: The forked
VM terminated without properly saying goodbye. VM crash or System.exit called?
[ERROR] Command was /bin/sh -c cd <https://builds.apache.org/job/Phoenix-4.x-HBase-1.1/ws/phoenix-core>
&& /usr/local/asfpackages/java/jdk1.7.0_80/jre/bin/java -enableassertions -Xmx3000m
-XX:MaxPermSize=300m -Djava.security.egd=file:/dev/./urandom '-Djava.library.path=${hadoop.library.path}:/usr/java/packages/lib/amd64:/usr/lib64:/lib64:/lib:/usr/lib'
-XX:+HeapDumpOnOutOfMemoryError -XX:HeapDumpPath=./target/ -jar <https://builds.apache.org/job/Phoenix-4.x-HBase-1.1/532/artifact/phoenix-core/target/surefire/surefirebooter418341197577649363.jar>
<https://builds.apache.org/job/Phoenix-4.x-HBase-1.1/ws/phoenix-core/target/surefire>
2017-08-18T19-26-33_470-jvmRun3 surefire8106372068023748633tmp surefire_988991906479305929869tmp
[ERROR] Process Exit Code: 0
[ERROR] 	at org.apache.maven.plugin.surefire.booterclient.ForkStarter.fork(ForkStarter.java:679)
[ERROR] 	at org.apache.maven.plugin.surefire.booterclient.ForkStarter.fork(ForkStarter.java:533)
[ERROR] 	at org.apache.maven.plugin.surefire.booterclient.ForkStarter.access$600(ForkStarter.java:117)
[ERROR] 	at org.apache.maven.plugin.surefire.booterclient.ForkStarter$2.call(ForkStarter.java:429)
[ERROR] 	at org.apache.maven.plugin.surefire.booterclient.ForkStarter$2.call(ForkStarter.java:406)
[ERROR] 	at java.util.concurrent.FutureTask.run(FutureTask.java:262)
[ERROR] 	at java.util.concurrent.ThreadPoolExecutor.runWorker(ThreadPoolExecutor.java:1145)
[ERROR] 	at java.util.concurrent.ThreadPoolExecutor$Worker.run(ThreadPoolExecutor.java:615)
[ERROR] 	at java.lang.Thread.run(Thread.java:745)
[ERROR] 
[ERROR] -> [Help 1]
[ERROR] 
[ERROR] To see the full stack trace of the errors, re-run Maven with the -e switch.
[ERROR] Re-run Maven using the -X switch to enable full debug logging.
[ERROR] 
[ERROR] For more information about the errors and possible solutions, please read the following
articles:
[ERROR] [Help 1] http://cwiki.apache.org/confluence/display/MAVEN/MojoExecutionException
[ERROR] 
[ERROR] After correcting the problems, you can resume the build with the command
[ERROR]   mvn <goals> -rf :phoenix-core
Build step 'Invoke top-level Maven targets' marked build as failure
Archiving artifacts
[Fast Archiver] Compressed -1150449433 B of artifacts by 163.5% relative to #527
Recording test results

Mime
View raw message