phoenix-commits mailing list archives

Site index · List index
Message view « Date » · « Thread »
Top « Date » · « Thread »
From Apache Jenkins Server <jenk...@builds.apache.org>
Subject Build failed in Jenkins: Phoenix-4.x-HBase-1.1 #541
Date Wed, 23 Aug 2017 08:57:43 GMT
See <https://builds.apache.org/job/Phoenix-4.x-HBase-1.1/541/display/redirect?page=changes>

Changes:

[chenglei] PHOENIX-4094 ParallelWriterIndexCommitter incorrectly applys local

------------------------------------------
[...truncated 63.50 KB...]
[INFO] Running org.apache.phoenix.hbase.index.write.TestWALRecoveryCaching
[WARNING] Tests run: 1, Failures: 0, Errors: 0, Skipped: 1, Time elapsed: 0 s - in org.apache.phoenix.hbase.index.write.TestWALRecoveryCaching
[INFO] Running org.apache.phoenix.hbase.index.write.TestParalleIndexWriter
[INFO] Tests run: 2, Failures: 0, Errors: 0, Skipped: 0, Time elapsed: 0.114 s - in org.apache.phoenix.hbase.index.write.TestParalleIndexWriter
[INFO] Running org.apache.phoenix.hbase.index.write.TestParalleWriterIndexCommitter
[INFO] Tests run: 2, Failures: 0, Errors: 0, Skipped: 0, Time elapsed: 0.068 s - in org.apache.phoenix.hbase.index.write.TestParalleWriterIndexCommitter
[INFO] Running org.apache.phoenix.hbase.index.write.recovery.TestPerRegionIndexWriteCache
[INFO] Tests run: 158, Failures: 0, Errors: 0, Skipped: 0, Time elapsed: 16.928 s - in org.apache.phoenix.compile.QueryCompilerTest
[INFO] Running org.apache.phoenix.hbase.index.parallel.TestThreadPoolBuilder
[INFO] Tests run: 2, Failures: 0, Errors: 0, Skipped: 0, Time elapsed: 0.001 s - in org.apache.phoenix.hbase.index.parallel.TestThreadPoolBuilder
[INFO] Running org.apache.phoenix.hbase.index.parallel.TestThreadPoolManager
[INFO] Tests run: 3, Failures: 0, Errors: 0, Skipped: 0, Time elapsed: 0.01 s - in org.apache.phoenix.hbase.index.parallel.TestThreadPoolManager
[INFO] Running org.apache.phoenix.index.IndexMaintainerTest
[INFO] Tests run: 1, Failures: 0, Errors: 0, Skipped: 0, Time elapsed: 4.942 s - in org.apache.phoenix.expression.RegexpSplitFunctionTest
[INFO] Running org.apache.phoenix.index.automated.MRJobSubmitterTest
[INFO] Tests run: 5, Failures: 0, Errors: 0, Skipped: 0, Time elapsed: 1.266 s - in org.apache.phoenix.index.automated.MRJobSubmitterTest
[INFO] Tests run: 3, Failures: 0, Errors: 0, Skipped: 0, Time elapsed: 2.118 s - in org.apache.phoenix.hbase.index.write.recovery.TestPerRegionIndexWriteCache
[INFO] Tests run: 2, Failures: 0, Errors: 0, Skipped: 0, Time elapsed: 7.154 s - in org.apache.phoenix.expression.GetSetByteBitFunctionTest
[INFO] Tests run: 3, Failures: 0, Errors: 0, Skipped: 0, Time elapsed: 5.117 s - in org.apache.phoenix.hbase.index.covered.NonTxIndexBuilderTest
[INFO] Tests run: 24, Failures: 0, Errors: 0, Skipped: 0, Time elapsed: 2.921 s - in org.apache.phoenix.index.IndexMaintainerTest
[INFO] Tests run: 8, Failures: 0, Errors: 0, Skipped: 0, Time elapsed: 32.132 s - in org.apache.phoenix.jdbc.SecureUserConnectionsTest
[INFO] 
[INFO] Results:
[INFO] 
[WARNING] Tests run: 1529, Failures: 0, Errors: 0, Skipped: 6
[INFO] 
[INFO] 
[INFO] --- maven-source-plugin:2.2.1:jar-no-fork (attach-sources) @ phoenix-core ---
[INFO] Building jar: <https://builds.apache.org/job/Phoenix-4.x-HBase-1.1/541/artifact/phoenix-core/target/phoenix-core-4.12.0-HBase-1.1-SNAPSHOT-sources.jar>
[INFO] 
[INFO] --- maven-jar-plugin:2.4:test-jar (default) @ phoenix-core ---
[INFO] Building jar: <https://builds.apache.org/job/Phoenix-4.x-HBase-1.1/541/artifact/phoenix-core/target/phoenix-core-4.12.0-HBase-1.1-SNAPSHOT-tests.jar>
[INFO] 
[INFO] --- maven-jar-plugin:2.4:jar (default-jar) @ phoenix-core ---
[INFO] Building jar: <https://builds.apache.org/job/Phoenix-4.x-HBase-1.1/541/artifact/phoenix-core/target/phoenix-core-4.12.0-HBase-1.1-SNAPSHOT.jar>
[INFO] 
[INFO] --- maven-site-plugin:3.2:attach-descriptor (attach-descriptor) @ phoenix-core ---
[INFO] 
[INFO] --- maven-assembly-plugin:2.5.2:single (core) @ phoenix-core ---
[INFO] Reading assembly descriptor: src/build/phoenix-core.xml
[WARNING] Artifact: org.apache.phoenix:phoenix-core:jar:4.12.0-HBase-1.1-SNAPSHOT references
the same file as the assembly destination file. Moving it to a temporary location for inclusion.
[INFO] Building jar: <https://builds.apache.org/job/Phoenix-4.x-HBase-1.1/541/artifact/phoenix-core/target/phoenix-core-4.12.0-HBase-1.1-SNAPSHOT.jar>
[INFO] 
[INFO] --- maven-failsafe-plugin:2.20:integration-test (ParallelStatsEnabledTest) @ phoenix-core
---
[INFO] 
[INFO] -------------------------------------------------------
[INFO]  T E S T S
[INFO] -------------------------------------------------------
[INFO] Running org.apache.phoenix.end2end.KeyOnlyIT
[INFO] Running org.apache.phoenix.end2end.QueryWithTableSampleIT
[INFO] Running org.apache.phoenix.coprocessor.StatisticsCollectionRunTrackerIT
[INFO] Running org.apache.phoenix.end2end.MultiCfQueryExecIT
[INFO] Running org.apache.phoenix.end2end.ParallelIteratorsIT
[INFO] Running org.apache.phoenix.end2end.ExplainPlanWithStatsEnabledIT
[INFO] Tests run: 13, Failures: 0, Errors: 0, Skipped: 0, Time elapsed: 3.727 s - in org.apache.phoenix.end2end.ExplainPlanWithStatsEnabledIT
[INFO] Running org.apache.phoenix.end2end.SaltedViewIT
[INFO] Tests run: 3, Failures: 0, Errors: 0, Skipped: 0, Time elapsed: 15.464 s - in org.apache.phoenix.end2end.KeyOnlyIT
[INFO] Running org.apache.phoenix.end2end.TenantSpecificTablesDDLIT
[INFO] Tests run: 3, Failures: 0, Errors: 0, Skipped: 0, Time elapsed: 18.162 s - in org.apache.phoenix.end2end.ParallelIteratorsIT
[INFO] Running org.apache.phoenix.end2end.TenantSpecificTablesDMLIT
[INFO] Tests run: 4, Failures: 0, Errors: 0, Skipped: 0, Time elapsed: 22.567 s - in org.apache.phoenix.coprocessor.StatisticsCollectionRunTrackerIT
[INFO] Running org.apache.phoenix.end2end.TransactionalViewIT
[INFO] Tests run: 2, Failures: 0, Errors: 0, Skipped: 0, Time elapsed: 5.521 s - in org.apache.phoenix.end2end.TransactionalViewIT
[INFO] Running org.apache.phoenix.end2end.ViewIT
[INFO] Tests run: 10, Failures: 0, Errors: 0, Skipped: 0, Time elapsed: 35.169 s - in org.apache.phoenix.end2end.MultiCfQueryExecIT
[INFO] Running org.apache.phoenix.end2end.index.ImmutableIndexWithStatsIT
[INFO] Tests run: 1, Failures: 0, Errors: 0, Skipped: 0, Time elapsed: 4.033 s - in org.apache.phoenix.end2end.index.ImmutableIndexWithStatsIT
[INFO] Tests run: 4, Failures: 0, Errors: 0, Skipped: 0, Time elapsed: 36.552 s - in org.apache.phoenix.end2end.SaltedViewIT
[INFO] Tests run: 12, Failures: 0, Errors: 0, Skipped: 0, Time elapsed: 54.962 s - in org.apache.phoenix.end2end.QueryWithTableSampleIT
[INFO] Tests run: 16, Failures: 0, Errors: 0, Skipped: 0, Time elapsed: 116.841 s - in org.apache.phoenix.end2end.TenantSpecificTablesDDLIT
[INFO] Tests run: 16, Failures: 0, Errors: 0, Skipped: 0, Time elapsed: 114.782 s - in org.apache.phoenix.end2end.TenantSpecificTablesDMLIT
[INFO] Tests run: 50, Failures: 0, Errors: 0, Skipped: 0, Time elapsed: 216.964 s - in org.apache.phoenix.end2end.ViewIT
[INFO] 
[INFO] Results:
[INFO] 
[INFO] Tests run: 134, Failures: 0, Errors: 0, Skipped: 0
[INFO] 
[INFO] 
[INFO] --- maven-failsafe-plugin:2.20:integration-test (ParallelStatsDisabledTest) @ phoenix-core
---
[INFO] 
[INFO] -------------------------------------------------------
[INFO]  T E S T S
[INFO] -------------------------------------------------------
[INFO] Running org.apache.phoenix.end2end.AlterMultiTenantTableWithViewsIT
[INFO] Running org.apache.phoenix.end2end.AbsFunctionEnd2EndIT
[INFO] Running org.apache.phoenix.end2end.AlterTableIT
[INFO] Running org.apache.phoenix.end2end.AggregateIT
[INFO] Running org.apache.phoenix.end2end.AlterSessionIT
[INFO] Tests run: 1, Failures: 0, Errors: 0, Skipped: 0, Time elapsed: 4.343 s - in org.apache.phoenix.end2end.AbsFunctionEnd2EndIT
[INFO] Running org.apache.phoenix.end2end.AlterTableWithViewsIT
[INFO] Tests run: 2, Failures: 0, Errors: 0, Skipped: 0, Time elapsed: 7.66 s - in org.apache.phoenix.end2end.AlterSessionIT
[INFO] Running org.apache.phoenix.end2end.AppendOnlySchemaIT
[INFO] Running org.apache.phoenix.end2end.AggregateQueryIT
[INFO] Tests run: 8, Failures: 0, Errors: 0, Skipped: 0, Time elapsed: 32.984 s - in org.apache.phoenix.end2end.AppendOnlySchemaIT
[INFO] Running org.apache.phoenix.end2end.ArithmeticQueryIT
[INFO] Tests run: 19, Failures: 0, Errors: 0, Skipped: 0, Time elapsed: 84.399 s - in org.apache.phoenix.end2end.AggregateIT
[INFO] Running org.apache.phoenix.end2end.ArrayAppendFunctionIT
[INFO] Tests run: 26, Failures: 0, Errors: 0, Skipped: 0, Time elapsed: 66.224 s - in org.apache.phoenix.end2end.ArithmeticQueryIT
[INFO] Tests run: 9, Failures: 0, Errors: 0, Skipped: 0, Time elapsed: 113.564 s - in org.apache.phoenix.end2end.AlterMultiTenantTableWithViewsIT
[INFO] Running org.apache.phoenix.end2end.ArrayConcatFunctionIT
[INFO] Running org.apache.phoenix.end2end.ArrayFillFunctionIT
[INFO] Tests run: 35, Failures: 0, Errors: 0, Skipped: 0, Time elapsed: 81.042 s - in org.apache.phoenix.end2end.ArrayAppendFunctionIT
[INFO] Tests run: 31, Failures: 0, Errors: 0, Skipped: 0, Time elapsed: 75.227 s - in org.apache.phoenix.end2end.ArrayConcatFunctionIT
[INFO] Running org.apache.phoenix.end2end.ArrayPrependFunctionIT
[INFO] Tests run: 26, Failures: 0, Errors: 0, Skipped: 0, Time elapsed: 74.38 s - in org.apache.phoenix.end2end.ArrayFillFunctionIT
[INFO] Running org.apache.phoenix.end2end.ArrayToStringFunctionIT
[INFO] Running org.apache.phoenix.end2end.ArraysWithNullsIT
[INFO] Tests run: 16, Failures: 0, Errors: 0, Skipped: 0, Time elapsed: 31.675 s - in org.apache.phoenix.end2end.ArraysWithNullsIT
[INFO] Running org.apache.phoenix.end2end.AutoCommitIT
[INFO] Tests run: 34, Failures: 0, Errors: 0, Skipped: 0, Time elapsed: 74.534 s - in org.apache.phoenix.end2end.ArrayPrependFunctionIT
[INFO] Tests run: 1, Failures: 0, Errors: 0, Skipped: 0, Time elapsed: 2.548 s - in org.apache.phoenix.end2end.AutoCommitIT
[INFO] Running org.apache.phoenix.end2end.AutoPartitionViewsIT
[INFO] Running org.apache.phoenix.end2end.BinaryRowKeyIT
[INFO] Tests run: 3, Failures: 0, Errors: 0, Skipped: 0, Time elapsed: 6.189 s - in org.apache.phoenix.end2end.BinaryRowKeyIT
[INFO] Running org.apache.phoenix.end2end.CSVCommonsLoaderIT
[INFO] Tests run: 42, Failures: 0, Errors: 0, Skipped: 0, Time elapsed: 322.06 s - in org.apache.phoenix.end2end.AggregateQueryIT
[INFO] Tests run: 36, Failures: 0, Errors: 0, Skipped: 0, Time elapsed: 107.628 s - in org.apache.phoenix.end2end.ArrayToStringFunctionIT
[INFO] Tests run: 16, Failures: 0, Errors: 0, Skipped: 0, Time elapsed: 38.832 s - in org.apache.phoenix.end2end.CSVCommonsLoaderIT
[INFO] Running org.apache.phoenix.end2end.CbrtFunctionEnd2EndIT
[INFO] Tests run: 12, Failures: 0, Errors: 0, Skipped: 0, Time elapsed: 77.638 s - in org.apache.phoenix.end2end.AutoPartitionViewsIT
[INFO] Tests run: 2, Failures: 0, Errors: 0, Skipped: 0, Time elapsed: 7.597 s - in org.apache.phoenix.end2end.CbrtFunctionEnd2EndIT
[INFO] Running org.apache.phoenix.end2end.CaseStatementIT
[INFO] Running org.apache.phoenix.end2end.CastAndCoerceIT
[INFO] Running org.apache.phoenix.end2end.CoalesceFunctionIT
[INFO] Running org.apache.phoenix.end2end.ClientTimeArithmeticQueryIT
[INFO] Tests run: 12, Failures: 0, Errors: 0, Skipped: 0, Time elapsed: 26.421 s - in org.apache.phoenix.end2end.CoalesceFunctionIT
[INFO] Running org.apache.phoenix.end2end.ColumnEncodedBytesPropIT
[INFO] Tests run: 2, Failures: 0, Errors: 0, Skipped: 0, Time elapsed: 6.608 s - in org.apache.phoenix.end2end.ColumnEncodedBytesPropIT
[INFO] Running org.apache.phoenix.end2end.ColumnProjectionOptimizationIT
[INFO] Tests run: 3, Failures: 0, Errors: 0, Skipped: 0, Time elapsed: 17.874 s - in org.apache.phoenix.end2end.ColumnProjectionOptimizationIT
[INFO] Running org.apache.phoenix.end2end.ConcurrentMutationsIT
[INFO] Tests run: 48, Failures: 0, Errors: 0, Skipped: 0, Time elapsed: 641.546 s - in org.apache.phoenix.end2end.AlterTableWithViewsIT
[INFO] Running org.apache.phoenix.end2end.ConvertTimezoneFunctionIT
[INFO] Tests run: 8, Failures: 0, Errors: 0, Skipped: 0, Time elapsed: 25.587 s - in org.apache.phoenix.end2end.ConvertTimezoneFunctionIT
[INFO] Running org.apache.phoenix.end2end.CursorWithRowValueConstructorIT
[INFO] Tests run: 49, Failures: 0, Errors: 0, Skipped: 0, Time elapsed: 372.529 s - in org.apache.phoenix.end2end.CastAndCoerceIT
[INFO] Tests run: 17, Failures: 0, Errors: 0, Skipped: 0, Time elapsed: 88.002 s - in org.apache.phoenix.end2end.CursorWithRowValueConstructorIT
[INFO] Running org.apache.phoenix.end2end.DateTimeIT
[INFO] Tests run: 56, Failures: 0, Errors: 0, Skipped: 0, Time elapsed: 439.412 s - in org.apache.phoenix.end2end.CaseStatementIT
[ERROR] Tests run: 15, Failures: 2, Errors: 0, Skipped: 9, Time elapsed: 368.238 s <<<
FAILURE! - in org.apache.phoenix.end2end.ConcurrentMutationsIT
[ERROR] testConcurrentUpserts-1(org.apache.phoenix.end2end.ConcurrentMutationsIT)  Time elapsed:
123.832 s  <<< FAILURE!
java.lang.AssertionError: Ran out of time
	at org.apache.phoenix.end2end.ConcurrentMutationsIT.testConcurrentUpserts(ConcurrentMutationsIT.java:271)

[ERROR] testConcurrentUpserts [10 times]  Time elapsed: 129.827 s  <<< FAILURE!
java.lang.AssertionError: Ran out of time

[INFO] Running org.apache.phoenix.end2end.DecodeFunctionIT
[INFO] Tests run: 6, Failures: 0, Errors: 0, Skipped: 0, Time elapsed: 9.704 s - in org.apache.phoenix.end2end.DecodeFunctionIT
[INFO] Running org.apache.phoenix.end2end.DisableLocalIndexIT
[INFO] Tests run: 1, Failures: 0, Errors: 0, Skipped: 0, Time elapsed: 3.849 s - in org.apache.phoenix.end2end.DisableLocalIndexIT
[INFO] Running org.apache.phoenix.end2end.DistinctPrefixFilterIT
[INFO] Running org.apache.phoenix.end2end.DeleteIT
[INFO] Running org.apache.phoenix.end2end.DefaultColumnValueIT
[INFO] Tests run: 24, Failures: 0, Errors: 0, Skipped: 0, Time elapsed: 67.148 s - in org.apache.phoenix.end2end.DefaultColumnValueIT
[INFO] Tests run: 124, Failures: 0, Errors: 0, Skipped: 0, Time elapsed: 939.23 s - in org.apache.phoenix.end2end.AlterTableIT
[INFO] Running org.apache.phoenix.end2end.DynamicColumnIT
[INFO] Tests run: 25, Failures: 0, Errors: 0, Skipped: 0, Time elapsed: 116.957 s - in org.apache.phoenix.end2end.DeleteIT
[INFO] Tests run: 49, Failures: 0, Errors: 0, Skipped: 0, Time elapsed: 170.208 s - in org.apache.phoenix.end2end.DateTimeIT
[INFO] Running org.apache.phoenix.end2end.DynamicFamilyIT
[INFO] Tests run: 4, Failures: 0, Errors: 0, Skipped: 0, Time elapsed: 4.741 s - in org.apache.phoenix.end2end.DynamicFamilyIT
[INFO] Running org.apache.phoenix.end2end.EvaluationOfORIT
[INFO] Tests run: 2, Failures: 0, Errors: 0, Skipped: 0, Time elapsed: 2.555 s - in org.apache.phoenix.end2end.EvaluationOfORIT
[INFO] Running org.apache.phoenix.end2end.ExecuteStatementsIT
[INFO] Running org.apache.phoenix.end2end.DynamicUpsertIT
[INFO] Tests run: 6, Failures: 0, Errors: 0, Skipped: 0, Time elapsed: 48.613 s - in org.apache.phoenix.end2end.DynamicColumnIT
[INFO] Running org.apache.phoenix.end2end.ExpFunctionEnd2EndIT
[INFO] Running org.apache.phoenix.end2end.EncodeFunctionIT
[INFO] Tests run: 2, Failures: 0, Errors: 0, Skipped: 0, Time elapsed: 23.726 s - in org.apache.phoenix.end2end.ExecuteStatementsIT
[INFO] Tests run: 5, Failures: 0, Errors: 0, Skipped: 0, Time elapsed: 177.953 s - in org.apache.phoenix.end2end.DistinctPrefixFilterIT
[INFO] Running org.apache.phoenix.end2end.FirstValueFunctionIT
[INFO] Running org.apache.phoenix.end2end.ExplainPlanWithStatsDisabledIT
[INFO] Tests run: 12, Failures: 0, Errors: 0, Skipped: 0, Time elapsed: 0.147 s - in org.apache.phoenix.end2end.ExplainPlanWithStatsDisabledIT
[INFO] Running org.apache.phoenix.end2end.FirstValuesFunctionIT
[INFO] Tests run: 7, Failures: 0, Errors: 0, Skipped: 0, Time elapsed: 16.522 s - in org.apache.phoenix.end2end.DynamicUpsertIT
[INFO] Running org.apache.phoenix.end2end.FlappingAlterTableIT
[INFO] Tests run: 1, Failures: 0, Errors: 0, Skipped: 0, Time elapsed: 1.321 s - in org.apache.phoenix.end2end.FirstValuesFunctionIT
[INFO] Tests run: 3, Failures: 0, Errors: 0, Skipped: 0, Time elapsed: 16.809 s - in org.apache.phoenix.end2end.ExpFunctionEnd2EndIT
[INFO] Running org.apache.phoenix.end2end.GetSetByteBitFunctionEnd2EndIT
[INFO] Tests run: 1, Failures: 0, Errors: 0, Skipped: 0, Time elapsed: 1.353 s - in org.apache.phoenix.end2end.GetSetByteBitFunctionEnd2EndIT
[INFO] Running org.apache.phoenix.end2end.GroupByIT
[INFO] Tests run: 7, Failures: 0, Errors: 0, Skipped: 0, Time elapsed: 18.237 s - in org.apache.phoenix.end2end.EncodeFunctionIT
[INFO] Running org.apache.phoenix.end2end.HashJoinIT
[INFO] Tests run: 7, Failures: 0, Errors: 0, Skipped: 0, Time elapsed: 11.348 s - in org.apache.phoenix.end2end.FirstValueFunctionIT
[INFO] Running org.apache.phoenix.end2end.HashJoinMoreIT
[INFO] Tests run: 2, Failures: 0, Errors: 0, Skipped: 0, Time elapsed: 21.403 s - in org.apache.phoenix.end2end.FlappingAlterTableIT
[INFO] Running org.apache.phoenix.end2end.ImmutableTablePropertiesIT
[INFO] Tests run: 5, Failures: 0, Errors: 0, Skipped: 0, Time elapsed: 9.749 s - in org.apache.phoenix.end2end.ImmutableTablePropertiesIT
[INFO] Running org.apache.phoenix.end2end.InListIT
[INFO] Running org.apache.phoenix.end2end.HashJoinLocalIndexIT
[INFO] Tests run: 1, Failures: 0, Errors: 0, Skipped: 0, Time elapsed: 17.4 s - in org.apache.phoenix.end2end.HashJoinLocalIndexIT
[INFO] Running org.apache.phoenix.end2end.InstrFunctionIT
[INFO] Tests run: 8, Failures: 0, Errors: 0, Skipped: 0, Time elapsed: 47.452 s - in org.apache.phoenix.end2end.HashJoinMoreIT
[INFO] Tests run: 8, Failures: 0, Errors: 0, Skipped: 0, Time elapsed: 18.033 s - in org.apache.phoenix.end2end.InstrFunctionIT
[INFO] Running org.apache.phoenix.end2end.LastValueFunctionIT
[INFO] Tests run: 11, Failures: 0, Errors: 0, Skipped: 0, Time elapsed: 20.193 s - in org.apache.phoenix.end2end.LastValueFunctionIT
[INFO] Running org.apache.phoenix.end2end.LastValuesFunctionIT
[INFO] Running org.apache.phoenix.end2end.IsNullIT
[INFO] Tests run: 3, Failures: 0, Errors: 0, Skipped: 0, Time elapsed: 3.981 s - in org.apache.phoenix.end2end.IsNullIT
[INFO] Running org.apache.phoenix.end2end.LikeExpressionIT
[INFO] Tests run: 18, Failures: 0, Errors: 0, Skipped: 0, Time elapsed: 27.152 s - in org.apache.phoenix.end2end.LastValuesFunctionIT
[INFO] Tests run: 8, Failures: 0, Errors: 0, Skipped: 0, Time elapsed: 28.251 s - in org.apache.phoenix.end2end.LikeExpressionIT
[INFO] Running org.apache.phoenix.end2end.LnLogFunctionEnd2EndIT
[INFO] Tests run: 1, Failures: 0, Errors: 0, Skipped: 0, Time elapsed: 5.212 s - in org.apache.phoenix.end2end.LnLogFunctionEnd2EndIT
[INFO] Running org.apache.phoenix.end2end.MapReduceIT
[INFO] Tests run: 2, Failures: 0, Errors: 0, Skipped: 0, Time elapsed: 14.792 s - in org.apache.phoenix.end2end.MapReduceIT
[INFO] Running org.apache.phoenix.end2end.MappingTableDataTypeIT
[INFO] Running org.apache.phoenix.end2end.MD5FunctionIT
[INFO] Tests run: 1, Failures: 0, Errors: 0, Skipped: 0, Time elapsed: 7.915 s - in org.apache.phoenix.end2end.MappingTableDataTypeIT
[INFO] Running org.apache.phoenix.end2end.MinMaxAggregateFunctionIT
[INFO] Tests run: 1, Failures: 0, Errors: 0, Skipped: 0, Time elapsed: 2.414 s - in org.apache.phoenix.end2end.MinMaxAggregateFunctionIT
[INFO] Running org.apache.phoenix.end2end.ModulusExpressionIT
[INFO] Tests run: 3, Failures: 0, Errors: 0, Skipped: 0, Time elapsed: 5.043 s - in org.apache.phoenix.end2end.MD5FunctionIT
[INFO] Running org.apache.phoenix.end2end.MutableQueryIT
[INFO] Tests run: 11, Failures: 0, Errors: 0, Skipped: 0, Time elapsed: 18.1 s - in org.apache.phoenix.end2end.ModulusExpressionIT
[INFO] Running org.apache.phoenix.end2end.NamespaceSchemaMappingIT
[INFO] Tests run: 1, Failures: 0, Errors: 0, Skipped: 0, Time elapsed: 14.417 s - in org.apache.phoenix.end2end.NamespaceSchemaMappingIT
[INFO] Running org.apache.phoenix.end2end.NotQueryIT
[INFO] Tests run: 91, Failures: 0, Errors: 0, Skipped: 0, Time elapsed: 670.835 s - in org.apache.phoenix.end2end.GroupByIT
[INFO] Running org.apache.phoenix.end2end.NthValueFunctionIT
[INFO] Tests run: 77, Failures: 0, Errors: 0, Skipped: 0, Time elapsed: 522.732 s - in org.apache.phoenix.end2end.NotQueryIT
[INFO] Tests run: 28, Failures: 0, Errors: 0, Skipped: 0, Time elapsed: 742.445 s - in org.apache.phoenix.end2end.InListIT
[INFO] Tests run: 14, Failures: 0, Errors: 0, Skipped: 0, Time elapsed: 39.901 s - in org.apache.phoenix.end2end.NthValueFunctionIT
[INFO] Running org.apache.phoenix.end2end.OnDuplicateKeyIT
[INFO] Running org.apache.phoenix.end2end.OctetLengthFunctionEnd2EndIT
[INFO] Tests run: 1, Failures: 0, Errors: 0, Skipped: 0, Time elapsed: 2.378 s - in org.apache.phoenix.end2end.OctetLengthFunctionEnd2EndIT
[INFO] Running org.apache.phoenix.end2end.OutOfOrderMutationsIT
[INFO] Running org.apache.phoenix.end2end.OrderByIT
[WARNING] Tests run: 9, Failures: 0, Errors: 0, Skipped: 1, Time elapsed: 33.988 s - in org.apache.phoenix.end2end.OutOfOrderMutationsIT
[INFO] Running org.apache.phoenix.end2end.PercentileIT
[INFO] Tests run: 18, Failures: 0, Errors: 0, Skipped: 0, Time elapsed: 50.022 s - in org.apache.phoenix.end2end.PercentileIT
[INFO] Running org.apache.phoenix.end2end.PhoenixRuntimeIT
[INFO] Tests run: 2, Failures: 0, Errors: 0, Skipped: 0, Time elapsed: 25.14 s - in org.apache.phoenix.end2end.PhoenixRuntimeIT
[INFO] Running org.apache.phoenix.end2end.PointInTimeQueryIT
[INFO] Tests run: 11, Failures: 0, Errors: 0, Skipped: 0, Time elapsed: 129.534 s - in org.apache.phoenix.end2end.OrderByIT
[INFO] Running org.apache.phoenix.end2end.PowerFunctionEnd2EndIT
[INFO] Tests run: 1, Failures: 0, Errors: 0, Skipped: 0, Time elapsed: 4.107 s - in org.apache.phoenix.end2end.PowerFunctionEnd2EndIT
[INFO] Running org.apache.phoenix.end2end.PrimitiveTypeIT
[INFO] Tests run: 112, Failures: 0, Errors: 0, Skipped: 0, Time elapsed: 821.208 s - in org.apache.phoenix.end2end.MutableQueryIT
[INFO] Tests run: 9, Failures: 0, Errors: 0, Skipped: 0, Time elapsed: 20.234 s - in org.apache.phoenix.end2end.PrimitiveTypeIT
[INFO] Tests run: 7, Failures: 0, Errors: 0, Skipped: 0, Time elapsed: 48.403 s - in org.apache.phoenix.end2end.PointInTimeQueryIT
[INFO] Running org.apache.phoenix.end2end.QueryExecWithoutSCNIT
[INFO] Tests run: 1, Failures: 0, Errors: 0, Skipped: 0, Time elapsed: 4.597 s - in org.apache.phoenix.end2end.QueryExecWithoutSCNIT
[INFO] Running org.apache.phoenix.end2end.QueryMoreIT
[INFO] Tests run: 99, Failures: 0, Errors: 0, Skipped: 0, Time elapsed: 1,032.969 s - in org.apache.phoenix.end2end.HashJoinIT
[INFO] Running org.apache.phoenix.end2end.QueryIT
Build step 'Invoke top-level Maven targets' marked build as failure
Archiving artifacts
Recording test results

Mime
View raw message