phoenix-commits mailing list archives

Site index · List index
Message view « Date » · « Thread »
Top « Date » · « Thread »
From Apache Jenkins Server <jenk...@builds.apache.org>
Subject Build failed in Jenkins: Phoenix | Master #1745
Date Mon, 21 Aug 2017 20:05:39 GMT
See <https://builds.apache.org/job/Phoenix-master/1745/display/redirect?page=changes>

Changes:

[jamestaylor] PHOENIX-4109 Ensure mutations are processed in batches with same time

------------------------------------------
[...truncated 96.28 KB...]
[INFO] Running org.apache.phoenix.end2end.index.ViewIndexIT
[INFO] Tests run: 8, Failures: 0, Errors: 0, Skipped: 0, Time elapsed: 48.847 s - in org.apache.phoenix.end2end.index.ViewIndexIT
[INFO] Running org.apache.phoenix.end2end.index.txn.MutableRollbackIT
[INFO] Tests run: 16, Failures: 0, Errors: 0, Skipped: 0, Time elapsed: 296.752 s - in org.apache.phoenix.end2end.index.DropColumnIT
[INFO] Tests run: 6, Failures: 0, Errors: 0, Skipped: 0, Time elapsed: 65.056 s - in org.apache.phoenix.end2end.index.txn.MutableRollbackIT
[INFO] Running org.apache.phoenix.end2end.salted.SaltedTableUpsertSelectIT
[INFO] Running org.apache.phoenix.end2end.index.txn.RollbackIT
[INFO] Tests run: 6, Failures: 0, Errors: 0, Skipped: 0, Time elapsed: 29.783 s - in org.apache.phoenix.end2end.salted.SaltedTableUpsertSelectIT
[INFO] Running org.apache.phoenix.end2end.salted.SaltedTableVarLengthRowKeyIT
[INFO] Tests run: 1, Failures: 0, Errors: 0, Skipped: 0, Time elapsed: 2.333 s - in org.apache.phoenix.end2end.salted.SaltedTableVarLengthRowKeyIT
[INFO] Running org.apache.phoenix.iterate.PhoenixQueryTimeoutIT
[INFO] Tests run: 2, Failures: 0, Errors: 0, Skipped: 0, Time elapsed: 6.272 s - in org.apache.phoenix.iterate.PhoenixQueryTimeoutIT
[INFO] Running org.apache.phoenix.iterate.RoundRobinResultIteratorIT
[INFO] Tests run: 8, Failures: 0, Errors: 0, Skipped: 0, Time elapsed: 52.668 s - in org.apache.phoenix.end2end.index.txn.RollbackIT
[INFO] Running org.apache.phoenix.replication.SystemCatalogWALEntryFilterIT
[INFO] Tests run: 2, Failures: 0, Errors: 0, Skipped: 0, Time elapsed: 0.137 s - in org.apache.phoenix.replication.SystemCatalogWALEntryFilterIT
[INFO] Running org.apache.phoenix.rpc.UpdateCacheIT
[INFO] Tests run: 7, Failures: 0, Errors: 0, Skipped: 0, Time elapsed: 26.996 s - in org.apache.phoenix.rpc.UpdateCacheIT
[INFO] Running org.apache.phoenix.trace.PhoenixTableMetricsWriterIT
[INFO] Tests run: 102, Failures: 0, Errors: 0, Skipped: 0, Time elapsed: 947.535 s - in org.apache.phoenix.end2end.SortMergeJoinIT
[INFO] Tests run: 9, Failures: 0, Errors: 0, Skipped: 0, Time elapsed: 48.76 s - in org.apache.phoenix.iterate.RoundRobinResultIteratorIT
[INFO] Running org.apache.phoenix.trace.PhoenixTracingEndToEndIT
[INFO] Tests run: 2, Failures: 0, Errors: 0, Skipped: 0, Time elapsed: 12.502 s - in org.apache.phoenix.trace.PhoenixTableMetricsWriterIT
[INFO] Running org.apache.phoenix.tx.FlappingTransactionIT
[INFO] Tests run: 4, Failures: 0, Errors: 0, Skipped: 0, Time elapsed: 7.183 s - in org.apache.phoenix.tx.FlappingTransactionIT
[INFO] Tests run: 67, Failures: 0, Errors: 0, Skipped: 0, Time elapsed: 394.542 s - in org.apache.phoenix.end2end.index.IndexExpressionIT
[INFO] Running org.apache.phoenix.tx.ParameterizedTransactionIT
[INFO] Running org.apache.phoenix.tx.TransactionIT
[INFO] Running org.apache.phoenix.tx.TxCheckpointIT
[INFO] Tests run: 8, Failures: 0, Errors: 0, Skipped: 0, Time elapsed: 87.185 s - in org.apache.phoenix.trace.PhoenixTracingEndToEndIT
[INFO] Running org.apache.phoenix.util.IndexScrutinyIT
[INFO] Tests run: 7, Failures: 0, Errors: 0, Skipped: 0, Time elapsed: 47.161 s - in org.apache.phoenix.tx.TransactionIT
[INFO] Tests run: 3, Failures: 0, Errors: 0, Skipped: 0, Time elapsed: 8.167 s - in org.apache.phoenix.util.IndexScrutinyIT
[INFO] Tests run: 64, Failures: 0, Errors: 0, Skipped: 0, Time elapsed: 432.341 s - in org.apache.phoenix.end2end.index.MutableIndexIT
[WARNING] Tests run: 52, Failures: 0, Errors: 0, Skipped: 4, Time elapsed: 198.247 s - in
org.apache.phoenix.tx.ParameterizedTransactionIT
[INFO] Tests run: 40, Failures: 0, Errors: 0, Skipped: 0, Time elapsed: 269.757 s - in org.apache.phoenix.tx.TxCheckpointIT
[INFO] Tests run: 4, Failures: 0, Errors: 0, Skipped: 0, Time elapsed: 699.61 s - in org.apache.phoenix.end2end.index.MutableIndexSplitForwardScanIT
[INFO] Tests run: 4, Failures: 0, Errors: 0, Skipped: 0, Time elapsed: 739.766 s - in org.apache.phoenix.end2end.index.MutableIndexSplitReverseScanIT
[INFO] Tests run: 304, Failures: 0, Errors: 0, Skipped: 0, Time elapsed: 1,840.532 s - in
org.apache.phoenix.end2end.index.IndexIT
[INFO] 
[INFO] Results:
[INFO] 
[WARNING] Tests run: 3022, Failures: 0, Errors: 0, Skipped: 5
[INFO] 
[INFO] 
[INFO] --- maven-failsafe-plugin:2.20:integration-test (ClientManagedTimeTests) @ phoenix-core
---
[INFO] 
[INFO] -------------------------------------------------------
[INFO]  T E S T S
[INFO] -------------------------------------------------------
[INFO] Running org.apache.phoenix.end2end.DropSchemaIT
[INFO] Running org.apache.phoenix.end2end.DistinctCountIT
[INFO] Running org.apache.phoenix.end2end.DerivedTableIT
[INFO] Running org.apache.phoenix.end2end.ExtendedQueryExecIT
[INFO] Running org.apache.phoenix.end2end.FunkyNamesIT
[INFO] Running org.apache.phoenix.end2end.CreateTableIT
[INFO] Running org.apache.phoenix.end2end.CreateSchemaIT
[INFO] Running org.apache.phoenix.end2end.CustomEntityDataIT
[INFO] Tests run: 1, Failures: 0, Errors: 0, Skipped: 0, Time elapsed: 1.943 s - in org.apache.phoenix.end2end.CreateSchemaIT
[INFO] Tests run: 3, Failures: 0, Errors: 0, Skipped: 0, Time elapsed: 8.658 s - in org.apache.phoenix.end2end.FunkyNamesIT
[INFO] Running org.apache.phoenix.end2end.ProductMetricsIT
[INFO] Tests run: 3, Failures: 0, Errors: 0, Skipped: 0, Time elapsed: 10.92 s - in org.apache.phoenix.end2end.CustomEntityDataIT
[INFO] Tests run: 4, Failures: 0, Errors: 0, Skipped: 0, Time elapsed: 14.306 s - in org.apache.phoenix.end2end.ExtendedQueryExecIT
[INFO] Running org.apache.phoenix.end2end.QueryDatabaseMetaDataIT
[INFO] Running org.apache.phoenix.end2end.ReadIsolationLevelIT
[INFO] Running org.apache.phoenix.end2end.NativeHBaseTypesIT
[INFO] Tests run: 2, Failures: 0, Errors: 0, Skipped: 0, Time elapsed: 20.796 s - in org.apache.phoenix.end2end.DropSchemaIT
[INFO] Running org.apache.phoenix.end2end.RowValueConstructorIT
[INFO] Tests run: 2, Failures: 0, Errors: 0, Skipped: 0, Time elapsed: 7.932 s - in org.apache.phoenix.end2end.ReadIsolationLevelIT
[INFO] Tests run: 7, Failures: 0, Errors: 0, Skipped: 0, Time elapsed: 8.098 s - in org.apache.phoenix.end2end.NativeHBaseTypesIT
[INFO] Running org.apache.phoenix.end2end.SequenceBulkAllocationIT
[INFO] Running org.apache.phoenix.end2end.SequenceIT
[INFO] Tests run: 10, Failures: 0, Errors: 0, Skipped: 0, Time elapsed: 29.56 s - in org.apache.phoenix.end2end.DistinctCountIT
[INFO] Running org.apache.phoenix.end2end.ToNumberFunctionIT
[INFO] Tests run: 18, Failures: 0, Errors: 0, Skipped: 0, Time elapsed: 40.044 s - in org.apache.phoenix.end2end.DerivedTableIT
[INFO] Running org.apache.phoenix.end2end.TopNIT
[INFO] Tests run: 18, Failures: 0, Errors: 0, Skipped: 0, Time elapsed: 16.453 s - in org.apache.phoenix.end2end.ToNumberFunctionIT
[INFO] Tests run: 4, Failures: 0, Errors: 0, Skipped: 0, Time elapsed: 9.731 s - in org.apache.phoenix.end2end.TopNIT
[INFO] Running org.apache.phoenix.end2end.UpsertValuesIT
[INFO] Running org.apache.phoenix.end2end.TruncateFunctionIT
[INFO] Tests run: 1, Failures: 0, Errors: 0, Skipped: 0, Time elapsed: 5.419 s - in org.apache.phoenix.end2end.TruncateFunctionIT
[INFO] Running org.apache.phoenix.end2end.VariableLengthPKIT
[INFO] Tests run: 54, Failures: 0, Errors: 0, Skipped: 0, Time elapsed: 68.753 s - in org.apache.phoenix.end2end.SequenceIT
[INFO] Tests run: 56, Failures: 0, Errors: 0, Skipped: 0, Time elapsed: 73.445 s - in org.apache.phoenix.end2end.SequenceBulkAllocationIT
[INFO] Running org.apache.phoenix.rpc.UpdateCacheWithScnIT
[INFO] Running org.apache.phoenix.end2end.salted.SaltedTableIT
[INFO] Tests run: 1, Failures: 0, Errors: 0, Skipped: 0, Time elapsed: 5.797 s - in org.apache.phoenix.rpc.UpdateCacheWithScnIT
[INFO] Tests run: 8, Failures: 0, Errors: 0, Skipped: 0, Time elapsed: 8.036 s - in org.apache.phoenix.end2end.salted.SaltedTableIT
[INFO] Tests run: 50, Failures: 0, Errors: 0, Skipped: 0, Time elapsed: 58.129 s - in org.apache.phoenix.end2end.VariableLengthPKIT
[INFO] Tests run: 46, Failures: 0, Errors: 0, Skipped: 0, Time elapsed: 140.734 s - in org.apache.phoenix.end2end.RowValueConstructorIT
[INFO] Tests run: 19, Failures: 0, Errors: 0, Skipped: 0, Time elapsed: 148.301 s - in org.apache.phoenix.end2end.QueryDatabaseMetaDataIT
[INFO] Tests run: 25, Failures: 0, Errors: 0, Skipped: 0, Time elapsed: 117.739 s - in org.apache.phoenix.end2end.UpsertValuesIT
[INFO] Tests run: 21, Failures: 0, Errors: 0, Skipped: 0, Time elapsed: 206.559 s - in org.apache.phoenix.end2end.CreateTableIT
[ERROR] Tests run: 62, Failures: 0, Errors: 1, Skipped: 0, Time elapsed: 351.653 s <<<
FAILURE! - in org.apache.phoenix.end2end.ProductMetricsIT
[ERROR] org.apache.phoenix.end2end.ProductMetricsIT  Time elapsed: 300.61 s  <<<
ERROR!
java.sql.SQLTimeoutException: Operation timed out.

[INFO] 
[INFO] Results:
[INFO] 
[ERROR] Errors: 
[ERROR]   ProductMetricsIT>BaseClientManagedTimeIT.doTeardown:77->BaseTest.dropNonSystemTables:467->BaseTest.disableAndDropNonSystemTables:1443->BaseTest.disableAndDropTable:1470
ยป SQLTimeout
[INFO] 
[ERROR] Tests run: 415, Failures: 0, Errors: 1, Skipped: 0
[INFO] 
[INFO] 
[INFO] --- maven-failsafe-plugin:2.20:integration-test (HBaseManagedTimeTests) @ phoenix-core
---
[INFO] 
[INFO] -------------------------------------------------------
[INFO]  T E S T S
[INFO] -------------------------------------------------------
[INFO] 
[INFO] Results:
[INFO] 
[INFO] Tests run: 0, Failures: 0, Errors: 0, Skipped: 0
[INFO] 
[INFO] 
[INFO] --- maven-failsafe-plugin:2.20:integration-test (NeedTheirOwnClusterTests) @ phoenix-core
---
[INFO] 
[INFO] -------------------------------------------------------
[INFO]  T E S T S
[INFO] -------------------------------------------------------
[INFO] Running org.apache.hadoop.hbase.regionserver.wal.WALReplayWithIndexWritesAndCompressedWALIT
[INFO] Running org.apache.phoenix.end2end.ConnectionUtilIT
[INFO] Running org.apache.hadoop.hbase.regionserver.wal.WALRecoveryRegionPostOpenIT
[INFO] Tests run: 1, Failures: 0, Errors: 0, Skipped: 0, Time elapsed: 59.923 s - in org.apache.hadoop.hbase.regionserver.wal.WALReplayWithIndexWritesAndCompressedWALIT
[INFO] Running org.apache.phoenix.end2end.ArrayIT
[INFO] Running org.apache.phoenix.end2end.ConcurrentMutationsIT
[INFO] Tests run: 1, Failures: 0, Errors: 0, Skipped: 0, Time elapsed: 9.175 s - in org.apache.hadoop.hbase.regionserver.wal.WALRecoveryRegionPostOpenIT
[INFO] Running org.apache.phoenix.end2end.CountDistinctCompressionIT
[INFO] Running org.apache.phoenix.end2end.CsvBulkLoadToolIT
[INFO] Running org.apache.phoenix.end2end.ContextClassloaderIT
[INFO] Tests run: 1, Failures: 0, Errors: 0, Skipped: 0, Time elapsed: 3.665 s - in org.apache.phoenix.end2end.CountDistinctCompressionIT
[INFO] Tests run: 1, Failures: 0, Errors: 0, Skipped: 0, Time elapsed: 27.682 s - in org.apache.phoenix.end2end.ConnectionUtilIT
[INFO] Tests run: 3, Failures: 0, Errors: 0, Skipped: 0, Time elapsed: 3.451 s - in org.apache.phoenix.end2end.ContextClassloaderIT
[INFO] Running org.apache.phoenix.end2end.FlappingLocalIndexIT
[INFO] Running org.apache.phoenix.end2end.IndexExtendedIT
[INFO] Running org.apache.phoenix.end2end.IndexToolForPartialBuildIT
[INFO] Running org.apache.phoenix.end2end.IndexToolForPartialBuildWithNamespaceEnabledIT
[INFO] Tests run: 1, Failures: 0, Errors: 0, Skipped: 0, Time elapsed: 17.818 s - in org.apache.phoenix.end2end.IndexToolForPartialBuildIT
[INFO] Tests run: 2, Failures: 0, Errors: 0, Skipped: 0, Time elapsed: 33.189 s - in org.apache.phoenix.end2end.IndexToolForPartialBuildWithNamespaceEnabledIT
[INFO] Tests run: 11, Failures: 0, Errors: 0, Skipped: 0, Time elapsed: 112.043 s - in org.apache.phoenix.end2end.CsvBulkLoadToolIT
[INFO] Running org.apache.phoenix.end2end.QueryTimeoutIT
[INFO] Running org.apache.phoenix.end2end.QueryWithLimitIT
[INFO] Tests run: 8, Failures: 0, Errors: 0, Skipped: 0, Time elapsed: 85.048 s - in org.apache.phoenix.end2end.FlappingLocalIndexIT
[INFO] Tests run: 2, Failures: 0, Errors: 0, Skipped: 0, Time elapsed: 6.022 s - in org.apache.phoenix.end2end.QueryWithLimitIT
[INFO] Running org.apache.phoenix.end2end.RebuildIndexConnectionPropsIT
[INFO] Tests run: 1, Failures: 0, Errors: 0, Skipped: 0, Time elapsed: 1.518 s - in org.apache.phoenix.end2end.RebuildIndexConnectionPropsIT
[INFO] Running org.apache.phoenix.end2end.RegexBulkLoadToolIT
[INFO] Tests run: 80, Failures: 0, Errors: 0, Skipped: 0, Time elapsed: 200.039 s - in org.apache.phoenix.end2end.ArrayIT
[INFO] Tests run: 2, Failures: 0, Errors: 0, Skipped: 0, Time elapsed: 46.921 s - in org.apache.phoenix.end2end.QueryTimeoutIT
[INFO] Running org.apache.phoenix.end2end.RenewLeaseIT
[INFO] Tests run: 1, Failures: 0, Errors: 0, Skipped: 0, Time elapsed: 26.705 s - in org.apache.phoenix.end2end.RenewLeaseIT
[INFO] Running org.apache.phoenix.end2end.SpillableGroupByIT
[INFO] Running org.apache.phoenix.end2end.StatsCollectorIT
[INFO] Tests run: 10, Failures: 0, Errors: 0, Skipped: 0, Time elapsed: 88.593 s - in org.apache.phoenix.end2end.RegexBulkLoadToolIT
[INFO] Tests run: 2, Failures: 0, Errors: 0, Skipped: 0, Time elapsed: 12.998 s - in org.apache.phoenix.end2end.SpillableGroupByIT
[INFO] Running org.apache.phoenix.end2end.SysTableNamespaceMappedStatsCollectorIT
[INFO] Running org.apache.phoenix.end2end.UpdateCacheAcrossDifferentClientsIT
[INFO] Running org.apache.phoenix.end2end.UserDefinedFunctionsIT
[INFO] Running org.apache.phoenix.end2end.index.ImmutableIndexIT
[INFO] Tests run: 7, Failures: 0, Errors: 0, Skipped: 0, Time elapsed: 36.775 s - in org.apache.phoenix.end2end.UpdateCacheAcrossDifferentClientsIT
[INFO] Running org.apache.phoenix.end2end.index.LocalIndexIT
[INFO] Tests run: 14, Failures: 0, Errors: 0, Skipped: 0, Time elapsed: 46.28 s - in org.apache.phoenix.end2end.UserDefinedFunctionsIT
[INFO] Running org.apache.phoenix.end2end.index.MutableIndexFailureIT
[INFO] Running org.apache.phoenix.end2end.index.MutableIndexReplicationIT
[INFO] Tests run: 1, Failures: 0, Errors: 0, Skipped: 0, Time elapsed: 18.62 s - in org.apache.phoenix.end2end.index.MutableIndexReplicationIT
[INFO] Running org.apache.phoenix.end2end.index.PartialIndexRebuilderIT
[INFO] Tests run: 15, Failures: 0, Errors: 0, Skipped: 0, Time elapsed: 525.568 s - in org.apache.phoenix.end2end.ConcurrentMutationsIT
[INFO] Running org.apache.phoenix.end2end.index.txn.TxWriteFailureIT
[INFO] Tests run: 24, Failures: 0, Errors: 0, Skipped: 0, Time elapsed: 279.44 s - in org.apache.phoenix.end2end.index.ImmutableIndexIT
[INFO] Tests run: 8, Failures: 0, Errors: 0, Skipped: 0, Time elapsed: 54.775 s - in org.apache.phoenix.end2end.index.txn.TxWriteFailureIT
[INFO] Tests run: 32, Failures: 0, Errors: 0, Skipped: 0, Time elapsed: 309.949 s - in org.apache.phoenix.end2end.index.LocalIndexIT
[INFO] Running org.apache.phoenix.hbase.index.FailForUnsupportedHBaseVersionsIT
[INFO] Running org.apache.phoenix.execute.PartialCommitIT
[INFO] Tests run: 12, Failures: 0, Errors: 0, Skipped: 0, Time elapsed: 1.937 s - in org.apache.phoenix.execute.PartialCommitIT
[WARNING] Tests run: 132, Failures: 0, Errors: 0, Skipped: 24, Time elapsed: 433.208 s - in
org.apache.phoenix.end2end.StatsCollectorIT
[INFO] Tests run: 2, Failures: 0, Errors: 0, Skipped: 0, Time elapsed: 29.703 s - in org.apache.phoenix.hbase.index.FailForUnsupportedHBaseVersionsIT
[WARNING] Tests run: 132, Failures: 0, Errors: 0, Skipped: 24, Time elapsed: 432.814 s - in
org.apache.phoenix.end2end.SysTableNamespaceMappedStatsCollectorIT
[INFO] Running org.apache.phoenix.execute.UpsertSelectOverlappingBatchesIT
[INFO] Running org.apache.phoenix.hbase.index.covered.EndToEndCoveredColumnsIndexBuilderIT
[INFO] Tests run: 2, Failures: 0, Errors: 0, Skipped: 0, Time elapsed: 12.199 s - in org.apache.phoenix.hbase.index.covered.EndToEndCoveredColumnsIndexBuilderIT
[INFO] Running org.apache.phoenix.hbase.index.covered.FailWithoutRetriesIT
[INFO] Tests run: 1, Failures: 0, Errors: 0, Skipped: 0, Time elapsed: 25.361 s - in org.apache.phoenix.execute.UpsertSelectOverlappingBatchesIT
[INFO] Tests run: 1, Failures: 0, Errors: 0, Skipped: 0, Time elapsed: 2.618 s - in org.apache.phoenix.hbase.index.covered.FailWithoutRetriesIT
[INFO] Running org.apache.phoenix.iterate.RoundRobinResultIteratorWithStatsIT
[INFO] Running org.apache.phoenix.monitoring.PhoenixMetricsIT
[INFO] Running org.apache.phoenix.iterate.ScannerLeaseRenewalIT
[INFO] Running org.apache.phoenix.rpc.PhoenixServerRpcIT
[INFO] Running org.apache.phoenix.rpc.PhoenixClientRpcIT
[INFO] Tests run: 2, Failures: 0, Errors: 0, Skipped: 0, Time elapsed: 10.645 s - in org.apache.phoenix.rpc.PhoenixClientRpcIT
[INFO] Tests run: 1, Failures: 0, Errors: 0, Skipped: 0, Time elapsed: 30.671 s - in org.apache.phoenix.iterate.RoundRobinResultIteratorWithStatsIT
[INFO] Tests run: 2, Failures: 0, Errors: 0, Skipped: 0, Time elapsed: 18.919 s - in org.apache.phoenix.rpc.PhoenixServerRpcIT
[INFO] Tests run: 21, Failures: 0, Errors: 0, Skipped: 0, Time elapsed: 426.546 s - in org.apache.phoenix.end2end.index.MutableIndexFailureIT
[INFO] Tests run: 22, Failures: 0, Errors: 0, Skipped: 0, Time elapsed: 71.434 s - in org.apache.phoenix.monitoring.PhoenixMetricsIT
[INFO] Tests run: 2, Failures: 0, Errors: 0, Skipped: 0, Time elapsed: 163.652 s - in org.apache.phoenix.iterate.ScannerLeaseRenewalIT
[INFO] Tests run: 140, Failures: 0, Errors: 0, Skipped: 0, Time elapsed: 875.779 s - in org.apache.phoenix.end2end.IndexExtendedIT
[INFO] Tests run: 24, Failures: 0, Errors: 0, Skipped: 0, Time elapsed: 648.47 s - in org.apache.phoenix.end2end.index.PartialIndexRebuilderIT
[INFO] 
[INFO] Results:
[INFO] 
[WARNING] Tests run: 724, Failures: 0, Errors: 0, Skipped: 48
[INFO] 
[INFO] 
[INFO] --- maven-failsafe-plugin:2.20:verify (ParallelStatsEnabledTest) @ phoenix-core ---
[INFO] ------------------------------------------------------------------------
[INFO] Reactor Summary:
[INFO] 
[INFO] Apache Phoenix ..................................... SUCCESS [  4.741 s]
[INFO] Phoenix Core ....................................... FAILURE [  01:39 h]
[INFO] Phoenix - Flume .................................... SKIPPED
[INFO] Phoenix - Kafka .................................... SKIPPED
[INFO] Phoenix - Pig ...................................... SKIPPED
[INFO] Phoenix Query Server Client ........................ SKIPPED
[INFO] Phoenix Query Server ............................... SKIPPED
[INFO] Phoenix - Pherf .................................... SKIPPED
[INFO] Phoenix - Spark .................................... SKIPPED
[INFO] Phoenix - Hive ..................................... SKIPPED
[INFO] Phoenix Client ..................................... SKIPPED
[INFO] Phoenix Server ..................................... SKIPPED
[INFO] Phoenix Assembly ................................... SKIPPED
[INFO] Phoenix - Tracing Web Application .................. SKIPPED
[INFO] Phoenix Load Balancer .............................. SKIPPED
[INFO] ------------------------------------------------------------------------
[INFO] BUILD FAILURE
[INFO] ------------------------------------------------------------------------
[INFO] Total time: 01:39 h
[INFO] Finished at: 2017-08-21T19:49:23Z
[INFO] Final Memory: 62M/1550M
[INFO] ------------------------------------------------------------------------
[ERROR] Failed to execute goal org.apache.maven.plugins:maven-failsafe-plugin:2.20:verify
(ParallelStatsEnabledTest) on project phoenix-core: There are test failures.
[ERROR] 
[ERROR] Please refer to <https://builds.apache.org/job/Phoenix-master/ws/phoenix-core/target/failsafe-reports>
for the individual test results.
[ERROR] Please refer to dump files (if any exist) [date]-jvmRun[N].dump, [date].dumpstream
and [date]-jvmRun[N].dumpstream.
[ERROR] -> [Help 1]
[ERROR] 
[ERROR] To see the full stack trace of the errors, re-run Maven with the -e switch.
[ERROR] Re-run Maven using the -X switch to enable full debug logging.
[ERROR] 
[ERROR] For more information about the errors and possible solutions, please read the following
articles:
[ERROR] [Help 1] http://cwiki.apache.org/confluence/display/MAVEN/MojoFailureException
[ERROR] 
[ERROR] After correcting the problems, you can resume the build with the command
[ERROR]   mvn <goals> -rf :phoenix-core
Build step 'Invoke top-level Maven targets' marked build as failure
Archiving artifacts
[Fast Archiver] Compressed -866118836 B of artifacts by 183.8% relative to #1733
[JIRA] Updating issue PHOENIX-4109
Recording test results

Mime
View raw message