phoenix-commits mailing list archives

Site index · List index
Message view « Date » · « Thread »
Top « Date » · « Thread »
From Apache Jenkins Server <jenk...@builds.apache.org>
Subject Build failed in Jenkins: Phoenix | Master #1736
Date Fri, 18 Aug 2017 03:31:58 GMT
See <https://builds.apache.org/job/Phoenix-master/1736/display/redirect?page=changes>

Changes:

[jamestaylor] PHOENIX-4095 Prevent index from getting out of sync with data table

------------------------------------------
[...truncated 115.52 KB...]
	at org.apache.hadoop.hbase.regionserver.RegionCoprocessorHost.preBatchMutate(RegionCoprocessorHost.java:1003)
	at org.apache.hadoop.hbase.regionserver.HRegion.doMiniBatchMutation(HRegion.java:3217)
	at org.apache.hadoop.hbase.regionserver.HRegion.batchMutate(HRegion.java:3004)
	at org.apache.hadoop.hbase.regionserver.HRegion.batchMutate(HRegion.java:2946)
	at org.apache.hadoop.hbase.regionserver.RSRpcServices.doBatchOp(RSRpcServices.java:843)
	at org.apache.hadoop.hbase.regionserver.RSRpcServices.doNonAtomicRegionMutation(RSRpcServices.java:805)
	at org.apache.hadoop.hbase.regionserver.RSRpcServices.multi(RSRpcServices.java:2299)
	at org.apache.hadoop.hbase.protobuf.generated.ClientProtos$ClientService$2.callBlockingMethod(ClientProtos.java:34958)
	at org.apache.hadoop.hbase.ipc.RpcServer.call(RpcServer.java:2347)
	at org.apache.hadoop.hbase.ipc.CallRunner.run(CallRunner.java:123)
	at org.apache.hadoop.hbase.ipc.RpcExecutor$Handler.run(RpcExecutor.java:188)
	at org.apache.hadoop.hbase.ipc.RpcExecutor$Handler.run(RpcExecutor.java:168)
Caused by: java.lang.AssertionError
	at org.apache.phoenix.hbase.index.covered.NonTxIndexBuilder.batchMutationAndAddUpdates(NonTxIndexBuilder.java:96)
	at org.apache.phoenix.hbase.index.covered.NonTxIndexBuilder.getIndexUpdate(NonTxIndexBuilder.java:63)
	at org.apache.phoenix.hbase.index.builder.IndexBuildManager.getIndexUpdate(IndexBuildManager.java:85)
	at org.apache.phoenix.hbase.index.Indexer.preBatchMutateWithExceptions(Indexer.java:529)
	at org.apache.phoenix.hbase.index.Indexer.preBatchMutate(Indexer.java:348)
	... 16 more
: 1 time, servers with issues: qnode1.quenda.co,44163,1503025340989, 
	at org.apache.phoenix.hbase.index.covered.example.EndToEndCoveredIndexingIT.testDeleteColumnsInThePast(EndToEndCoveredIndexingIT.java:466)

[ERROR] testMultipleTimestampsInSinglePut(org.apache.phoenix.hbase.index.covered.example.EndToEndCoveredIndexingIT)
 Time elapsed: 2.517 s  <<< ERROR!
org.apache.hadoop.hbase.client.RetriesExhaustedWithDetailsException: 
Failed 1 action: org.apache.phoenix.hbase.index.builder.IndexBuildingFailureException: Failed
to build index for unexpected reason!
	at org.apache.phoenix.hbase.index.util.IndexManagementUtil.rethrowIndexingException(IndexManagementUtil.java:200)
	at org.apache.phoenix.hbase.index.Indexer.preBatchMutate(Indexer.java:351)
	at org.apache.hadoop.hbase.regionserver.RegionCoprocessorHost$35.call(RegionCoprocessorHost.java:1007)
	at org.apache.hadoop.hbase.regionserver.RegionCoprocessorHost$RegionOperation.call(RegionCoprocessorHost.java:1674)
	at org.apache.hadoop.hbase.regionserver.RegionCoprocessorHost.execOperation(RegionCoprocessorHost.java:1750)
	at org.apache.hadoop.hbase.regionserver.RegionCoprocessorHost.execOperation(RegionCoprocessorHost.java:1706)
	at org.apache.hadoop.hbase.regionserver.RegionCoprocessorHost.preBatchMutate(RegionCoprocessorHost.java:1003)
	at org.apache.hadoop.hbase.regionserver.HRegion.doMiniBatchMutation(HRegion.java:3217)
	at org.apache.hadoop.hbase.regionserver.HRegion.batchMutate(HRegion.java:3004)
	at org.apache.hadoop.hbase.regionserver.HRegion.batchMutate(HRegion.java:2946)
	at org.apache.hadoop.hbase.regionserver.RSRpcServices.doBatchOp(RSRpcServices.java:843)
	at org.apache.hadoop.hbase.regionserver.RSRpcServices.doNonAtomicRegionMutation(RSRpcServices.java:805)
	at org.apache.hadoop.hbase.regionserver.RSRpcServices.multi(RSRpcServices.java:2299)
	at org.apache.hadoop.hbase.protobuf.generated.ClientProtos$ClientService$2.callBlockingMethod(ClientProtos.java:34958)
	at org.apache.hadoop.hbase.ipc.RpcServer.call(RpcServer.java:2347)
	at org.apache.hadoop.hbase.ipc.CallRunner.run(CallRunner.java:123)
	at org.apache.hadoop.hbase.ipc.RpcExecutor$Handler.run(RpcExecutor.java:188)
	at org.apache.hadoop.hbase.ipc.RpcExecutor$Handler.run(RpcExecutor.java:168)
Caused by: java.lang.AssertionError
	at org.apache.phoenix.hbase.index.covered.NonTxIndexBuilder.batchMutationAndAddUpdates(NonTxIndexBuilder.java:96)
	at org.apache.phoenix.hbase.index.covered.NonTxIndexBuilder.getIndexUpdate(NonTxIndexBuilder.java:63)
	at org.apache.phoenix.hbase.index.builder.IndexBuildManager.getIndexUpdate(IndexBuildManager.java:85)
	at org.apache.phoenix.hbase.index.Indexer.preBatchMutateWithExceptions(Indexer.java:529)
	at org.apache.phoenix.hbase.index.Indexer.preBatchMutate(Indexer.java:348)
	... 16 more
: 1 time, servers with issues: qnode1.quenda.co,44163,1503025340989, 
	at org.apache.phoenix.hbase.index.covered.example.EndToEndCoveredIndexingIT.testMultipleTimestampsInSinglePut(EndToEndCoveredIndexingIT.java:190)

[INFO] Tests run: 1, Failures: 0, Errors: 0, Skipped: 0, Time elapsed: 28.797 s - in org.apache.phoenix.iterate.RoundRobinResultIteratorWithStatsIT
[ERROR] Tests run: 11, Failures: 0, Errors: 2, Skipped: 4, Time elapsed: 73.116 s <<<
FAILURE! - in org.apache.phoenix.hbase.index.covered.example.EndtoEndIndexingWithCompressionIT
[ERROR] testDeleteColumnsInThePast(org.apache.phoenix.hbase.index.covered.example.EndtoEndIndexingWithCompressionIT)
 Time elapsed: 3.582 s  <<< ERROR!
org.apache.hadoop.hbase.client.RetriesExhaustedWithDetailsException: 
Failed 1 action: org.apache.phoenix.hbase.index.builder.IndexBuildingFailureException: Failed
to build index for unexpected reason!
	at org.apache.phoenix.hbase.index.util.IndexManagementUtil.rethrowIndexingException(IndexManagementUtil.java:200)
	at org.apache.phoenix.hbase.index.Indexer.preBatchMutate(Indexer.java:351)
	at org.apache.hadoop.hbase.regionserver.RegionCoprocessorHost$35.call(RegionCoprocessorHost.java:1007)
	at org.apache.hadoop.hbase.regionserver.RegionCoprocessorHost$RegionOperation.call(RegionCoprocessorHost.java:1674)
	at org.apache.hadoop.hbase.regionserver.RegionCoprocessorHost.execOperation(RegionCoprocessorHost.java:1750)
	at org.apache.hadoop.hbase.regionserver.RegionCoprocessorHost.execOperation(RegionCoprocessorHost.java:1706)
	at org.apache.hadoop.hbase.regionserver.RegionCoprocessorHost.preBatchMutate(RegionCoprocessorHost.java:1003)
	at org.apache.hadoop.hbase.regionserver.HRegion.doMiniBatchMutation(HRegion.java:3217)
	at org.apache.hadoop.hbase.regionserver.HRegion.batchMutate(HRegion.java:3004)
	at org.apache.hadoop.hbase.regionserver.HRegion.batchMutate(HRegion.java:2946)
	at org.apache.hadoop.hbase.regionserver.RSRpcServices.doBatchOp(RSRpcServices.java:843)
	at org.apache.hadoop.hbase.regionserver.RSRpcServices.doNonAtomicRegionMutation(RSRpcServices.java:805)
	at org.apache.hadoop.hbase.regionserver.RSRpcServices.multi(RSRpcServices.java:2299)
	at org.apache.hadoop.hbase.protobuf.generated.ClientProtos$ClientService$2.callBlockingMethod(ClientProtos.java:34958)
	at org.apache.hadoop.hbase.ipc.RpcServer.call(RpcServer.java:2347)
	at org.apache.hadoop.hbase.ipc.CallRunner.run(CallRunner.java:123)
	at org.apache.hadoop.hbase.ipc.RpcExecutor$Handler.run(RpcExecutor.java:188)
	at org.apache.hadoop.hbase.ipc.RpcExecutor$Handler.run(RpcExecutor.java:168)
Caused by: java.lang.AssertionError
	at org.apache.phoenix.hbase.index.covered.NonTxIndexBuilder.batchMutationAndAddUpdates(NonTxIndexBuilder.java:96)
	at org.apache.phoenix.hbase.index.covered.NonTxIndexBuilder.getIndexUpdate(NonTxIndexBuilder.java:63)
	at org.apache.phoenix.hbase.index.builder.IndexBuildManager.getIndexUpdate(IndexBuildManager.java:85)
	at org.apache.phoenix.hbase.index.Indexer.preBatchMutateWithExceptions(Indexer.java:529)
	at org.apache.phoenix.hbase.index.Indexer.preBatchMutate(Indexer.java:348)
	... 16 more
: 1 time, servers with issues: qnode1.quenda.co,34133,1503025360127, 

[ERROR] testMultipleTimestampsInSinglePut(org.apache.phoenix.hbase.index.covered.example.EndtoEndIndexingWithCompressionIT)
 Time elapsed: 3.511 s  <<< ERROR!
org.apache.hadoop.hbase.client.RetriesExhaustedWithDetailsException: 
Failed 1 action: org.apache.phoenix.hbase.index.builder.IndexBuildingFailureException: Failed
to build index for unexpected reason!
	at org.apache.phoenix.hbase.index.util.IndexManagementUtil.rethrowIndexingException(IndexManagementUtil.java:200)
	at org.apache.phoenix.hbase.index.Indexer.preBatchMutate(Indexer.java:351)
	at org.apache.hadoop.hbase.regionserver.RegionCoprocessorHost$35.call(RegionCoprocessorHost.java:1007)
	at org.apache.hadoop.hbase.regionserver.RegionCoprocessorHost$RegionOperation.call(RegionCoprocessorHost.java:1674)
	at org.apache.hadoop.hbase.regionserver.RegionCoprocessorHost.execOperation(RegionCoprocessorHost.java:1750)
	at org.apache.hadoop.hbase.regionserver.RegionCoprocessorHost.execOperation(RegionCoprocessorHost.java:1706)
	at org.apache.hadoop.hbase.regionserver.RegionCoprocessorHost.preBatchMutate(RegionCoprocessorHost.java:1003)
	at org.apache.hadoop.hbase.regionserver.HRegion.doMiniBatchMutation(HRegion.java:3217)
	at org.apache.hadoop.hbase.regionserver.HRegion.batchMutate(HRegion.java:3004)
	at org.apache.hadoop.hbase.regionserver.HRegion.batchMutate(HRegion.java:2946)
	at org.apache.hadoop.hbase.regionserver.RSRpcServices.doBatchOp(RSRpcServices.java:843)
	at org.apache.hadoop.hbase.regionserver.RSRpcServices.doNonAtomicRegionMutation(RSRpcServices.java:805)
	at org.apache.hadoop.hbase.regionserver.RSRpcServices.multi(RSRpcServices.java:2299)
	at org.apache.hadoop.hbase.protobuf.generated.ClientProtos$ClientService$2.callBlockingMethod(ClientProtos.java:34958)
	at org.apache.hadoop.hbase.ipc.RpcServer.call(RpcServer.java:2347)
	at org.apache.hadoop.hbase.ipc.CallRunner.run(CallRunner.java:123)
	at org.apache.hadoop.hbase.ipc.RpcExecutor$Handler.run(RpcExecutor.java:188)
	at org.apache.hadoop.hbase.ipc.RpcExecutor$Handler.run(RpcExecutor.java:168)
Caused by: java.lang.AssertionError
	at org.apache.phoenix.hbase.index.covered.NonTxIndexBuilder.batchMutationAndAddUpdates(NonTxIndexBuilder.java:96)
	at org.apache.phoenix.hbase.index.covered.NonTxIndexBuilder.getIndexUpdate(NonTxIndexBuilder.java:63)
	at org.apache.phoenix.hbase.index.builder.IndexBuildManager.getIndexUpdate(IndexBuildManager.java:85)
	at org.apache.phoenix.hbase.index.Indexer.preBatchMutateWithExceptions(Indexer.java:529)
	at org.apache.phoenix.hbase.index.Indexer.preBatchMutate(Indexer.java:348)
	... 16 more
: 1 time, servers with issues: qnode1.quenda.co,34133,1503025360127, 

[INFO] Running org.apache.phoenix.monitoring.PhoenixMetricsIT
[INFO] Running org.apache.phoenix.rpc.PhoenixClientRpcIT
[INFO] Tests run: 2, Failures: 0, Errors: 0, Skipped: 0, Time elapsed: 11.434 s - in org.apache.phoenix.rpc.PhoenixClientRpcIT
[INFO] Running org.apache.phoenix.rpc.PhoenixServerRpcIT
[INFO] Tests run: 2, Failures: 0, Errors: 0, Skipped: 0, Time elapsed: 20.171 s - in org.apache.phoenix.rpc.PhoenixServerRpcIT
[INFO] Tests run: 21, Failures: 0, Errors: 0, Skipped: 0, Time elapsed: 587.731 s - in org.apache.phoenix.end2end.index.MutableIndexFailureIT
[INFO] Tests run: 140, Failures: 0, Errors: 0, Skipped: 0, Time elapsed: 867.073 s - in org.apache.phoenix.end2end.IndexExtendedIT
[INFO] Tests run: 22, Failures: 0, Errors: 0, Skipped: 0, Time elapsed: 81.777 s - in org.apache.phoenix.monitoring.PhoenixMetricsIT
[INFO] Tests run: 2, Failures: 0, Errors: 0, Skipped: 0, Time elapsed: 163.513 s - in org.apache.phoenix.iterate.ScannerLeaseRenewalIT
[INFO] Tests run: 30, Failures: 0, Errors: 0, Skipped: 0, Time elapsed: 1,049.476 s - in org.apache.phoenix.end2end.ConcurrentMutationsIT
[ERROR] Tests run: 30, Failures: 4, Errors: 0, Skipped: 0, Time elapsed: 832.647 s <<<
FAILURE! - in org.apache.phoenix.end2end.index.PartialIndexRebuilderIT
[ERROR] testMultiValuesAtSameTS(org.apache.phoenix.end2end.index.PartialIndexRebuilderIT)
 Time elapsed: 66.217 s  <<< FAILURE!
java.lang.AssertionError
	at org.apache.phoenix.end2end.index.PartialIndexRebuilderIT.testMultiValuesAtSameTS(PartialIndexRebuilderIT.java:371)

[ERROR] testWriteWhileRebuilding(org.apache.phoenix.end2end.index.PartialIndexRebuilderIT)
 Time elapsed: 72.296 s  <<< FAILURE!
java.lang.AssertionError
	at org.apache.phoenix.end2end.index.PartialIndexRebuilderIT.testWriteWhileRebuilding(PartialIndexRebuilderIT.java:210)

[ERROR] testUpsertNullAfterFailure(org.apache.phoenix.end2end.index.PartialIndexRebuilderIT)
 Time elapsed: 65.35 s  <<< FAILURE!
java.lang.AssertionError
	at org.apache.phoenix.end2end.index.PartialIndexRebuilderIT.testUpsertNullAfterFailure(PartialIndexRebuilderIT.java:265)

[ERROR] testMultiVersionsAfterFailure(org.apache.phoenix.end2end.index.PartialIndexRebuilderIT)
 Time elapsed: 64.201 s  <<< FAILURE!
java.lang.AssertionError
	at org.apache.phoenix.end2end.index.PartialIndexRebuilderIT.testMultiVersionsAfterFailure(PartialIndexRebuilderIT.java:238)

[INFO] 
[INFO] Results:
[INFO] 
[ERROR] Failures: 
[ERROR]   IndexToolForPartialBuildIT.testSecondaryIndex:186
[ERROR]   IndexToolForPartialBuildWithNamespaceEnabledIT>IndexToolForPartialBuildIT.testSecondaryIndex:186
[ERROR]   IndexToolForPartialBuildWithNamespaceEnabledIT>IndexToolForPartialBuildIT.testSecondaryIndex:186
[ERROR]   PartialIndexRebuilderIT.testMultiValuesAtSameTS:371
[ERROR]   PartialIndexRebuilderIT.testMultiVersionsAfterFailure:238
[ERROR]   PartialIndexRebuilderIT.testUpsertNullAfterFailure:265
[ERROR]   PartialIndexRebuilderIT.testWriteWhileRebuilding:210
[ERROR] Errors: 
[ERROR]   EndToEndCoveredIndexingIT.testDeleteColumnsInThePast:466 » RetriesExhaustedWithDetails
[ERROR]   EndToEndCoveredIndexingIT.testMultipleTimestampsInSinglePut:190 » RetriesExhaustedWithDetails
[ERROR]   EndtoEndIndexingWithCompressionIT>EndToEndCoveredIndexingIT.testDeleteColumnsInThePast:466
» RetriesExhaustedWithDetails
[ERROR]   EndtoEndIndexingWithCompressionIT>EndToEndCoveredIndexingIT.testMultipleTimestampsInSinglePut:190
» RetriesExhaustedWithDetails
[INFO] 
[ERROR] Tests run: 685, Failures: 7, Errors: 4, Skipped: 56
[INFO] 
[INFO] 
[INFO] --- maven-failsafe-plugin:2.20:verify (ParallelStatsEnabledTest) @ phoenix-core ---
[INFO] ------------------------------------------------------------------------
[INFO] Reactor Summary:
[INFO] 
[INFO] Apache Phoenix ..................................... SUCCESS [  4.517 s]
[INFO] Phoenix Core ....................................... FAILURE [  01:41 h]
[INFO] Phoenix - Flume .................................... SKIPPED
[INFO] Phoenix - Kafka .................................... SKIPPED
[INFO] Phoenix - Pig ...................................... SKIPPED
[INFO] Phoenix Query Server Client ........................ SKIPPED
[INFO] Phoenix Query Server ............................... SKIPPED
[INFO] Phoenix - Pherf .................................... SKIPPED
[INFO] Phoenix - Spark .................................... SKIPPED
[INFO] Phoenix - Hive ..................................... SKIPPED
[INFO] Phoenix Client ..................................... SKIPPED
[INFO] Phoenix Server ..................................... SKIPPED
[INFO] Phoenix Assembly ................................... SKIPPED
[INFO] Phoenix - Tracing Web Application .................. SKIPPED
[INFO] ------------------------------------------------------------------------
[INFO] BUILD FAILURE
[INFO] ------------------------------------------------------------------------
[INFO] Total time: 01:41 h
[INFO] Finished at: 2017-08-18T03:12:43Z
[INFO] Final Memory: 63M/1729M
[INFO] ------------------------------------------------------------------------
[ERROR] Failed to execute goal org.apache.maven.plugins:maven-failsafe-plugin:2.20:verify
(ParallelStatsEnabledTest) on project phoenix-core: There are test failures.
[ERROR] 
[ERROR] Please refer to <https://builds.apache.org/job/Phoenix-master/ws/phoenix-core/target/failsafe-reports>
for the individual test results.
[ERROR] Please refer to dump files (if any exist) [date]-jvmRun[N].dump, [date].dumpstream
and [date]-jvmRun[N].dumpstream.
[ERROR] org.apache.maven.surefire.booter.SurefireBooterForkException: ExecutionException There
was an error in the forked process
[ERROR] Test mechanism :: java.lang.Exception: Service failed while running
[ERROR] 	at org.apache.maven.plugin.surefire.booterclient.ForkStarter.awaitResultsDone(ForkStarter.java:494)
[ERROR] 	at org.apache.maven.plugin.surefire.booterclient.ForkStarter.runSuitesForkOnceMultiple(ForkStarter.java:369)
[ERROR] 	at org.apache.maven.plugin.surefire.booterclient.ForkStarter.run(ForkStarter.java:292)
[ERROR] 	at org.apache.maven.plugin.surefire.booterclient.ForkStarter.run(ForkStarter.java:243)
[ERROR] 	at org.apache.maven.plugin.surefire.AbstractSurefireMojo.executeProvider(AbstractSurefireMojo.java:1077)
[ERROR] 	at org.apache.maven.plugin.surefire.AbstractSurefireMojo.executeAfterPreconditionsChecked(AbstractSurefireMojo.java:907)
[ERROR] 	at org.apache.maven.plugin.surefire.AbstractSurefireMojo.execute(AbstractSurefireMojo.java:785)
[ERROR] 	at org.apache.maven.plugin.DefaultBuildPluginManager.executeMojo(DefaultBuildPluginManager.java:134)
[ERROR] 	at org.apache.maven.lifecycle.internal.MojoExecutor.execute(MojoExecutor.java:208)
[ERROR] 	at org.apache.maven.lifecycle.internal.MojoExecutor.execute(MojoExecutor.java:154)
[ERROR] 	at org.apache.maven.lifecycle.internal.MojoExecutor.execute(MojoExecutor.java:146)
[ERROR] 	at org.apache.maven.lifecycle.internal.LifecycleModuleBuilder.buildProject(LifecycleModuleBuilder.java:117)
[ERROR] 	at org.apache.maven.lifecycle.internal.LifecycleModuleBuilder.buildProject(LifecycleModuleBuilder.java:81)
[ERROR] 	at org.apache.maven.lifecycle.internal.builder.singlethreaded.SingleThreadedBuilder.build(SingleThreadedBuilder.java:51)
[ERROR] 	at org.apache.maven.lifecycle.internal.LifecycleStarter.execute(LifecycleStarter.java:128)
[ERROR] 	at org.apache.maven.DefaultMaven.doExecute(DefaultMaven.java:309)
[ERROR] 	at org.apache.maven.DefaultMaven.doExecute(DefaultMaven.java:194)
[ERROR] 	at org.apache.maven.DefaultMaven.execute(DefaultMaven.java:107)
[ERROR] 	at org.apache.maven.cli.MavenCli.execute(MavenCli.java:993)
[ERROR] 	at org.apache.maven.cli.MavenCli.doMain(MavenCli.java:345)
[ERROR] 	at org.apache.maven.cli.MavenCli.main(MavenCli.java:191)
[ERROR] 	at sun.reflect.NativeMethodAccessorImpl.invoke0(Native Method)
[ERROR] 	at sun.reflect.NativeMethodAccessorImpl.invoke(NativeMethodAccessorImpl.java:57)
[ERROR] 	at sun.reflect.DelegatingMethodAccessorImpl.invoke(DelegatingMethodAccessorImpl.java:43)
[ERROR] 	at java.lang.reflect.Method.invoke(Method.java:606)
[ERROR] 	at org.codehaus.plexus.classworlds.launcher.Launcher.launchEnhanced(Launcher.java:289)
[ERROR] 	at org.codehaus.plexus.classworlds.launcher.Launcher.launch(Launcher.java:229)
[ERROR] 	at org.codehaus.plexus.classworlds.launcher.Launcher.mainWithExitCode(Launcher.java:415)
[ERROR] 	at org.codehaus.plexus.classworlds.launcher.Launcher.main(Launcher.java:356)
[ERROR] Caused by: org.apache.maven.surefire.booter.SurefireBooterForkException: There was
an error in the forked process
[ERROR] Test mechanism :: java.lang.Exception: Service failed while running
[ERROR] 	at org.apache.maven.plugin.surefire.booterclient.ForkStarter.fork(ForkStarter.java:665)
[ERROR] 	at org.apache.maven.plugin.surefire.booterclient.ForkStarter.fork(ForkStarter.java:533)
[ERROR] 	at org.apache.maven.plugin.surefire.booterclient.ForkStarter.access$600(ForkStarter.java:117)
[ERROR] 	at org.apache.maven.plugin.surefire.booterclient.ForkStarter$1.call(ForkStarter.java:363)
[ERROR] 	at org.apache.maven.plugin.surefire.booterclient.ForkStarter$1.call(ForkStarter.java:342)
[ERROR] 	at java.util.concurrent.FutureTask.run(FutureTask.java:262)
[ERROR] 	at java.util.concurrent.ThreadPoolExecutor.runWorker(ThreadPoolExecutor.java:1145)
[ERROR] 	at java.util.concurrent.ThreadPoolExecutor$Worker.run(ThreadPoolExecutor.java:615)
[ERROR] 	at java.lang.Thread.run(Thread.java:745)
[ERROR] 
[ERROR] -> [Help 1]
[ERROR] 
[ERROR] To see the full stack trace of the errors, re-run Maven with the -e switch.
[ERROR] Re-run Maven using the -X switch to enable full debug logging.
[ERROR] 
[ERROR] For more information about the errors and possible solutions, please read the following
articles:
[ERROR] [Help 1] http://cwiki.apache.org/confluence/display/MAVEN/MojoFailureException
[ERROR] 
[ERROR] After correcting the problems, you can resume the build with the command
[ERROR]   mvn <goals> -rf :phoenix-core
Build step 'Invoke top-level Maven targets' marked build as failure
Archiving artifacts
[Fast Archiver] Compressed -845466757 B of artifacts by 188.2% relative to #1733
[JIRA] Updating issue PHOENIX-4095
Recording test results

Mime
View raw message