phoenix-commits mailing list archives

Site index · List index
Message view « Date » · « Thread »
Top « Date » · « Thread »
From Apache Jenkins Server <jenk...@builds.apache.org>
Subject Apache-Phoenix | origin/4.11-HBase-1.2 | Build Still Failing
Date Fri, 07 Jul 2017 06:43:01 GMT
<a href="http://phoenix.apache.org"><img src='http://phoenix.apache.org/images/phoenix-logo-small.png'/></a><br><b>origin/4.11-HBase-1.2</b>
branch build status <b>Still Failing</b>
<hr/>
<b>Source repository</b> https://git-wip-us.apache.org/repos/asf?p=phoenix.git;a=shortlog;h=refs/heads/origin/4.11-HBase-1.2
<hr/>
<b>Compiled Artifacts</b> https://builds.apache.org/job/Phoenix-4.11/lastSuccessfulBuild/artifact/
<hr/>
<b>Test Report</b> https://builds.apache.org/job/Phoenix-4.11/lastCompletedBuild/testReport/
<hr/>
<b>Changes</b><br/>
[samarth] PHOENIX-3938 Don't throw IOException out of coprocessor hooks

[thomas] PHOENIX-3986 UngroupedAggregateRegionObserver.commitBatch() should set


<hr/>
<b>Build times for last couple of runs</b><br/>Latest build time is the
right most | Legend blue: normal, red: test failure, gray: timeout<br/>
<img src='https://builds.apache.org/view/M-R/view/Phoenix/job/Phoenix-4.11/buildTimeGraph/png'/>
<br/>
[...truncated 106.21 KB...]
[INFO] Running org.apache.phoenix.end2end.index.ViewIndexIT
[INFO] Tests run: 8, Failures: 0, Errors: 0, Skipped: 0, Time elapsed: 45.3 s - in org.apache.phoenix.end2end.index.ViewIndexIT
[INFO] Running org.apache.phoenix.end2end.index.txn.MutableRollbackIT
[INFO] Tests run: 16, Failures: 0, Errors: 0, Skipped: 0, Time elapsed: 307.43 s - in org.apache.phoenix.end2end.index.DropColumnIT
[INFO] Running org.apache.phoenix.end2end.index.txn.RollbackIT
[INFO] Tests run: 99, Failures: 0, Errors: 0, Skipped: 0, Time elapsed: 951.909 s - in org.apache.phoenix.end2end.HashJoinIT
[INFO] Tests run: 6, Failures: 0, Errors: 0, Skipped: 0, Time elapsed: 65.371 s - in org.apache.phoenix.end2end.index.txn.MutableRollbackIT
[INFO] Running org.apache.phoenix.end2end.salted.SaltedTableUpsertSelectIT
[INFO] Tests run: 4, Failures: 0, Errors: 0, Skipped: 0, Time elapsed: 150.353 s - in org.apache.phoenix.end2end.index.MutableIndexSplitReverseScanIT
[INFO] Running org.apache.phoenix.end2end.salted.SaltedTableVarLengthRowKeyIT
[INFO] Tests run: 1, Failures: 0, Errors: 0, Skipped: 0, Time elapsed: 2.33 s - in org.apache.phoenix.end2end.salted.SaltedTableVarLengthRowKeyIT
[INFO] Running org.apache.phoenix.iterate.PhoenixQueryTimeoutIT
[INFO] Tests run: 2, Failures: 0, Errors: 0, Skipped: 0, Time elapsed: 5.249 s - in org.apache.phoenix.iterate.PhoenixQueryTimeoutIT
[INFO] Running org.apache.phoenix.iterate.RoundRobinResultIteratorIT
[INFO] Tests run: 6, Failures: 0, Errors: 0, Skipped: 0, Time elapsed: 28.667 s - in org.apache.phoenix.end2end.salted.SaltedTableUpsertSelectIT
[INFO] Tests run: 8, Failures: 0, Errors: 0, Skipped: 0, Time elapsed: 49.494 s - in org.apache.phoenix.end2end.index.txn.RollbackIT
[INFO] Running org.apache.phoenix.rpc.UpdateCacheIT
[INFO] Running org.apache.phoenix.replication.SystemCatalogWALEntryFilterIT
[INFO] Tests run: 2, Failures: 0, Errors: 0, Skipped: 0, Time elapsed: 0.116 s - in org.apache.phoenix.replication.SystemCatalogWALEntryFilterIT
[INFO] Running org.apache.phoenix.trace.PhoenixTracingEndToEndIT
[INFO] Tests run: 7, Failures: 0, Errors: 0, Skipped: 0, Time elapsed: 22.162 s - in org.apache.phoenix.rpc.UpdateCacheIT
[INFO] Running org.apache.phoenix.tx.FlappingTransactionIT
[INFO] Running org.apache.phoenix.trace.PhoenixTableMetricsWriterIT
[INFO] Tests run: 4, Failures: 0, Errors: 0, Skipped: 0, Time elapsed: 6.959 s - in org.apache.phoenix.tx.FlappingTransactionIT
[INFO] Running org.apache.phoenix.tx.ParameterizedTransactionIT
[INFO] Tests run: 2, Failures: 0, Errors: 0, Skipped: 0, Time elapsed: 11.431 s - in org.apache.phoenix.trace.PhoenixTableMetricsWriterIT
[INFO] Running org.apache.phoenix.tx.TransactionIT
[INFO] Tests run: 9, Failures: 0, Errors: 0, Skipped: 0, Time elapsed: 48.46 s - in org.apache.phoenix.iterate.RoundRobinResultIteratorIT
[INFO] Running org.apache.phoenix.tx.TxCheckpointIT
[INFO] Tests run: 67, Failures: 0, Errors: 0, Skipped: 0, Time elapsed: 417.485 s - in org.apache.phoenix.end2end.index.IndexExpressionIT
[INFO] Tests run: 7, Failures: 0, Errors: 0, Skipped: 0, Time elapsed: 45.482 s - in org.apache.phoenix.tx.TransactionIT
[INFO] Tests run: 8, Failures: 0, Errors: 0, Skipped: 0, Time elapsed: 88.055 s - in org.apache.phoenix.trace.PhoenixTracingEndToEndIT
[INFO] Tests run: 64, Failures: 0, Errors: 0, Skipped: 0, Time elapsed: 447.971 s - in org.apache.phoenix.end2end.index.MutableIndexIT
[INFO] Tests run: 102, Failures: 0, Errors: 0, Skipped: 0, Time elapsed: 956.513 s - in org.apache.phoenix.end2end.SortMergeJoinIT
[WARNING] Tests run: 52, Failures: 0, Errors: 0, Skipped: 4, Time elapsed: 204.918 s - in
org.apache.phoenix.tx.ParameterizedTransactionIT
[INFO] Tests run: 40, Failures: 0, Errors: 0, Skipped: 0, Time elapsed: 272.864 s - in org.apache.phoenix.tx.TxCheckpointIT
[INFO] Tests run: 304, Failures: 0, Errors: 0, Skipped: 0, Time elapsed: 1,950.54 s - in org.apache.phoenix.end2end.index.IndexIT
[INFO] 
[INFO] Results:
[INFO] 
[WARNING] Tests run: 2069, Failures: 0, Errors: 0, Skipped: 4
[INFO] 
[INFO] 
[INFO] --- maven-failsafe-plugin:2.20:integration-test (ClientManagedTimeTests) @ phoenix-core
---
[INFO] 
[INFO] -------------------------------------------------------
[INFO]  T E S T S
[INFO] -------------------------------------------------------
[INFO] Running org.apache.phoenix.end2end.ColumnProjectionOptimizationIT
[INFO] Running org.apache.phoenix.end2end.ArrayIT
[INFO] Running org.apache.phoenix.end2end.CreateTableIT
[INFO] Running org.apache.phoenix.end2end.CreateSchemaIT
[INFO] Running org.apache.phoenix.end2end.CaseStatementIT
[INFO] Running org.apache.phoenix.end2end.CastAndCoerceIT
[INFO] Tests run: 1, Failures: 0, Errors: 0, Skipped: 0, Time elapsed: 1.388 s - in org.apache.phoenix.end2end.CreateSchemaIT
[INFO] Running org.apache.phoenix.end2end.CustomEntityDataIT
[INFO] Running org.apache.phoenix.end2end.AggregateQueryIT
[INFO] Running org.apache.phoenix.end2end.ClientTimeArithmeticQueryIT
[INFO] Tests run: 3, Failures: 0, Errors: 0, Skipped: 0, Time elapsed: 10.277 s - in org.apache.phoenix.end2end.CustomEntityDataIT
[INFO] Running org.apache.phoenix.end2end.DerivedTableIT
[INFO] Tests run: 3, Failures: 0, Errors: 0, Skipped: 0, Time elapsed: 33.887 s - in org.apache.phoenix.end2end.ColumnProjectionOptimizationIT
[INFO] Running org.apache.phoenix.end2end.DistinctCountIT
[INFO] Tests run: 18, Failures: 0, Errors: 0, Skipped: 0, Time elapsed: 35.198 s - in org.apache.phoenix.end2end.DerivedTableIT
[INFO] Running org.apache.phoenix.end2end.DropSchemaIT
[INFO] Tests run: 10, Failures: 0, Errors: 0, Skipped: 0, Time elapsed: 26.469 s - in org.apache.phoenix.end2end.DistinctCountIT
[INFO] Running org.apache.phoenix.end2end.ExtendedQueryExecIT
[INFO] Tests run: 2, Failures: 0, Errors: 0, Skipped: 0, Time elapsed: 12.178 s - in org.apache.phoenix.end2end.DropSchemaIT
[INFO] Running org.apache.phoenix.end2end.FunkyNamesIT
[INFO] Tests run: 4, Failures: 0, Errors: 0, Skipped: 0, Time elapsed: 8.588 s - in org.apache.phoenix.end2end.ExtendedQueryExecIT
[INFO] Tests run: 3, Failures: 0, Errors: 0, Skipped: 0, Time elapsed: 6.156 s - in org.apache.phoenix.end2end.FunkyNamesIT
[INFO] Running org.apache.phoenix.end2end.GroupByIT
[INFO] Running org.apache.phoenix.end2end.MutableQueryIT
[INFO] Tests run: 80, Failures: 0, Errors: 0, Skipped: 0, Time elapsed: 122.902 s - in org.apache.phoenix.end2end.ArrayIT
[INFO] Tests run: 49, Failures: 0, Errors: 0, Skipped: 0, Time elapsed: 118.88 s - in org.apache.phoenix.end2end.CastAndCoerceIT
[INFO] Tests run: 56, Failures: 0, Errors: 0, Skipped: 0, Time elapsed: 121.132 s - in org.apache.phoenix.end2end.CaseStatementIT
[INFO] Running org.apache.phoenix.end2end.NotQueryIT
[INFO] Running org.apache.phoenix.end2end.PointInTimeQueryIT
[INFO] Running org.apache.phoenix.end2end.NativeHBaseTypesIT
[INFO] Tests run: 7, Failures: 0, Errors: 0, Skipped: 0, Time elapsed: 7.838 s - in org.apache.phoenix.end2end.NativeHBaseTypesIT
[INFO] Running org.apache.phoenix.end2end.ProductMetricsIT
[INFO] Tests run: 42, Failures: 0, Errors: 0, Skipped: 0, Time elapsed: 131.792 s - in org.apache.phoenix.end2end.AggregateQueryIT
[INFO] Running org.apache.phoenix.end2end.QueryDatabaseMetaDataIT
[INFO] Tests run: 7, Failures: 0, Errors: 0, Skipped: 0, Time elapsed: 46.578 s - in org.apache.phoenix.end2end.PointInTimeQueryIT
[INFO] Running org.apache.phoenix.end2end.QueryIT
[INFO] Tests run: 19, Failures: 0, Errors: 0, Skipped: 0, Time elapsed: 180.235 s - in org.apache.phoenix.end2end.CreateTableIT
[INFO] Running org.apache.phoenix.end2end.ReadIsolationLevelIT
[INFO] Tests run: 61, Failures: 0, Errors: 0, Skipped: 0, Time elapsed: 45.104 s - in org.apache.phoenix.end2end.ProductMetricsIT
[INFO] Tests run: 2, Failures: 0, Errors: 0, Skipped: 0, Time elapsed: 6.189 s - in org.apache.phoenix.end2end.ReadIsolationLevelIT
[INFO] Running org.apache.phoenix.end2end.RowValueConstructorIT
[INFO] Tests run: 77, Failures: 0, Errors: 0, Skipped: 0, Time elapsed: 81.869 s - in org.apache.phoenix.end2end.NotQueryIT
[INFO] Tests run: 91, Failures: 0, Errors: 0, Skipped: 0, Time elapsed: 132.249 s - in org.apache.phoenix.end2end.GroupByIT
[INFO] Running org.apache.phoenix.end2end.ScanQueryIT
[INFO] Running org.apache.phoenix.end2end.SequenceIT
[INFO] Running org.apache.phoenix.end2end.SequenceBulkAllocationIT
[INFO] Tests run: 245, Failures: 0, Errors: 0, Skipped: 0, Time elapsed: 234.977 s - in org.apache.phoenix.end2end.ClientTimeArithmeticQueryIT
[INFO] Running org.apache.phoenix.end2end.ToNumberFunctionIT
[INFO] Tests run: 19, Failures: 0, Errors: 0, Skipped: 0, Time elapsed: 132.599 s - in org.apache.phoenix.end2end.QueryDatabaseMetaDataIT
[INFO] Running org.apache.phoenix.end2end.TopNIT
[INFO] Tests run: 112, Failures: 0, Errors: 0, Skipped: 0, Time elapsed: 101.94 s - in org.apache.phoenix.end2end.QueryIT
[INFO] Tests run: 4, Failures: 0, Errors: 0, Skipped: 0, Time elapsed: 8.885 s - in org.apache.phoenix.end2end.TopNIT
[INFO] Tests run: 18, Failures: 0, Errors: 0, Skipped: 0, Time elapsed: 10.993 s - in org.apache.phoenix.end2end.ToNumberFunctionIT
[INFO] Running org.apache.phoenix.end2end.TruncateFunctionIT
[INFO] Running org.apache.phoenix.end2end.UpsertSelectIT
[INFO] Tests run: 1, Failures: 0, Errors: 0, Skipped: 0, Time elapsed: 5.178 s - in org.apache.phoenix.end2end.TruncateFunctionIT
[INFO] Running org.apache.phoenix.end2end.VariableLengthPKIT
[INFO] Tests run: 56, Failures: 0, Errors: 0, Skipped: 0, Time elapsed: 48.424 s - in org.apache.phoenix.end2end.SequenceBulkAllocationIT
[INFO] Running org.apache.phoenix.end2end.salted.SaltedTableIT
[INFO] Tests run: 54, Failures: 0, Errors: 0, Skipped: 0, Time elapsed: 54.391 s - in org.apache.phoenix.end2end.SequenceIT
[INFO] Running org.apache.phoenix.rpc.UpdateCacheWithScnIT
[INFO] Tests run: 8, Failures: 0, Errors: 0, Skipped: 0, Time elapsed: 8.22 s - in org.apache.phoenix.end2end.salted.SaltedTableIT
[INFO] Tests run: 1, Failures: 0, Errors: 0, Skipped: 0, Time elapsed: 6.1 s - in org.apache.phoenix.rpc.UpdateCacheWithScnIT
[INFO] Running org.apache.phoenix.end2end.UpsertValuesIT
[INFO] Tests run: 112, Failures: 0, Errors: 0, Skipped: 0, Time elapsed: 235.565 s - in org.apache.phoenix.end2end.MutableQueryIT
[INFO] Tests run: 46, Failures: 0, Errors: 0, Skipped: 0, Time elapsed: 136.934 s - in org.apache.phoenix.end2end.RowValueConstructorIT
[INFO] Tests run: 112, Failures: 0, Errors: 0, Skipped: 0, Time elapsed: 117.197 s - in org.apache.phoenix.end2end.ScanQueryIT
[INFO] Tests run: 50, Failures: 0, Errors: 0, Skipped: 0, Time elapsed: 58.918 s - in org.apache.phoenix.end2end.VariableLengthPKIT
[INFO] Tests run: 24, Failures: 0, Errors: 0, Skipped: 0, Time elapsed: 138.536 s - in org.apache.phoenix.end2end.UpsertSelectIT
[INFO] Tests run: 25, Failures: 0, Errors: 0, Skipped: 0, Time elapsed: 115.36 s - in org.apache.phoenix.end2end.UpsertValuesIT
[INFO] 
[INFO] Results:
[INFO] 
[INFO] Tests run: 1422, Failures: 0, Errors: 0, Skipped: 0
[INFO] 
[INFO] 
[INFO] --- maven-failsafe-plugin:2.20:integration-test (HBaseManagedTimeTests) @ phoenix-core
---
[INFO] 
[INFO] -------------------------------------------------------
[INFO]  T E S T S
[INFO] -------------------------------------------------------
[INFO] 
[INFO] Results:
[INFO] 
[INFO] Tests run: 0, Failures: 0, Errors: 0, Skipped: 0
[INFO] 
[INFO] 
[INFO] --- maven-failsafe-plugin:2.20:integration-test (NeedTheirOwnClusterTests) @ phoenix-core
---
[INFO] 
[INFO] -------------------------------------------------------
[INFO]  T E S T S
[INFO] -------------------------------------------------------
[INFO] Running org.apache.hadoop.hbase.regionserver.wal.WALReplayWithIndexWritesAndCompressedWALIT
[INFO] Running org.apache.phoenix.end2end.ConnectionUtilIT
[INFO] Tests run: 1, Failures: 0, Errors: 0, Skipped: 0, Time elapsed: 45.874 s - in org.apache.hadoop.hbase.regionserver.wal.WALReplayWithIndexWritesAndCompressedWALIT
[INFO] Running org.apache.phoenix.end2end.CountDistinctCompressionIT
[INFO] Running org.apache.phoenix.end2end.CsvBulkLoadToolIT
[INFO] Tests run: 1, Failures: 0, Errors: 0, Skipped: 0, Time elapsed: 23.929 s - in org.apache.phoenix.end2end.ConnectionUtilIT
[INFO] Running org.apache.phoenix.end2end.ContextClassloaderIT
[INFO] Tests run: 3, Failures: 0, Errors: 0, Skipped: 0, Time elapsed: 2.963 s - in org.apache.phoenix.end2end.ContextClassloaderIT
[INFO] Tests run: 1, Failures: 0, Errors: 0, Skipped: 0, Time elapsed: 13.656 s - in org.apache.phoenix.end2end.CountDistinctCompressionIT
[INFO] Running org.apache.phoenix.end2end.FlappingLocalIndexIT
[INFO] Running org.apache.phoenix.end2end.IndexToolForPartialBuildIT
[INFO] Running org.apache.phoenix.end2end.IndexExtendedIT
[INFO] Running org.apache.phoenix.end2end.IndexToolForPartialBuildWithNamespaceEnabledIT
[INFO] Tests run: 2, Failures: 0, Errors: 0, Skipped: 0, Time elapsed: 45.176 s - in org.apache.phoenix.end2end.IndexToolForPartialBuildIT
[INFO] Running org.apache.phoenix.end2end.QueryTimeoutIT
[INFO] Tests run: 2, Failures: 0, Errors: 0, Skipped: 0, Time elapsed: 45.054 s - in org.apache.phoenix.end2end.IndexToolForPartialBuildWithNamespaceEnabledIT
[INFO] Running org.apache.phoenix.end2end.QueryWithLimitIT
[INFO] Running org.apache.phoenix.end2end.RegexBulkLoadToolIT
[INFO] Tests run: 2, Failures: 0, Errors: 0, Skipped: 0, Time elapsed: 13.861 s - in org.apache.phoenix.end2end.QueryWithLimitIT
[INFO] Tests run: 11, Failures: 0, Errors: 0, Skipped: 0, Time elapsed: 97.34 s - in org.apache.phoenix.end2end.CsvBulkLoadToolIT
[INFO] Tests run: 8, Failures: 0, Errors: 0, Skipped: 0, Time elapsed: 84.584 s - in org.apache.phoenix.end2end.FlappingLocalIndexIT
[INFO] Running org.apache.phoenix.end2end.RenewLeaseIT
[INFO] Tests run: 2, Failures: 0, Errors: 0, Skipped: 0, Time elapsed: 55.279 s - in org.apache.phoenix.end2end.QueryTimeoutIT
[INFO] Running org.apache.phoenix.end2end.SpillableGroupByIT
[INFO] Running org.apache.phoenix.end2end.StatsCollectorIT
[INFO] Tests run: 1, Failures: 0, Errors: 0, Skipped: 0, Time elapsed: 29.382 s - in org.apache.phoenix.end2end.RenewLeaseIT
[INFO] Running org.apache.phoenix.end2end.SysTableNamespaceMappedStatsCollectorIT
[INFO] Tests run: 2, Failures: 0, Errors: 0, Skipped: 0, Time elapsed: 22.002 s - in org.apache.phoenix.end2end.SpillableGroupByIT
[INFO] Tests run: 10, Failures: 0, Errors: 0, Skipped: 0, Time elapsed: 95.951 s - in org.apache.phoenix.end2end.RegexBulkLoadToolIT
[INFO] Running org.apache.phoenix.end2end.UpdateCacheAcrossDifferentClientsIT
[INFO] Running org.apache.phoenix.end2end.UserDefinedFunctionsIT
[INFO] Running org.apache.phoenix.end2end.index.ImmutableIndexIT
[INFO] Tests run: 6, Failures: 0, Errors: 0, Skipped: 0, Time elapsed: 34.971 s - in org.apache.phoenix.end2end.UpdateCacheAcrossDifferentClientsIT
[INFO] Running org.apache.phoenix.end2end.index.LocalIndexIT
[INFO] Running org.apache.phoenix.end2end.index.MutableIndexFailureIT
[INFO] Tests run: 14, Failures: 0, Errors: 0, Skipped: 0, Time elapsed: 44.098 s - in org.apache.phoenix.end2end.UserDefinedFunctionsIT
[INFO] Running org.apache.phoenix.end2end.index.MutableIndexReplicationIT
[INFO] Tests run: 1, Failures: 0, Errors: 0, Skipped: 0, Time elapsed: 26.484 s - in org.apache.phoenix.end2end.index.MutableIndexReplicationIT
[INFO] Running org.apache.phoenix.end2end.index.txn.TxWriteFailureIT
[INFO] Running org.apache.phoenix.execute.PartialCommitIT
[INFO] Tests run: 8, Failures: 0, Errors: 0, Skipped: 0, Time elapsed: 58.718 s - in org.apache.phoenix.end2end.index.txn.TxWriteFailureIT
[INFO] Tests run: 12, Failures: 0, Errors: 0, Skipped: 0, Time elapsed: 10.199 s - in org.apache.phoenix.execute.PartialCommitIT
[INFO] Running org.apache.phoenix.hbase.index.FailForUnsupportedHBaseVersionsIT
[INFO] Tests run: 2, Failures: 0, Errors: 0, Skipped: 0, Time elapsed: 28.824 s - in org.apache.phoenix.hbase.index.FailForUnsupportedHBaseVersionsIT
[INFO] Running org.apache.phoenix.execute.UpsertSelectOverlappingBatchesIT
[INFO] Running org.apache.phoenix.hbase.index.covered.EndToEndCoveredColumnsIndexBuilderIT
[INFO] Tests run: 2, Failures: 0, Errors: 0, Skipped: 0, Time elapsed: 11.079 s - in org.apache.phoenix.hbase.index.covered.EndToEndCoveredColumnsIndexBuilderIT
[INFO] Tests run: 1, Failures: 0, Errors: 0, Skipped: 0, Time elapsed: 26.925 s - in org.apache.phoenix.execute.UpsertSelectOverlappingBatchesIT
[INFO] Running org.apache.phoenix.hbase.index.covered.example.EndToEndCoveredIndexingIT
[INFO] Running org.apache.phoenix.hbase.index.covered.example.EndtoEndIndexingWithCompressionIT
[INFO] Tests run: 24, Failures: 0, Errors: 0, Skipped: 0, Time elapsed: 300.438 s - in org.apache.phoenix.end2end.index.ImmutableIndexIT
[WARNING] Tests run: 132, Failures: 0, Errors: 0, Skipped: 24, Time elapsed: 365.618 s - in
org.apache.phoenix.end2end.StatsCollectorIT
[INFO] Tests run: 140, Failures: 0, Errors: 0, Skipped: 0, Time elapsed: 501.02 s - in org.apache.phoenix.end2end.IndexExtendedIT
[WARNING] Tests run: 132, Failures: 0, Errors: 0, Skipped: 24, Time elapsed: 373.429 s - in
org.apache.phoenix.end2end.SysTableNamespaceMappedStatsCollectorIT
[INFO] Tests run: 32, Failures: 0, Errors: 0, Skipped: 0, Time elapsed: 308.02 s - in org.apache.phoenix.end2end.index.LocalIndexIT
[INFO] Running org.apache.phoenix.hbase.index.covered.example.FailWithoutRetriesIT
[INFO] Tests run: 1, Failures: 0, Errors: 0, Skipped: 0, Time elapsed: 2.539 s - in org.apache.phoenix.hbase.index.covered.example.FailWithoutRetriesIT
[INFO] Running org.apache.phoenix.iterate.RoundRobinResultIteratorWithStatsIT
[INFO] Running org.apache.phoenix.iterate.ScannerLeaseRenewalIT
[INFO] Running org.apache.phoenix.monitoring.PhoenixMetricsIT
[INFO] Running org.apache.phoenix.rpc.PhoenixClientRpcIT
[INFO] Running org.apache.phoenix.rpc.PhoenixServerRpcIT
[INFO] Tests run: 2, Failures: 0, Errors: 0, Skipped: 0, Time elapsed: 15.442 s - in org.apache.phoenix.rpc.PhoenixClientRpcIT
[INFO] Tests run: 1, Failures: 0, Errors: 0, Skipped: 0, Time elapsed: 34.734 s - in org.apache.phoenix.iterate.RoundRobinResultIteratorWithStatsIT
[INFO] Tests run: 11, Failures: 0, Errors: 0, Skipped: 0, Time elapsed: 122.363 s - in org.apache.phoenix.hbase.index.covered.example.EndToEndCoveredIndexingIT
[INFO] Tests run: 2, Failures: 0, Errors: 0, Skipped: 0, Time elapsed: 24.294 s - in org.apache.phoenix.rpc.PhoenixServerRpcIT
[INFO] Tests run: 11, Failures: 0, Errors: 0, Skipped: 0, Time elapsed: 123.311 s - in org.apache.phoenix.hbase.index.covered.example.EndtoEndIndexingWithCompressionIT
[INFO] Tests run: 21, Failures: 0, Errors: 0, Skipped: 0, Time elapsed: 72.481 s - in org.apache.phoenix.monitoring.PhoenixMetricsIT
[INFO] Tests run: 2, Failures: 0, Errors: 0, Skipped: 0, Time elapsed: 161.368 s - in org.apache.phoenix.iterate.ScannerLeaseRenewalIT
FATAL: command execution failed
hudson.remoting.ProxyException: java.util.concurrent.TimeoutException: Ping started at 1499409541366
hasn't completed by 1499409781367
Caused: Command close created at
	at hudson.remoting.Command.<init>(Command.java:60)
	at hudson.remoting.Channel$CloseCommand.<init>(Channel.java:1123)
	at hudson.remoting.Channel$CloseCommand.<init>(Channel.java:1121)
	at hudson.remoting.Channel.close(Channel.java:1281)
	at hudson.slaves.ChannelPinger$1.onDead(ChannelPinger.java:180)
	at hudson.remoting.PingThread.ping(PingThread.java:130)
	at hudson.remoting.PingThread.run(PingThread.java:86)
Caused: hudson.remoting.Channel$OrderlyShutdown: hudson.remoting.ProxyException: java.util.concurrent.TimeoutException:
Ping started at 1499409541366 hasn't completed by 1499409781367
	at hudson.remoting.Channel$CloseCommand.execute(Channel.java:1129)
	at hudson.remoting.Channel$1.handle(Channel.java:527)
	at hudson.remoting.SynchronousCommandTransport$ReaderThread.run(SynchronousCommandTransport.java:83)
Caused: java.io.IOException: Backing channel 'qnode1' is disconnected.
	at hudson.remoting.RemoteInvocationHandler.channelOrFail(RemoteInvocationHandler.java:192)
	at hudson.remoting.RemoteInvocationHandler.invoke(RemoteInvocationHandler.java:257)
	at com.sun.proxy.$Proxy197.isAlive(Unknown Source)
	at hudson.Launcher$RemoteLauncher$ProcImpl.isAlive(Launcher.java:1043)
	at hudson.Launcher$RemoteLauncher$ProcImpl.join(Launcher.java:1035)
	at hudson.Launcher$ProcStarter.join(Launcher.java:399)
	at hudson.tasks.Maven.perform(Maven.java:367)
	at hudson.tasks.BuildStepMonitor$1.perform(BuildStepMonitor.java:20)
	at hudson.model.AbstractBuild$AbstractBuildExecution.perform(AbstractBuild.java:779)
	at hudson.model.Build$BuildExecution.build(Build.java:206)
	at hudson.model.Build$BuildExecution.doRun(Build.java:163)
	at hudson.model.AbstractBuild$AbstractBuildExecution.run(AbstractBuild.java:534)
	at hudson.model.Run.execute(Run.java:1728)
	at hudson.model.FreeStyleBuild.run(FreeStyleBuild.java:43)
	at hudson.model.ResourceController.execute(ResourceController.java:98)
	at hudson.model.Executor.run(Executor.java:405)
Build step 'Invoke top-level Maven targets' marked build as failure
ERROR: Step ‘Archive the artifacts’ failed: no workspace for Phoenix-4.11 #23
ERROR: Step ‘Publish JUnit test result report’ failed: no workspace for Phoenix-4.11 #23
ERROR: qnode1 is offline; cannot locate JDK 1.7 (latest)
Email was triggered for: Failure - Any
Sending email for trigger: Failure - Any
ERROR: qnode1 is offline; cannot locate JDK 1.7 (latest)
ERROR: qnode1 is offline; cannot locate JDK 1.7 (latest)
Mime
  • Unnamed multipart/mixed (inline, None, 0 bytes)
View raw message