phoenix-commits mailing list archives

Site index · List index
Message view « Date » · « Thread »
Top « Date » · « Thread »
From Apache Jenkins Server <jenk...@builds.apache.org>
Subject Build failed in Jenkins: Phoenix | 4.x-HBase-0.98 #1555
Date Thu, 06 Jul 2017 22:03:24 GMT
See <https://builds.apache.org/job/Phoenix-4.x-HBase-0.98/1555/display/redirect?page=changes>

Changes:

[samarth] PHOENIX-3938 Don't throw IOException out of coprocessor hooks

------------------------------------------
[...truncated 52.80 KB...]
[INFO] Running org.apache.phoenix.util.PhoenixEncodeDecodeTest
[INFO] Tests run: 4, Failures: 0, Errors: 0, Skipped: 0, Time elapsed: 0.29 s - in org.apache.phoenix.util.PhoenixEncodeDecodeTest
[INFO] Running org.apache.phoenix.util.json.JsonUpsertExecutorTest
[INFO] Tests run: 8, Failures: 0, Errors: 0, Skipped: 0, Time elapsed: 0.351 s - in org.apache.phoenix.util.json.JsonUpsertExecutorTest
[INFO] Running org.apache.phoenix.util.StringUtilTest
[INFO] Tests run: 5, Failures: 0, Errors: 0, Skipped: 0, Time elapsed: 0.006 s - in org.apache.phoenix.util.StringUtilTest
[INFO] Running org.apache.phoenix.util.PropertiesUtilTest
[INFO] Tests run: 3, Failures: 0, Errors: 0, Skipped: 0, Time elapsed: 0.023 s - in org.apache.phoenix.util.PropertiesUtilTest
[INFO] Running org.apache.phoenix.util.PrefixByteEncoderDecoderTest
[INFO] Tests run: 3, Failures: 0, Errors: 0, Skipped: 0, Time elapsed: 0.004 s - in org.apache.phoenix.util.PrefixByteEncoderDecoderTest
[INFO] Running org.apache.phoenix.util.SequenceUtilTest
[INFO] Tests run: 18, Failures: 0, Errors: 0, Skipped: 0, Time elapsed: 0.007 s - in org.apache.phoenix.util.SequenceUtilTest
[INFO] Running org.apache.phoenix.util.Base62EncoderTest
[INFO] Tests run: 1, Failures: 0, Errors: 0, Skipped: 0, Time elapsed: 0.014 s - in org.apache.phoenix.util.Base62EncoderTest
[INFO] Running org.apache.phoenix.util.DateUtilTest
[INFO] Tests run: 22, Failures: 0, Errors: 0, Skipped: 0, Time elapsed: 0.029 s - in org.apache.phoenix.util.DateUtilTest
[INFO] Running org.apache.phoenix.util.QueryUtilTest
[INFO] Tests run: 9, Failures: 0, Errors: 0, Skipped: 0, Time elapsed: 0.005 s - in org.apache.phoenix.util.QueryUtilTest
[INFO] Running org.apache.phoenix.util.JDBCUtilTest
[INFO] Tests run: 11, Failures: 0, Errors: 0, Skipped: 0, Time elapsed: 0.005 s - in org.apache.phoenix.util.JDBCUtilTest
[INFO] Running org.apache.phoenix.util.PhoenixContextExecutorTest
[INFO] Tests run: 1, Failures: 0, Errors: 0, Skipped: 0, Time elapsed: 0.01 s - in org.apache.phoenix.util.PhoenixContextExecutorTest
[INFO] Running org.apache.phoenix.util.IndexUtilTest
[INFO] Tests run: 2, Failures: 0, Errors: 0, Skipped: 0, Time elapsed: 0.003 s - in org.apache.phoenix.util.IndexUtilTest
[INFO] Running org.apache.phoenix.compile.QueryMetaDataTest
[INFO] Tests run: 32, Failures: 0, Errors: 0, Skipped: 0, Time elapsed: 0.354 s - in org.apache.phoenix.compile.QueryMetaDataTest
[INFO] Running org.apache.phoenix.compile.QueryCompilerTest
[INFO] Tests run: 12, Failures: 0, Errors: 0, Skipped: 0, Time elapsed: 1.501 s - in org.apache.phoenix.util.PhoenixRuntimeTest
[INFO] Running org.apache.phoenix.compile.CreateTableCompilerTest
[INFO] Tests run: 1, Failures: 0, Errors: 0, Skipped: 0, Time elapsed: 0.381 s - in org.apache.phoenix.compile.CreateTableCompilerTest
[INFO] Running org.apache.phoenix.compile.HavingCompilerTest
[INFO] Tests run: 11, Failures: 0, Errors: 0, Skipped: 0, Time elapsed: 0.33 s - in org.apache.phoenix.compile.HavingCompilerTest
[INFO] Running org.apache.phoenix.compile.ViewCompilerTest
[INFO] Tests run: 3, Failures: 0, Errors: 0, Skipped: 0, Time elapsed: 0.407 s - in org.apache.phoenix.compile.ViewCompilerTest
[INFO] Running org.apache.phoenix.compile.LimitCompilerTest
[INFO] Tests run: 6, Failures: 0, Errors: 0, Skipped: 0, Time elapsed: 0.372 s - in org.apache.phoenix.compile.LimitCompilerTest
[INFO] Running org.apache.phoenix.compile.SelectStatementRewriterTest
[INFO] Tests run: 5, Failures: 0, Errors: 0, Skipped: 0, Time elapsed: 0.377 s - in org.apache.phoenix.compile.SelectStatementRewriterTest
[INFO] Running org.apache.phoenix.compile.SaltedScanRangesTest
[INFO] Tests run: 9, Failures: 0, Errors: 0, Skipped: 0, Time elapsed: 0.011 s - in org.apache.phoenix.compile.SaltedScanRangesTest
[INFO] Running org.apache.phoenix.compile.QueryOptimizerTest
[INFO] Tests run: 47, Failures: 0, Errors: 0, Skipped: 0, Time elapsed: 1.708 s - in org.apache.phoenix.compile.QueryOptimizerTest
[INFO] Running org.apache.phoenix.compile.WhereCompilerTest
[INFO] Tests run: 157, Failures: 0, Errors: 0, Skipped: 0, Time elapsed: 3.656 s - in org.apache.phoenix.compile.QueryCompilerTest
[INFO] Running org.apache.phoenix.compile.CursorCompilerTest
[INFO] Tests run: 1, Failures: 0, Errors: 0, Skipped: 0, Time elapsed: 0.192 s - in org.apache.phoenix.compile.CursorCompilerTest
[INFO] Running org.apache.phoenix.compile.TenantSpecificViewIndexCompileTest
[WARNING] Tests run: 45, Failures: 0, Errors: 0, Skipped: 1, Time elapsed: 0.402 s - in org.apache.phoenix.compile.WhereCompilerTest
[INFO] Running org.apache.phoenix.compile.JoinQueryCompilerTest
[INFO] Tests run: 6, Failures: 0, Errors: 0, Skipped: 0, Time elapsed: 0.413 s - in org.apache.phoenix.compile.TenantSpecificViewIndexCompileTest
[INFO] Running org.apache.phoenix.compile.WhereOptimizerTest
[INFO] Tests run: 2, Failures: 0, Errors: 0, Skipped: 0, Time elapsed: 0.271 s - in org.apache.phoenix.compile.JoinQueryCompilerTest
[INFO] Running org.apache.phoenix.compile.ScanRangesIntersectTest
[INFO] Tests run: 1, Failures: 0, Errors: 0, Skipped: 0, Time elapsed: 0.001 s - in org.apache.phoenix.compile.ScanRangesIntersectTest
[INFO] Running org.apache.phoenix.compile.ScanRangesTest
[INFO] Tests run: 34, Failures: 0, Errors: 0, Skipped: 0, Time elapsed: 0.037 s - in org.apache.phoenix.compile.ScanRangesTest
[INFO] Running org.apache.phoenix.compile.StatementHintsCompilationTest
[INFO] Tests run: 4, Failures: 0, Errors: 0, Skipped: 0, Time elapsed: 0.202 s - in org.apache.phoenix.compile.StatementHintsCompilationTest
[INFO] Running org.apache.phoenix.expression.CoerceExpressionTest
[INFO] Tests run: 5, Failures: 0, Errors: 0, Skipped: 0, Time elapsed: 0.004 s - in org.apache.phoenix.expression.CoerceExpressionTest
[INFO] Running org.apache.phoenix.expression.LikeExpressionTest
[INFO] Tests run: 6, Failures: 0, Errors: 0, Skipped: 0, Time elapsed: 0.118 s - in org.apache.phoenix.expression.LikeExpressionTest
[INFO] Running org.apache.phoenix.expression.RegexpSplitFunctionTest
[INFO] Tests run: 1, Failures: 0, Errors: 0, Skipped: 0, Time elapsed: 0.011 s - in org.apache.phoenix.expression.RegexpSplitFunctionTest
[INFO] Running org.apache.phoenix.expression.ArrayConcatFunctionTest
[INFO] Tests run: 109, Failures: 0, Errors: 0, Skipped: 0, Time elapsed: 0.682 s - in org.apache.phoenix.compile.WhereOptimizerTest
[INFO] Running org.apache.phoenix.expression.ArrayAppendFunctionTest
[INFO] Tests run: 35, Failures: 0, Errors: 0, Skipped: 0, Time elapsed: 0.668 s - in org.apache.phoenix.expression.ArrayConcatFunctionTest
[INFO] Running org.apache.phoenix.expression.ArrayFillFunctionTest
[INFO] Tests run: 14, Failures: 0, Errors: 0, Skipped: 0, Time elapsed: 0.013 s - in org.apache.phoenix.expression.ArrayFillFunctionTest
[INFO] Running org.apache.phoenix.expression.SignFunctionTest
[INFO] Tests run: 1, Failures: 0, Errors: 0, Skipped: 0, Time elapsed: 0.012 s - in org.apache.phoenix.expression.SignFunctionTest
[INFO] Running org.apache.phoenix.expression.RegexpReplaceFunctionTest
[INFO] Tests run: 1, Failures: 0, Errors: 0, Skipped: 0, Time elapsed: 0.005 s - in org.apache.phoenix.expression.RegexpReplaceFunctionTest
[INFO] Running org.apache.phoenix.expression.AbsFunctionTest
[INFO] Tests run: 1, Failures: 0, Errors: 0, Skipped: 0, Time elapsed: 0.012 s - in org.apache.phoenix.expression.AbsFunctionTest
[INFO] Running org.apache.phoenix.expression.ILikeExpressionTest
[INFO] Tests run: 3, Failures: 0, Errors: 0, Skipped: 0, Time elapsed: 0.018 s - in org.apache.phoenix.expression.ILikeExpressionTest
[INFO] Running org.apache.phoenix.expression.ArithmeticOperationTest
[INFO] Tests run: 6, Failures: 0, Errors: 0, Skipped: 0, Time elapsed: 0.013 s - in org.apache.phoenix.expression.ArithmeticOperationTest
[INFO] Running org.apache.phoenix.expression.ArrayPrependFunctionTest
[INFO] Tests run: 37, Failures: 0, Errors: 0, Skipped: 0, Time elapsed: 0.1 s - in org.apache.phoenix.expression.ArrayPrependFunctionTest
[INFO] Running org.apache.phoenix.expression.SqrtFunctionTest
[INFO] Tests run: 1, Failures: 0, Errors: 0, Skipped: 0, Time elapsed: 0.007 s - in org.apache.phoenix.expression.SqrtFunctionTest
[INFO] Running org.apache.phoenix.expression.StringToArrayFunctionTest
[INFO] Tests run: 20, Failures: 0, Errors: 0, Skipped: 0, Time elapsed: 0.009 s - in org.apache.phoenix.expression.StringToArrayFunctionTest
[INFO] Running org.apache.phoenix.expression.RoundFloorCeilExpressionsTest
[INFO] Tests run: 25, Failures: 0, Errors: 0, Skipped: 0, Time elapsed: 1.082 s - in org.apache.phoenix.expression.ArrayAppendFunctionTest
[INFO] Running org.apache.phoenix.expression.DeterminismTest
[INFO] Tests run: 1, Failures: 0, Errors: 0, Skipped: 0, Time elapsed: 0.001 s - in org.apache.phoenix.expression.DeterminismTest
[INFO] Running org.apache.phoenix.expression.GetSetByteBitFunctionTest
[INFO] Tests run: 23, Failures: 0, Errors: 0, Skipped: 0, Time elapsed: 0.474 s - in org.apache.phoenix.expression.RoundFloorCeilExpressionsTest
[INFO] Running org.apache.phoenix.expression.RegexpSubstrFunctionTest
[INFO] Tests run: 1, Failures: 0, Errors: 0, Skipped: 0, Time elapsed: 0.003 s - in org.apache.phoenix.expression.RegexpSubstrFunctionTest
[INFO] Running org.apache.phoenix.expression.CbrtFunctionTest
[INFO] Tests run: 1, Failures: 0, Errors: 0, Skipped: 0, Time elapsed: 0.005 s - in org.apache.phoenix.expression.CbrtFunctionTest
[INFO] Running org.apache.phoenix.expression.util.regex.PatternPerformanceTest
[INFO] Tests run: 1, Failures: 0, Errors: 0, Skipped: 0, Time elapsed: 0.002 s - in org.apache.phoenix.expression.util.regex.PatternPerformanceTest
[INFO] Running org.apache.phoenix.expression.ExpFunctionTest
[INFO] Tests run: 1, Failures: 0, Errors: 0, Skipped: 0, Time elapsed: 0.006 s - in org.apache.phoenix.expression.ExpFunctionTest
[INFO] Running org.apache.phoenix.expression.LnLogFunctionTest
[INFO] Tests run: 1, Failures: 0, Errors: 0, Skipped: 0, Time elapsed: 0.018 s - in org.apache.phoenix.expression.LnLogFunctionTest
[INFO] Running org.apache.phoenix.expression.NullValueTest
[INFO] Tests run: 3, Failures: 0, Errors: 0, Skipped: 0, Time elapsed: 0.153 s - in org.apache.phoenix.expression.NullValueTest
[INFO] Running org.apache.phoenix.expression.ArrayConstructorExpressionTest
[INFO] Tests run: 1, Failures: 0, Errors: 0, Skipped: 0, Time elapsed: 0.002 s - in org.apache.phoenix.expression.ArrayConstructorExpressionTest
[INFO] Running org.apache.phoenix.expression.function.InstrFunctionTest
[INFO] Tests run: 1, Failures: 0, Errors: 0, Skipped: 0, Time elapsed: 0.002 s - in org.apache.phoenix.expression.function.InstrFunctionTest
[INFO] Running org.apache.phoenix.expression.function.BuiltinFunctionConstructorTest
[INFO] Tests run: 2, Failures: 0, Errors: 0, Skipped: 0, Time elapsed: 0.059 s - in org.apache.phoenix.expression.function.BuiltinFunctionConstructorTest
[INFO] Running org.apache.phoenix.expression.function.ExternalSqlTypeIdFunctionTest
[INFO] Tests run: 3, Failures: 0, Errors: 0, Skipped: 0, Time elapsed: 0.002 s - in org.apache.phoenix.expression.function.ExternalSqlTypeIdFunctionTest
[INFO] Running org.apache.phoenix.expression.SortOrderExpressionTest
[INFO] Tests run: 24, Failures: 0, Errors: 0, Skipped: 0, Time elapsed: 0.021 s - in org.apache.phoenix.expression.SortOrderExpressionTest
[INFO] Running org.apache.phoenix.expression.OctetLengthFunctionTest
[INFO] Tests run: 1, Failures: 0, Errors: 0, Skipped: 0, Time elapsed: 0.013 s - in org.apache.phoenix.expression.OctetLengthFunctionTest
[INFO] Running org.apache.phoenix.expression.PowerFunctionTest
[INFO] Tests run: 1, Failures: 0, Errors: 0, Skipped: 0, Time elapsed: 0.012 s - in org.apache.phoenix.expression.PowerFunctionTest
[INFO] Running org.apache.phoenix.expression.ArrayToStringFunctionTest
[INFO] Tests run: 24, Failures: 0, Errors: 0, Skipped: 0, Time elapsed: 0.014 s - in org.apache.phoenix.expression.ArrayToStringFunctionTest
[INFO] Running org.apache.phoenix.expression.ColumnExpressionTest
[INFO] Tests run: 4, Failures: 0, Errors: 0, Skipped: 0, Time elapsed: 0.003 s - in org.apache.phoenix.expression.ColumnExpressionTest
[INFO] Running org.apache.phoenix.iterate.SpoolingResultIteratorTest
[INFO] Tests run: 3, Failures: 0, Errors: 0, Skipped: 0, Time elapsed: 0.011 s - in org.apache.phoenix.iterate.SpoolingResultIteratorTest
[INFO] Running org.apache.phoenix.iterate.RowKeyOrderedAggregateResultIteratorTest
[INFO] Tests run: 4, Failures: 0, Errors: 0, Skipped: 0, Time elapsed: 0.137 s - in org.apache.phoenix.iterate.RowKeyOrderedAggregateResultIteratorTest
[INFO] Running org.apache.phoenix.iterate.ConcatResultIteratorTest
[INFO] Tests run: 2, Failures: 0, Errors: 0, Skipped: 0, Time elapsed: 0 s - in org.apache.phoenix.iterate.ConcatResultIteratorTest
[INFO] Running org.apache.phoenix.iterate.MergeSortResultIteratorTest
[INFO] Tests run: 2, Failures: 0, Errors: 0, Skipped: 0, Time elapsed: 0.003 s - in org.apache.phoenix.iterate.MergeSortResultIteratorTest
[INFO] Running org.apache.phoenix.iterate.AggregateResultScannerTest
[INFO] Tests run: 1, Failures: 0, Errors: 0, Skipped: 0, Time elapsed: 0.132 s - in org.apache.phoenix.iterate.AggregateResultScannerTest
[INFO] Running org.apache.phoenix.trace.TraceMetricsSourceTest
[INFO] Tests run: 3, Failures: 0, Errors: 0, Skipped: 0, Time elapsed: 0.02 s - in org.apache.phoenix.trace.TraceMetricsSourceTest
[INFO] Tests run: 2, Failures: 0, Errors: 0, Skipped: 0, Time elapsed: 2.766 s - in org.apache.phoenix.expression.GetSetByteBitFunctionTest
[INFO] 
[INFO] Results:
[INFO] 
[WARNING] Tests run: 1524, Failures: 0, Errors: 0, Skipped: 6
[INFO] 
[INFO] ------------------------------------------------------------------------
[INFO] Reactor Summary:
[INFO] 
[INFO] Apache Phoenix ..................................... SUCCESS [  6.025 s]
[INFO] Phoenix Core ....................................... FAILURE [01:24 min]
[INFO] Phoenix - Flume .................................... SKIPPED
[INFO] Phoenix - Kafka .................................... SKIPPED
[INFO] Phoenix - Pig ...................................... SKIPPED
[INFO] Phoenix Query Server Client ........................ SKIPPED
[INFO] Phoenix Query Server ............................... SKIPPED
[INFO] Phoenix - Pherf .................................... SKIPPED
[INFO] Phoenix - Spark .................................... SKIPPED
[INFO] Phoenix - Hive ..................................... SKIPPED
[INFO] Phoenix Client ..................................... SKIPPED
[INFO] Phoenix Server ..................................... SKIPPED
[INFO] Phoenix Assembly ................................... SKIPPED
[INFO] Phoenix - Tracing Web Application .................. SKIPPED
[INFO] ------------------------------------------------------------------------
[INFO] BUILD FAILURE
[INFO] ------------------------------------------------------------------------
[INFO] Total time: 01:34 min
[INFO] Finished at: 2017-07-06T21:59:16Z
[INFO] Final Memory: 77M/1825M
[INFO] ------------------------------------------------------------------------
[ERROR] Failed to execute goal org.apache.maven.plugins:maven-surefire-plugin:2.20:test (default-test)
on project phoenix-core: There are test failures.
[ERROR] 
[ERROR] Please refer to <https://builds.apache.org/job/Phoenix-4.x-HBase-0.98/ws/phoenix-core/target/surefire-reports>
for the individual test results.
[ERROR] Please refer to dump files (if any exist) [date]-jvmRun[N].dump, [date].dumpstream
and [date]-jvmRun[N].dumpstream.
[ERROR] ExecutionException The forked VM terminated without properly saying goodbye. VM crash
or System.exit called?
[ERROR] Command was /bin/sh -c cd <https://builds.apache.org/job/Phoenix-4.x-HBase-0.98/ws/phoenix-core>
&& /usr/local/asfpackages/java/jdk1.7.0_80/jre/bin/java -enableassertions -Xmx2250m
-XX:MaxPermSize=128m -Djava.security.egd=file:/dev/./urandom '-Djava.library.path=${hadoop.library.path}:/usr/java/packages/lib/amd64:/usr/lib64:/lib64:/lib:/usr/lib'
-XX:+HeapDumpOnOutOfMemoryError -XX:HeapDumpPath=./target/ -jar <https://builds.apache.org/job/Phoenix-4.x-HBase-0.98/1555/artifact/phoenix-core/target/surefire/surefirebooter8386865364680981427.jar>
<https://builds.apache.org/job/Phoenix-4.x-HBase-0.98/ws/phoenix-core/target/surefire>
2017-07-06T21-58-44_431-jvmRun1 surefire7108993489789788492tmp surefire_45626123309759953959tmp
[ERROR] Error occurred in starting fork, check output in log
[ERROR] Process Exit Code: 1
[ERROR] ExecutionException The forked VM terminated without properly saying goodbye. VM crash
or System.exit called?
[ERROR] Command was /bin/sh -c cd <https://builds.apache.org/job/Phoenix-4.x-HBase-0.98/ws/phoenix-core>
&& /usr/local/asfpackages/java/jdk1.7.0_80/jre/bin/java -enableassertions -Xmx2250m
-XX:MaxPermSize=128m -Djava.security.egd=file:/dev/./urandom '-Djava.library.path=${hadoop.library.path}:/usr/java/packages/lib/amd64:/usr/lib64:/lib64:/lib:/usr/lib'
-XX:+HeapDumpOnOutOfMemoryError -XX:HeapDumpPath=./target/ -jar <https://builds.apache.org/job/Phoenix-4.x-HBase-0.98/1555/artifact/phoenix-core/target/surefire/surefirebooter5509646785831128032.jar>
<https://builds.apache.org/job/Phoenix-4.x-HBase-0.98/ws/phoenix-core/target/surefire>
2017-07-06T21-58-44_431-jvmRun5 surefire526065380938181573tmp surefire_02237357042256200484tmp
[ERROR] Error occurred in starting fork, check output in log
[ERROR] Process Exit Code: 1
[ERROR] ExecutionException The forked VM terminated without properly saying goodbye. VM crash
or System.exit called?
[ERROR] Command was /bin/sh -c cd <https://builds.apache.org/job/Phoenix-4.x-HBase-0.98/ws/phoenix-core>
&& /usr/local/asfpackages/java/jdk1.7.0_80/jre/bin/java -enableassertions -Xmx2250m
-XX:MaxPermSize=128m -Djava.security.egd=file:/dev/./urandom '-Djava.library.path=${hadoop.library.path}:/usr/java/packages/lib/amd64:/usr/lib64:/lib64:/lib:/usr/lib'
-XX:+HeapDumpOnOutOfMemoryError -XX:HeapDumpPath=./target/ -jar <https://builds.apache.org/job/Phoenix-4.x-HBase-0.98/1555/artifact/phoenix-core/target/surefire/surefirebooter8711300524381805949.jar>
<https://builds.apache.org/job/Phoenix-4.x-HBase-0.98/ws/phoenix-core/target/surefire>
2017-07-06T21-58-44_431-jvmRun2 surefire3732945902396193575tmp surefire_12750374951505904547tmp
[ERROR] Error occurred in starting fork, check output in log
[ERROR] Process Exit Code: 1
[ERROR] org.apache.maven.surefire.booter.SurefireBooterForkException: ExecutionException The
forked VM terminated without properly saying goodbye. VM crash or System.exit called?
[ERROR] Command was /bin/sh -c cd <https://builds.apache.org/job/Phoenix-4.x-HBase-0.98/ws/phoenix-core>
&& /usr/local/asfpackages/java/jdk1.7.0_80/jre/bin/java -enableassertions -Xmx2250m
-XX:MaxPermSize=128m -Djava.security.egd=file:/dev/./urandom '-Djava.library.path=${hadoop.library.path}:/usr/java/packages/lib/amd64:/usr/lib64:/lib64:/lib:/usr/lib'
-XX:+HeapDumpOnOutOfMemoryError -XX:HeapDumpPath=./target/ -jar <https://builds.apache.org/job/Phoenix-4.x-HBase-0.98/1555/artifact/phoenix-core/target/surefire/surefirebooter8386865364680981427.jar>
<https://builds.apache.org/job/Phoenix-4.x-HBase-0.98/ws/phoenix-core/target/surefire>
2017-07-06T21-58-44_431-jvmRun1 surefire7108993489789788492tmp surefire_45626123309759953959tmp
[ERROR] Error occurred in starting fork, check output in log
[ERROR] Process Exit Code: 1
[ERROR] ExecutionException The forked VM terminated without properly saying goodbye. VM crash
or System.exit called?
[ERROR] Command was /bin/sh -c cd <https://builds.apache.org/job/Phoenix-4.x-HBase-0.98/ws/phoenix-core>
&& /usr/local/asfpackages/java/jdk1.7.0_80/jre/bin/java -enableassertions -Xmx2250m
-XX:MaxPermSize=128m -Djava.security.egd=file:/dev/./urandom '-Djava.library.path=${hadoop.library.path}:/usr/java/packages/lib/amd64:/usr/lib64:/lib64:/lib:/usr/lib'
-XX:+HeapDumpOnOutOfMemoryError -XX:HeapDumpPath=./target/ -jar <https://builds.apache.org/job/Phoenix-4.x-HBase-0.98/1555/artifact/phoenix-core/target/surefire/surefirebooter5509646785831128032.jar>
<https://builds.apache.org/job/Phoenix-4.x-HBase-0.98/ws/phoenix-core/target/surefire>
2017-07-06T21-58-44_431-jvmRun5 surefire526065380938181573tmp surefire_02237357042256200484tmp
[ERROR] Error occurred in starting fork, check output in log
[ERROR] Process Exit Code: 1
[ERROR] ExecutionException The forked VM terminated without properly saying goodbye. VM crash
or System.exit called?
[ERROR] Command was /bin/sh -c cd <https://builds.apache.org/job/Phoenix-4.x-HBase-0.98/ws/phoenix-core>
&& /usr/local/asfpackages/java/jdk1.7.0_80/jre/bin/java -enableassertions -Xmx2250m
-XX:MaxPermSize=128m -Djava.security.egd=file:/dev/./urandom '-Djava.library.path=${hadoop.library.path}:/usr/java/packages/lib/amd64:/usr/lib64:/lib64:/lib:/usr/lib'
-XX:+HeapDumpOnOutOfMemoryError -XX:HeapDumpPath=./target/ -jar <https://builds.apache.org/job/Phoenix-4.x-HBase-0.98/1555/artifact/phoenix-core/target/surefire/surefirebooter8711300524381805949.jar>
<https://builds.apache.org/job/Phoenix-4.x-HBase-0.98/ws/phoenix-core/target/surefire>
2017-07-06T21-58-44_431-jvmRun2 surefire3732945902396193575tmp surefire_12750374951505904547tmp
[ERROR] Error occurred in starting fork, check output in log
[ERROR] Process Exit Code: 1
[ERROR] 	at org.apache.maven.plugin.surefire.booterclient.ForkStarter.awaitResultsDone(ForkStarter.java:494)
[ERROR] 	at org.apache.maven.plugin.surefire.booterclient.ForkStarter.runSuitesForkOnceMultiple(ForkStarter.java:369)
[ERROR] 	at org.apache.maven.plugin.surefire.booterclient.ForkStarter.run(ForkStarter.java:292)
[ERROR] 	at org.apache.maven.plugin.surefire.booterclient.ForkStarter.run(ForkStarter.java:243)
[ERROR] 	at org.apache.maven.plugin.surefire.AbstractSurefireMojo.executeProvider(AbstractSurefireMojo.java:1077)
[ERROR] 	at org.apache.maven.plugin.surefire.AbstractSurefireMojo.executeAfterPreconditionsChecked(AbstractSurefireMojo.java:907)
[ERROR] 	at org.apache.maven.plugin.surefire.AbstractSurefireMojo.execute(AbstractSurefireMojo.java:785)
[ERROR] 	at org.apache.maven.plugin.DefaultBuildPluginManager.executeMojo(DefaultBuildPluginManager.java:134)
[ERROR] 	at org.apache.maven.lifecycle.internal.MojoExecutor.execute(MojoExecutor.java:208)
[ERROR] 	at org.apache.maven.lifecycle.internal.MojoExecutor.execute(MojoExecutor.java:154)
[ERROR] 	at org.apache.maven.lifecycle.internal.MojoExecutor.execute(MojoExecutor.java:146)
[ERROR] 	at org.apache.maven.lifecycle.internal.LifecycleModuleBuilder.buildProject(LifecycleModuleBuilder.java:117)
[ERROR] 	at org.apache.maven.lifecycle.internal.LifecycleModuleBuilder.buildProject(LifecycleModuleBuilder.java:81)
[ERROR] 	at org.apache.maven.lifecycle.internal.builder.singlethreaded.SingleThreadedBuilder.build(SingleThreadedBuilder.java:51)
[ERROR] 	at org.apache.maven.lifecycle.internal.LifecycleStarter.execute(LifecycleStarter.java:128)
[ERROR] 	at org.apache.maven.DefaultMaven.doExecute(DefaultMaven.java:309)
[ERROR] 	at org.apache.maven.DefaultMaven.doExecute(DefaultMaven.java:194)
[ERROR] 	at org.apache.maven.DefaultMaven.execute(DefaultMaven.java:107)
[ERROR] 	at org.apache.maven.cli.MavenCli.execute(MavenCli.java:993)
[ERROR] 	at org.apache.maven.cli.MavenCli.doMain(MavenCli.java:345)
[ERROR] 	at org.apache.maven.cli.MavenCli.main(MavenCli.java:191)
[ERROR] 	at sun.reflect.NativeMethodAccessorImpl.invoke0(Native Method)
[ERROR] 	at sun.reflect.NativeMethodAccessorImpl.invoke(NativeMethodAccessorImpl.java:57)
[ERROR] 	at sun.reflect.DelegatingMethodAccessorImpl.invoke(DelegatingMethodAccessorImpl.java:43)
[ERROR] 	at java.lang.reflect.Method.invoke(Method.java:606)
[ERROR] 	at org.codehaus.plexus.classworlds.launcher.Launcher.launchEnhanced(Launcher.java:289)
[ERROR] 	at org.codehaus.plexus.classworlds.launcher.Launcher.launch(Launcher.java:229)
[ERROR] 	at org.codehaus.plexus.classworlds.launcher.Launcher.mainWithExitCode(Launcher.java:415)
[ERROR] 	at org.codehaus.plexus.classworlds.launcher.Launcher.main(Launcher.java:356)
[ERROR] Caused by: org.apache.maven.surefire.booter.SurefireBooterForkException: The forked
VM terminated without properly saying goodbye. VM crash or System.exit called?
[ERROR] Command was /bin/sh -c cd <https://builds.apache.org/job/Phoenix-4.x-HBase-0.98/ws/phoenix-core>
&& /usr/local/asfpackages/java/jdk1.7.0_80/jre/bin/java -enableassertions -Xmx2250m
-XX:MaxPermSize=128m -Djava.security.egd=file:/dev/./urandom '-Djava.library.path=${hadoop.library.path}:/usr/java/packages/lib/amd64:/usr/lib64:/lib64:/lib:/usr/lib'
-XX:+HeapDumpOnOutOfMemoryError -XX:HeapDumpPath=./target/ -jar <https://builds.apache.org/job/Phoenix-4.x-HBase-0.98/1555/artifact/phoenix-core/target/surefire/surefirebooter8711300524381805949.jar>
<https://builds.apache.org/job/Phoenix-4.x-HBase-0.98/ws/phoenix-core/target/surefire>
2017-07-06T21-58-44_431-jvmRun2 surefire3732945902396193575tmp surefire_12750374951505904547tmp
[ERROR] Error occurred in starting fork, check output in log
[ERROR] Process Exit Code: 1
[ERROR] 	at org.apache.maven.plugin.surefire.booterclient.ForkStarter.fork(ForkStarter.java:679)
[ERROR] 	at org.apache.maven.plugin.surefire.booterclient.ForkStarter.fork(ForkStarter.java:533)
[ERROR] 	at org.apache.maven.plugin.surefire.booterclient.ForkStarter.access$600(ForkStarter.java:117)
[ERROR] 	at org.apache.maven.plugin.surefire.booterclient.ForkStarter$1.call(ForkStarter.java:363)
[ERROR] 	at org.apache.maven.plugin.surefire.booterclient.ForkStarter$1.call(ForkStarter.java:342)
[ERROR] 	at java.util.concurrent.FutureTask.run(FutureTask.java:262)
[ERROR] 	at java.util.concurrent.ThreadPoolExecutor.runWorker(ThreadPoolExecutor.java:1145)
[ERROR] 	at java.util.concurrent.ThreadPoolExecutor$Worker.run(ThreadPoolExecutor.java:615)
[ERROR] 	at java.lang.Thread.run(Thread.java:745)
[ERROR] 
[ERROR] -> [Help 1]
[ERROR] 
[ERROR] To see the full stack trace of the errors, re-run Maven with the -e switch.
[ERROR] Re-run Maven using the -X switch to enable full debug logging.
[ERROR] 
[ERROR] For more information about the errors and possible solutions, please read the following
articles:
[ERROR] [Help 1] http://cwiki.apache.org/confluence/display/MAVEN/MojoExecutionException
[ERROR] 
[ERROR] After correcting the problems, you can resume the build with the command
[ERROR]   mvn <goals> -rf :phoenix-core
Build step 'Invoke top-level Maven targets' marked build as failure
Archiving artifacts
Compressed 2.00 GB of artifacts by 83.6% relative to #1538
Recording test results

Mime
View raw message