phoenix-commits mailing list archives

Site index · List index
Message view « Date » · « Thread »
Top « Date » · « Thread »
From Apache Jenkins Server <jenk...@builds.apache.org>
Subject Build failed in Jenkins: Phoenix-4.x-HBase-1.2 #61
Date Thu, 06 Jul 2017 21:56:43 GMT
See <https://builds.apache.org/job/Phoenix-4.x-HBase-1.2/61/display/redirect?page=changes>

Changes:

[thomas] PHOENIX-3734 Refactor Phoenix to use TAL instead of direct calls to

------------------------------------------
[...truncated 1.73 MB...]
[INFO] Tests run: 61, Failures: 0, Errors: 0, Skipped: 0, Time elapsed: 23.977 s - in org.apache.phoenix.end2end.ProductMetricsIT
[INFO] Running org.apache.phoenix.end2end.TopNIT
[INFO] Tests run: 4, Failures: 0, Errors: 0, Skipped: 0, Time elapsed: 6.404 s - in org.apache.phoenix.end2end.TopNIT
[INFO] Running org.apache.phoenix.end2end.TruncateFunctionIT
[INFO] Tests run: 18, Failures: 0, Errors: 0, Skipped: 0, Time elapsed: 8.987 s - in org.apache.phoenix.end2end.ToNumberFunctionIT
[INFO] Running org.apache.phoenix.end2end.UpsertSelectIT
[INFO] Tests run: 1, Failures: 0, Errors: 0, Skipped: 0, Time elapsed: 5.821 s - in org.apache.phoenix.end2end.TruncateFunctionIT
[INFO] Running org.apache.phoenix.end2end.UpsertValuesIT
[INFO] Tests run: 56, Failures: 0, Errors: 0, Skipped: 0, Time elapsed: 26.203 s - in org.apache.phoenix.end2end.SequenceBulkAllocationIT
[INFO] Running org.apache.phoenix.end2end.VariableLengthPKIT
[INFO] Tests run: 54, Failures: 0, Errors: 0, Skipped: 0, Time elapsed: 51.461 s - in org.apache.phoenix.end2end.SequenceIT
[INFO] Running org.apache.phoenix.end2end.salted.SaltedTableIT
[INFO] Tests run: 8, Failures: 0, Errors: 0, Skipped: 0, Time elapsed: 6.868 s - in org.apache.phoenix.end2end.salted.SaltedTableIT
[INFO] Running org.apache.phoenix.rpc.UpdateCacheWithScnIT
[INFO] Tests run: 80, Failures: 0, Errors: 0, Skipped: 0, Time elapsed: 88.536 s - in org.apache.phoenix.end2end.ArrayIT
[INFO] Tests run: 1, Failures: 0, Errors: 0, Skipped: 0, Time elapsed: 6.22 s - in org.apache.phoenix.rpc.UpdateCacheWithScnIT
[INFO] Tests run: 50, Failures: 0, Errors: 0, Skipped: 0, Time elapsed: 43.433 s - in org.apache.phoenix.end2end.VariableLengthPKIT
[INFO] Tests run: 46, Failures: 0, Errors: 0, Skipped: 0, Time elapsed: 120.93 s - in org.apache.phoenix.end2end.RowValueConstructorIT
[INFO] Tests run: 19, Failures: 0, Errors: 0, Skipped: 0, Time elapsed: 141.101 s - in org.apache.phoenix.end2end.QueryDatabaseMetaDataIT
[INFO] Tests run: 19, Failures: 0, Errors: 0, Skipped: 0, Time elapsed: 170.437 s - in org.apache.phoenix.end2end.CreateTableIT
[INFO] Tests run: 25, Failures: 0, Errors: 0, Skipped: 0, Time elapsed: 121.899 s - in org.apache.phoenix.end2end.UpsertValuesIT
[INFO] Tests run: 24, Failures: 0, Errors: 0, Skipped: 0, Time elapsed: 141.237 s - in org.apache.phoenix.end2end.UpsertSelectIT
[INFO] 
[INFO] Results:
[INFO] 
[INFO] Tests run: 519, Failures: 0, Errors: 0, Skipped: 0
[INFO] 
[INFO] 
[INFO] --- maven-failsafe-plugin:2.20:integration-test (HBaseManagedTimeTests) @ phoenix-core
---
[INFO] 
[INFO] -------------------------------------------------------
[INFO]  T E S T S
[INFO] -------------------------------------------------------
[INFO] 
[INFO] Results:
[INFO] 
[INFO] Tests run: 0, Failures: 0, Errors: 0, Skipped: 0
[INFO] 
[INFO] 
[INFO] --- maven-failsafe-plugin:2.20:integration-test (NeedTheirOwnClusterTests) @ phoenix-core
---
[INFO] 
[INFO] -------------------------------------------------------
[INFO]  T E S T S
[INFO] -------------------------------------------------------
[INFO] Running org.apache.hadoop.hbase.regionserver.wal.WALReplayWithIndexWritesAndCompressedWALIT
[INFO] Running org.apache.phoenix.end2end.ConnectionUtilIT
[INFO] Tests run: 1, Failures: 0, Errors: 0, Skipped: 0, Time elapsed: 27.87 s - in org.apache.hadoop.hbase.regionserver.wal.WALReplayWithIndexWritesAndCompressedWALIT
[INFO] Running org.apache.phoenix.end2end.CountDistinctCompressionIT
[INFO] Running org.apache.phoenix.end2end.CsvBulkLoadToolIT
[INFO] Running org.apache.phoenix.end2end.ContextClassloaderIT
[INFO] Tests run: 1, Failures: 0, Errors: 0, Skipped: 0, Time elapsed: 25.749 s - in org.apache.phoenix.end2end.ConnectionUtilIT
[INFO] Tests run: 3, Failures: 0, Errors: 0, Skipped: 0, Time elapsed: 2.476 s - in org.apache.phoenix.end2end.ContextClassloaderIT
[INFO] Running org.apache.phoenix.end2end.FlappingLocalIndexIT
[INFO] Tests run: 1, Failures: 0, Errors: 0, Skipped: 0, Time elapsed: 7.216 s - in org.apache.phoenix.end2end.CountDistinctCompressionIT
[INFO] Running org.apache.phoenix.end2end.IndexExtendedIT
[INFO] Running org.apache.phoenix.end2end.IndexToolForPartialBuildIT
[INFO] Running org.apache.phoenix.end2end.IndexToolForPartialBuildWithNamespaceEnabledIT
[INFO] Tests run: 2, Failures: 0, Errors: 0, Skipped: 0, Time elapsed: 27.09 s - in org.apache.phoenix.end2end.IndexToolForPartialBuildIT
[INFO] Running org.apache.phoenix.end2end.QueryWithLimitIT
[INFO] Tests run: 2, Failures: 0, Errors: 0, Skipped: 0, Time elapsed: 28.001 s - in org.apache.phoenix.end2end.IndexToolForPartialBuildWithNamespaceEnabledIT
[INFO] Running org.apache.phoenix.end2end.QueryTimeoutIT
[INFO] Running org.apache.phoenix.end2end.RegexBulkLoadToolIT
[INFO] Tests run: 2, Failures: 0, Errors: 0, Skipped: 0, Time elapsed: 7.958 s - in org.apache.phoenix.end2end.QueryWithLimitIT
[INFO] Running org.apache.phoenix.end2end.RenewLeaseIT
[INFO] Tests run: 2, Failures: 0, Errors: 0, Skipped: 0, Time elapsed: 22.818 s - in org.apache.phoenix.end2end.QueryTimeoutIT
[INFO] Tests run: 8, Failures: 0, Errors: 0, Skipped: 0, Time elapsed: 80.109 s - in org.apache.phoenix.end2end.FlappingLocalIndexIT
[INFO] Tests run: 11, Failures: 0, Errors: 0, Skipped: 0, Time elapsed: 86.442 s - in org.apache.phoenix.end2end.CsvBulkLoadToolIT
[INFO] Running org.apache.phoenix.end2end.SpillableGroupByIT
[INFO] Running org.apache.phoenix.end2end.StatsCollectorIT
[INFO] Tests run: 1, Failures: 0, Errors: 0, Skipped: 0, Time elapsed: 37.497 s - in org.apache.phoenix.end2end.RenewLeaseIT
[INFO] Tests run: 2, Failures: 0, Errors: 0, Skipped: 0, Time elapsed: 15.48 s - in org.apache.phoenix.end2end.SpillableGroupByIT
[INFO] Running org.apache.phoenix.end2end.SysTableNamespaceMappedStatsCollectorIT
[INFO] Running org.apache.phoenix.end2end.UpdateCacheAcrossDifferentClientsIT
[INFO] Tests run: 10, Failures: 0, Errors: 0, Skipped: 0, Time elapsed: 75.832 s - in org.apache.phoenix.end2end.RegexBulkLoadToolIT
[INFO] Running org.apache.phoenix.end2end.UserDefinedFunctionsIT
[INFO] Running org.apache.phoenix.end2end.index.ImmutableIndexIT
[INFO] Running org.apache.phoenix.end2end.index.LocalIndexIT
[INFO] Running org.apache.phoenix.end2end.index.MutableIndexFailureIT
[INFO] Tests run: 6, Failures: 0, Errors: 0, Skipped: 0, Time elapsed: 34.939 s - in org.apache.phoenix.end2end.UpdateCacheAcrossDifferentClientsIT
[INFO] Tests run: 14, Failures: 0, Errors: 0, Skipped: 0, Time elapsed: 52.721 s - in org.apache.phoenix.end2end.UserDefinedFunctionsIT
[INFO] Running org.apache.phoenix.end2end.index.MutableIndexReplicationIT
[INFO] Tests run: 1, Failures: 0, Errors: 0, Skipped: 0, Time elapsed: 24.903 s - in org.apache.phoenix.end2end.index.MutableIndexReplicationIT
[INFO] Running org.apache.phoenix.end2end.index.txn.TxWriteFailureIT
[INFO] Running org.apache.phoenix.execute.PartialCommitIT
[INFO] Tests run: 12, Failures: 0, Errors: 0, Skipped: 0, Time elapsed: 11.38 s - in org.apache.phoenix.execute.PartialCommitIT
[INFO] Running org.apache.phoenix.hbase.index.FailForUnsupportedHBaseVersionsIT
[INFO] Tests run: 8, Failures: 0, Errors: 0, Skipped: 0, Time elapsed: 67.34 s - in org.apache.phoenix.end2end.index.txn.TxWriteFailureIT
[INFO] Tests run: 2, Failures: 0, Errors: 0, Skipped: 0, Time elapsed: 19.62 s - in org.apache.phoenix.hbase.index.FailForUnsupportedHBaseVersionsIT
[INFO] Running org.apache.phoenix.hbase.index.covered.EndToEndCoveredColumnsIndexBuilderIT
[INFO] Tests run: 2, Failures: 0, Errors: 0, Skipped: 0, Time elapsed: 11.564 s - in org.apache.phoenix.hbase.index.covered.EndToEndCoveredColumnsIndexBuilderIT
[INFO] Running org.apache.phoenix.hbase.index.covered.example.EndToEndCoveredIndexingIT
[INFO] Running org.apache.phoenix.hbase.index.covered.example.EndtoEndIndexingWithCompressionIT
[INFO] Tests run: 32, Failures: 0, Errors: 0, Skipped: 0, Time elapsed: 309.7 s - in org.apache.phoenix.end2end.index.LocalIndexIT
[INFO] Tests run: 11, Failures: 0, Errors: 0, Skipped: 0, Time elapsed: 133.425 s - in org.apache.phoenix.hbase.index.covered.example.EndToEndCoveredIndexingIT
[INFO] Running org.apache.phoenix.hbase.index.covered.example.FailWithoutRetriesIT
[INFO] Tests run: 24, Failures: 0, Errors: 0, Skipped: 0, Time elapsed: 326.924 s - in org.apache.phoenix.end2end.index.ImmutableIndexIT
[INFO] Tests run: 1, Failures: 0, Errors: 0, Skipped: 0, Time elapsed: 2.278 s - in org.apache.phoenix.hbase.index.covered.example.FailWithoutRetriesIT
[INFO] Tests run: 11, Failures: 0, Errors: 0, Skipped: 0, Time elapsed: 131.183 s - in org.apache.phoenix.hbase.index.covered.example.EndtoEndIndexingWithCompressionIT
[INFO] Tests run: 140, Failures: 0, Errors: 0, Skipped: 0, Time elapsed: 486.858 s - in org.apache.phoenix.end2end.IndexExtendedIT
[WARNING] Tests run: 132, Failures: 0, Errors: 0, Skipped: 24, Time elapsed: 406.703 s - in
org.apache.phoenix.end2end.StatsCollectorIT
[INFO] Running org.apache.phoenix.iterate.RoundRobinResultIteratorWithStatsIT
[INFO] Running org.apache.phoenix.iterate.ScannerLeaseRenewalIT
[INFO] Running org.apache.phoenix.monitoring.PhoenixMetricsIT
[INFO] Tests run: 1, Failures: 0, Errors: 0, Skipped: 0, Time elapsed: 17.03 s - in org.apache.phoenix.iterate.RoundRobinResultIteratorWithStatsIT
[WARNING] Tests run: 132, Failures: 0, Errors: 0, Skipped: 24, Time elapsed: 411.055 s - in
org.apache.phoenix.end2end.SysTableNamespaceMappedStatsCollectorIT
[INFO] Running org.apache.phoenix.rpc.PhoenixClientRpcIT
[INFO] Running org.apache.phoenix.rpc.PhoenixServerRpcIT
[INFO] Tests run: 2, Failures: 0, Errors: 0, Skipped: 0, Time elapsed: 12.024 s - in org.apache.phoenix.rpc.PhoenixClientRpcIT
[INFO] Tests run: 2, Failures: 0, Errors: 0, Skipped: 0, Time elapsed: 22.31 s - in org.apache.phoenix.rpc.PhoenixServerRpcIT
[INFO] Tests run: 21, Failures: 0, Errors: 0, Skipped: 0, Time elapsed: 67.709 s - in org.apache.phoenix.monitoring.PhoenixMetricsIT
[INFO] Tests run: 2, Failures: 0, Errors: 0, Skipped: 0, Time elapsed: 163.01 s - in org.apache.phoenix.iterate.ScannerLeaseRenewalIT
[ERROR] Tests run: 11, Failures: 1, Errors: 6, Skipped: 0, Time elapsed: 5,785.195 s <<<
FAILURE! - in org.apache.phoenix.end2end.index.MutableIndexFailureIT
[ERROR] testWriteFailureDisablesIndex[MutableIndexFailureIT_transactional=false,localIndex=true,isNamespaceMapped=true,disableIndexOnWriteFailure=true,rebuildIndexOnWriteFailure=true](org.apache.phoenix.end2end.index.MutableIndexFailureIT)
 Time elapsed: 8.768 s  <<< FAILURE!
java.lang.AssertionError
	at org.apache.phoenix.end2end.index.MutableIndexFailureIT.helpTestWriteFailureDisablesIndex(MutableIndexFailureIT.java:235)
	at org.apache.phoenix.end2end.index.MutableIndexFailureIT.testWriteFailureDisablesIndex(MutableIndexFailureIT.java:156)

[ERROR] testWriteFailureDisablesIndex[MutableIndexFailureIT_transactional=false,localIndex=true,isNamespaceMapped=false,disableIndexOnWriteFailure=null,rebuildIndexOnWriteFailure=null](org.apache.phoenix.end2end.index.MutableIndexFailureIT)
 Time elapsed: 317.518 s  <<< ERROR!
java.sql.SQLTimeoutException: Operation timed out.
	at org.apache.phoenix.end2end.index.MutableIndexFailureIT.helpTestWriteFailureDisablesIndex(MutableIndexFailureIT.java:228)
	at org.apache.phoenix.end2end.index.MutableIndexFailureIT.testWriteFailureDisablesIndex(MutableIndexFailureIT.java:156)

[ERROR] testWriteFailureDisablesIndex[MutableIndexFailureIT_transactional=true,localIndex=true,isNamespaceMapped=false,disableIndexOnWriteFailure=true,rebuildIndexOnWriteFailure=null](org.apache.phoenix.end2end.index.MutableIndexFailureIT)
 Time elapsed: 608.355 s  <<< ERROR!
org.apache.phoenix.exception.PhoenixIOException: java.util.concurrent.TimeoutException: The
procedure 30 is still running
	at org.apache.phoenix.end2end.index.MutableIndexFailureIT.helpTestWriteFailureDisablesIndex(MutableIndexFailureIT.java:172)
	at org.apache.phoenix.end2end.index.MutableIndexFailureIT.testWriteFailureDisablesIndex(MutableIndexFailureIT.java:156)
Caused by: org.apache.hadoop.hbase.exceptions.TimeoutIOException: java.util.concurrent.TimeoutException:
The procedure 30 is still running
	at org.apache.phoenix.end2end.index.MutableIndexFailureIT.helpTestWriteFailureDisablesIndex(MutableIndexFailureIT.java:172)
	at org.apache.phoenix.end2end.index.MutableIndexFailureIT.testWriteFailureDisablesIndex(MutableIndexFailureIT.java:156)
Caused by: java.util.concurrent.TimeoutException: The procedure 30 is still running
	at org.apache.phoenix.end2end.index.MutableIndexFailureIT.helpTestWriteFailureDisablesIndex(MutableIndexFailureIT.java:172)
	at org.apache.phoenix.end2end.index.MutableIndexFailureIT.testWriteFailureDisablesIndex(MutableIndexFailureIT.java:156)

[ERROR] testWriteFailureDisablesIndex[MutableIndexFailureIT_transactional=true,localIndex=true,isNamespaceMapped=true,disableIndexOnWriteFailure=null,rebuildIndexOnWriteFailure=true](org.apache.phoenix.end2end.index.MutableIndexFailureIT)
 Time elapsed: 1,200.013 s  <<< ERROR!
org.apache.phoenix.exception.PhoenixIOException: callTimeout=1200000, callDuration=1200102:

	at org.apache.phoenix.end2end.index.MutableIndexFailureIT.helpTestWriteFailureDisablesIndex(MutableIndexFailureIT.java:170)
	at org.apache.phoenix.end2end.index.MutableIndexFailureIT.testWriteFailureDisablesIndex(MutableIndexFailureIT.java:156)
Caused by: java.net.SocketTimeoutException: callTimeout=1200000, callDuration=1200102: 
	at org.apache.phoenix.end2end.index.MutableIndexFailureIT.helpTestWriteFailureDisablesIndex(MutableIndexFailureIT.java:170)
	at org.apache.phoenix.end2end.index.MutableIndexFailureIT.testWriteFailureDisablesIndex(MutableIndexFailureIT.java:156)
Caused by: java.io.IOException: Call to asf925.gq1.ygridcore.net/67.195.81.161:44036 failed
on local exception: org.apache.hadoop.hbase.ipc.CallTimeoutException: Call id=1189, waitTime=1200000,
operationTimeout=1199999 expired.
	at org.apache.phoenix.end2end.index.MutableIndexFailureIT.helpTestWriteFailureDisablesIndex(MutableIndexFailureIT.java:170)
	at org.apache.phoenix.end2end.index.MutableIndexFailureIT.testWriteFailureDisablesIndex(MutableIndexFailureIT.java:156)
Caused by: org.apache.hadoop.hbase.ipc.CallTimeoutException: Call id=1189, waitTime=1200000,
operationTimeout=1199999 expired.
	at org.apache.phoenix.end2end.index.MutableIndexFailureIT.helpTestWriteFailureDisablesIndex(MutableIndexFailureIT.java:170)
	at org.apache.phoenix.end2end.index.MutableIndexFailureIT.testWriteFailureDisablesIndex(MutableIndexFailureIT.java:156)

[ERROR] testWriteFailureDisablesIndex[MutableIndexFailureIT_transactional=false,localIndex=false,isNamespaceMapped=false,disableIndexOnWriteFailure=false,rebuildIndexOnWriteFailure=true](org.apache.phoenix.end2end.index.MutableIndexFailureIT)
 Time elapsed: 1,200.023 s  <<< ERROR!
org.apache.phoenix.exception.PhoenixIOException: callTimeout=1200000, callDuration=1200101:

	at org.apache.phoenix.end2end.index.MutableIndexFailureIT.helpTestWriteFailureDisablesIndex(MutableIndexFailureIT.java:172)
	at org.apache.phoenix.end2end.index.MutableIndexFailureIT.testWriteFailureDisablesIndex(MutableIndexFailureIT.java:156)
Caused by: java.net.SocketTimeoutException: callTimeout=1200000, callDuration=1200101: 
	at org.apache.phoenix.end2end.index.MutableIndexFailureIT.helpTestWriteFailureDisablesIndex(MutableIndexFailureIT.java:172)
	at org.apache.phoenix.end2end.index.MutableIndexFailureIT.testWriteFailureDisablesIndex(MutableIndexFailureIT.java:156)
Caused by: java.io.IOException: Call to asf925.gq1.ygridcore.net/67.195.81.161:44036 failed
on local exception: org.apache.hadoop.hbase.ipc.CallTimeoutException: Call id=1283, waitTime=1200000,
operationTimeout=1199999 expired.
	at org.apache.phoenix.end2end.index.MutableIndexFailureIT.helpTestWriteFailureDisablesIndex(MutableIndexFailureIT.java:172)
	at org.apache.phoenix.end2end.index.MutableIndexFailureIT.testWriteFailureDisablesIndex(MutableIndexFailureIT.java:156)
Caused by: org.apache.hadoop.hbase.ipc.CallTimeoutException: Call id=1283, waitTime=1200000,
operationTimeout=1199999 expired.
	at org.apache.phoenix.end2end.index.MutableIndexFailureIT.helpTestWriteFailureDisablesIndex(MutableIndexFailureIT.java:172)
	at org.apache.phoenix.end2end.index.MutableIndexFailureIT.testWriteFailureDisablesIndex(MutableIndexFailureIT.java:156)

[ERROR] testWriteFailureDisablesIndex[MutableIndexFailureIT_transactional=false,localIndex=true,isNamespaceMapped=false,disableIndexOnWriteFailure=false,rebuildIndexOnWriteFailure=null](org.apache.phoenix.end2end.index.MutableIndexFailureIT)
 Time elapsed: 1,200.026 s  <<< ERROR!
org.apache.phoenix.exception.PhoenixIOException: callTimeout=1200000, callDuration=1200101:

	at org.apache.phoenix.end2end.index.MutableIndexFailureIT.helpTestWriteFailureDisablesIndex(MutableIndexFailureIT.java:172)
	at org.apache.phoenix.end2end.index.MutableIndexFailureIT.testWriteFailureDisablesIndex(MutableIndexFailureIT.java:156)
Caused by: java.net.SocketTimeoutException: callTimeout=1200000, callDuration=1200101: 
	at org.apache.phoenix.end2end.index.MutableIndexFailureIT.helpTestWriteFailureDisablesIndex(MutableIndexFailureIT.java:172)
	at org.apache.phoenix.end2end.index.MutableIndexFailureIT.testWriteFailureDisablesIndex(MutableIndexFailureIT.java:156)
Caused by: java.io.IOException: Call to asf925.gq1.ygridcore.net/67.195.81.161:44036 failed
on local exception: org.apache.hadoop.hbase.ipc.CallTimeoutException: Call id=1368, waitTime=1200000,
operationTimeout=1199999 expired.
	at org.apache.phoenix.end2end.index.MutableIndexFailureIT.helpTestWriteFailureDisablesIndex(MutableIndexFailureIT.java:172)
	at org.apache.phoenix.end2end.index.MutableIndexFailureIT.testWriteFailureDisablesIndex(MutableIndexFailureIT.java:156)
Caused by: org.apache.hadoop.hbase.ipc.CallTimeoutException: Call id=1368, waitTime=1200000,
operationTimeout=1199999 expired.
	at org.apache.phoenix.end2end.index.MutableIndexFailureIT.helpTestWriteFailureDisablesIndex(MutableIndexFailureIT.java:172)
	at org.apache.phoenix.end2end.index.MutableIndexFailureIT.testWriteFailureDisablesIndex(MutableIndexFailureIT.java:156)

[ERROR] testWriteFailureDisablesIndex[MutableIndexFailureIT_transactional=false,localIndex=false,isNamespaceMapped=false,disableIndexOnWriteFailure=false,rebuildIndexOnWriteFailure=false](org.apache.phoenix.end2end.index.MutableIndexFailureIT)
 Time elapsed: 1,200.043 s  <<< ERROR!
org.apache.phoenix.exception.PhoenixIOException: callTimeout=1200000, callDuration=1200101:

	at org.apache.phoenix.end2end.index.MutableIndexFailureIT.helpTestWriteFailureDisablesIndex(MutableIndexFailureIT.java:172)
	at org.apache.phoenix.end2end.index.MutableIndexFailureIT.testWriteFailureDisablesIndex(MutableIndexFailureIT.java:156)
Caused by: java.net.SocketTimeoutException: callTimeout=1200000, callDuration=1200101: 
	at org.apache.phoenix.end2end.index.MutableIndexFailureIT.helpTestWriteFailureDisablesIndex(MutableIndexFailureIT.java:172)
	at org.apache.phoenix.end2end.index.MutableIndexFailureIT.testWriteFailureDisablesIndex(MutableIndexFailureIT.java:156)
Caused by: java.io.IOException: Call to asf925.gq1.ygridcore.net/67.195.81.161:44036 failed
on local exception: org.apache.hadoop.hbase.ipc.CallTimeoutException: Call id=1452, waitTime=1200000,
operationTimeout=1199999 expired.
	at org.apache.phoenix.end2end.index.MutableIndexFailureIT.helpTestWriteFailureDisablesIndex(MutableIndexFailureIT.java:172)
	at org.apache.phoenix.end2end.index.MutableIndexFailureIT.testWriteFailureDisablesIndex(MutableIndexFailureIT.java:156)
Caused by: org.apache.hadoop.hbase.ipc.CallTimeoutException: Call id=1452, waitTime=1200000,
operationTimeout=1199999 expired.
	at org.apache.phoenix.end2end.index.MutableIndexFailureIT.helpTestWriteFailureDisablesIndex(MutableIndexFailureIT.java:172)
	at org.apache.phoenix.end2end.index.MutableIndexFailureIT.testWriteFailureDisablesIndex(MutableIndexFailureIT.java:156)

[INFO] 
[INFO] Results:
[INFO] 
[ERROR] Failures: 
[ERROR]   MutableIndexFailureIT.testWriteFailureDisablesIndex:156->helpTestWriteFailureDisablesIndex:235
[ERROR] Errors: 
[ERROR]   MutableIndexFailureIT.testWriteFailureDisablesIndex:156->helpTestWriteFailureDisablesIndex:172
» PhoenixIO
[ERROR]   MutableIndexFailureIT.testWriteFailureDisablesIndex:156->helpTestWriteFailureDisablesIndex:172
» PhoenixIO
[ERROR]   MutableIndexFailureIT.testWriteFailureDisablesIndex:156->helpTestWriteFailureDisablesIndex:172
» PhoenixIO
[ERROR]   MutableIndexFailureIT.testWriteFailureDisablesIndex:156->helpTestWriteFailureDisablesIndex:228
» SQLTimeout
[ERROR]   MutableIndexFailureIT.testWriteFailureDisablesIndex:156->helpTestWriteFailureDisablesIndex:172
» PhoenixIO
[ERROR]   MutableIndexFailureIT.testWriteFailureDisablesIndex:156->helpTestWriteFailureDisablesIndex:170
» PhoenixIO
[INFO] 
[ERROR] Tests run: 613, Failures: 1, Errors: 6, Skipped: 48
[INFO] 
[INFO] 
[INFO] --- maven-failsafe-plugin:2.20:verify (ParallelStatsEnabledTest) @ phoenix-core ---
[INFO] ------------------------------------------------------------------------
[INFO] Reactor Summary:
[INFO] 
[INFO] Apache Phoenix ..................................... SUCCESS [  2.877 s]
[INFO] Phoenix Core ....................................... FAILURE [  02:58 h]
[INFO] Phoenix - Flume .................................... SKIPPED
[INFO] Phoenix - Kafka .................................... SKIPPED
[INFO] Phoenix - Pig ...................................... SKIPPED
[INFO] Phoenix Query Server Client ........................ SKIPPED
[INFO] Phoenix Query Server ............................... SKIPPED
[INFO] Phoenix - Pherf .................................... SKIPPED
[INFO] Phoenix - Spark .................................... SKIPPED
[INFO] Phoenix - Hive ..................................... SKIPPED
[INFO] Phoenix Client ..................................... SKIPPED
[INFO] Phoenix Server ..................................... SKIPPED
[INFO] Phoenix Assembly ................................... SKIPPED
[INFO] Phoenix - Tracing Web Application .................. SKIPPED
[INFO] ------------------------------------------------------------------------
[INFO] BUILD FAILURE
[INFO] ------------------------------------------------------------------------
[INFO] Total time: 02:58 h
[INFO] Finished at: 2017-07-06T21:56:04Z
[INFO] Final Memory: 62M/1539M
[INFO] ------------------------------------------------------------------------
[ERROR] Failed to execute goal org.apache.maven.plugins:maven-failsafe-plugin:2.20:verify
(ParallelStatsEnabledTest) on project phoenix-core: There are test failures.
[ERROR] 
[ERROR] Please refer to <https://builds.apache.org/job/Phoenix-4.x-HBase-1.2/ws/phoenix-core/target/failsafe-reports>
for the individual test results.
[ERROR] Please refer to dump files (if any exist) [date]-jvmRun[N].dump, [date].dumpstream
and [date]-jvmRun[N].dumpstream.
[ERROR] -> [Help 1]
[ERROR] 
[ERROR] To see the full stack trace of the errors, re-run Maven with the -e switch.
[ERROR] Re-run Maven using the -X switch to enable full debug logging.
[ERROR] 
[ERROR] For more information about the errors and possible solutions, please read the following
articles:
[ERROR] [Help 1] http://cwiki.apache.org/confluence/display/MAVEN/MojoFailureException
[ERROR] 
[ERROR] After correcting the problems, you can resume the build with the command
[ERROR]   mvn <goals> -rf :phoenix-core
Build step 'Invoke top-level Maven targets' marked build as failure
Archiving artifacts
No prior successful build to compare, so performing full copy of artifacts
Recording test results
Not sending mail to unregistered user ankitsinghal59@gmail.com

Mime
View raw message