phoenix-commits mailing list archives

Site index · List index
Message view « Date » · « Thread »
Top « Date » · « Thread »
From Apache Jenkins Server <jenk...@builds.apache.org>
Subject Build failed in Jenkins: Phoenix | 4.x-HBase-0.98 #1531
Date Thu, 08 Jun 2017 19:03:07 GMT
See <https://builds.apache.org/job/Phoenix-4.x-HBase-0.98/1531/display/redirect?page=changes>

Changes:

[samarth] PHOENIX-3917 RowProjector#getEstimatedRowByteSize() returns incorrect

[samarth] PHOENIX-3922 Update driver version to 4.11.0

------------------------------------------
[...truncated 92.87 KB...]

testCoveredColumnUpdates[MutableIndexIT_localIndex=true,transactional=true,columnEncoded=true](org.apache.phoenix.end2end.index.MutableIndexIT)
 Time elapsed: 5.984 sec  <<< ERROR!
org.apache.phoenix.schema.ColumnFamilyNotFoundException: ERROR 1001 (42I01): Undefined column
family. familyName=B
	at org.apache.phoenix.end2end.index.MutableIndexIT.testCoveredColumnUpdates(MutableIndexIT.java:186)

Tests run: 52, Failures: 0, Errors: 0, Skipped: 4, Time elapsed: 78.983 sec - in org.apache.phoenix.tx.ParameterizedTransactionIT
Tests run: 40, Failures: 0, Errors: 0, Skipped: 0, Time elapsed: 129.269 sec - in org.apache.phoenix.tx.TxCheckpointIT
Tests run: 304, Failures: 0, Errors: 8, Skipped: 0, Time elapsed: 1,023.291 sec <<<
FAILURE! - in org.apache.phoenix.end2end.index.IndexIT
testSelectCF[IndexIT_localIndex=true,mutable=false,transactional=false,columnEncoded=false](org.apache.phoenix.end2end.index.IndexIT)
 Time elapsed: 5.826 sec  <<< ERROR!
org.apache.phoenix.schema.ColumnFamilyNotFoundException: ERROR 1001 (42I01): Undefined column
family. familyName=A
	at org.apache.phoenix.end2end.index.IndexIT.testSelectCF(IndexIT.java:693)

testSelectCF[IndexIT_localIndex=true,mutable=false,transactional=false,columnEncoded=true](org.apache.phoenix.end2end.index.IndexIT)
 Time elapsed: 5.654 sec  <<< ERROR!
org.apache.phoenix.schema.ColumnFamilyNotFoundException: ERROR 1001 (42I01): Undefined column
family. familyName=A
	at org.apache.phoenix.end2end.index.IndexIT.testSelectCF(IndexIT.java:693)

testSelectCF[IndexIT_localIndex=true,mutable=false,transactional=true,columnEncoded=false](org.apache.phoenix.end2end.index.IndexIT)
 Time elapsed: 5.702 sec  <<< ERROR!
org.apache.phoenix.schema.ColumnFamilyNotFoundException: ERROR 1001 (42I01): Undefined column
family. familyName=A
	at org.apache.phoenix.end2end.index.IndexIT.testSelectCF(IndexIT.java:693)

testSelectCF[IndexIT_localIndex=true,mutable=false,transactional=true,columnEncoded=true](org.apache.phoenix.end2end.index.IndexIT)
 Time elapsed: 5.424 sec  <<< ERROR!
org.apache.phoenix.schema.ColumnFamilyNotFoundException: ERROR 1001 (42I01): Undefined column
family. familyName=A
	at org.apache.phoenix.end2end.index.IndexIT.testSelectCF(IndexIT.java:693)

testSelectCF[IndexIT_localIndex=true,mutable=true,transactional=false,columnEncoded=false](org.apache.phoenix.end2end.index.IndexIT)
 Time elapsed: 5.422 sec  <<< ERROR!
org.apache.phoenix.schema.ColumnFamilyNotFoundException: ERROR 1001 (42I01): Undefined column
family. familyName=A
	at org.apache.phoenix.end2end.index.IndexIT.testSelectCF(IndexIT.java:693)

testSelectCF[IndexIT_localIndex=true,mutable=true,transactional=false,columnEncoded=true](org.apache.phoenix.end2end.index.IndexIT)
 Time elapsed: 5.439 sec  <<< ERROR!
org.apache.phoenix.schema.ColumnFamilyNotFoundException: ERROR 1001 (42I01): Undefined column
family. familyName=A
	at org.apache.phoenix.end2end.index.IndexIT.testSelectCF(IndexIT.java:693)

testSelectCF[IndexIT_localIndex=true,mutable=true,transactional=true,columnEncoded=false](org.apache.phoenix.end2end.index.IndexIT)
 Time elapsed: 5.834 sec  <<< ERROR!
org.apache.phoenix.schema.ColumnFamilyNotFoundException: ERROR 1001 (42I01): Undefined column
family. familyName=A
	at org.apache.phoenix.end2end.index.IndexIT.testSelectCF(IndexIT.java:693)

testSelectCF[IndexIT_localIndex=true,mutable=true,transactional=true,columnEncoded=true](org.apache.phoenix.end2end.index.IndexIT)
 Time elapsed: 7.504 sec  <<< ERROR!
org.apache.phoenix.schema.ColumnFamilyNotFoundException: ERROR 1001 (42I01): Undefined column
family. familyName=A
	at org.apache.phoenix.end2end.index.IndexIT.testSelectCF(IndexIT.java:693)


Results :

Tests in error: 
  TimezoneOffsetFunctionIT.dateParameterNull:172 » SQL ERROR 201 (22000): Illega...
  TimezoneOffsetFunctionIT.testBothParametersNull:130 » SQL ERROR 201 (22000): I...
  TimezoneOffsetFunctionIT.timezoneParameterNull:151 » SQL ERROR 201 (22000): Il...
  IndexIT.testSelectCF:693 » ColumnFamilyNotFound ERROR 1001 (42I01): Undefined ...
  IndexIT.testSelectCF:693 » ColumnFamilyNotFound ERROR 1001 (42I01): Undefined ...
  IndexIT.testSelectCF:693 » ColumnFamilyNotFound ERROR 1001 (42I01): Undefined ...
  IndexIT.testSelectCF:693 » ColumnFamilyNotFound ERROR 1001 (42I01): Undefined ...
  IndexIT.testSelectCF:693 » ColumnFamilyNotFound ERROR 1001 (42I01): Undefined ...
  IndexIT.testSelectCF:693 » ColumnFamilyNotFound ERROR 1001 (42I01): Undefined ...
  IndexIT.testSelectCF:693 » ColumnFamilyNotFound ERROR 1001 (42I01): Undefined ...
  IndexIT.testSelectCF:693 » ColumnFamilyNotFound ERROR 1001 (42I01): Undefined ...
  MutableIndexIT.testCoveredColumnUpdates:186 » ColumnFamilyNotFound ERROR 1001 ...
  MutableIndexIT.testCoveredColumnUpdates:186 » ColumnFamilyNotFound ERROR 1001 ...
  MutableIndexIT.testCoveredColumnUpdates:186 » ColumnFamilyNotFound ERROR 1001 ...
  MutableIndexIT.testCoveredColumnUpdates:186 » ColumnFamilyNotFound ERROR 1001 ...

Tests run: 2103, Failures: 0, Errors: 15, Skipped: 4

[INFO] 
[INFO] --- maven-failsafe-plugin:2.19.1:integration-test (ClientManagedTimeTests) @ phoenix-core
---

-------------------------------------------------------
 T E S T S
-------------------------------------------------------
Running org.apache.phoenix.end2end.ArrayIT
Running org.apache.phoenix.end2end.AggregateQueryIT
Running org.apache.phoenix.end2end.ClientTimeArithmeticQueryIT
Running org.apache.phoenix.end2end.CastAndCoerceIT
Running org.apache.phoenix.end2end.CaseStatementIT
Tests run: 80, Failures: 0, Errors: 0, Skipped: 0, Time elapsed: 60.915 sec - in org.apache.phoenix.end2end.ArrayIT
Running org.apache.phoenix.end2end.ColumnProjectionOptimizationIT
Tests run: 49, Failures: 0, Errors: 0, Skipped: 0, Time elapsed: 65.731 sec - in org.apache.phoenix.end2end.CastAndCoerceIT
Running org.apache.phoenix.end2end.CreateSchemaIT
Tests run: 1, Failures: 0, Errors: 0, Skipped: 0, Time elapsed: 0.187 sec - in org.apache.phoenix.end2end.CreateSchemaIT
Running org.apache.phoenix.end2end.CreateTableIT
Tests run: 56, Failures: 0, Errors: 0, Skipped: 0, Time elapsed: 68.486 sec - in org.apache.phoenix.end2end.CaseStatementIT
Running org.apache.phoenix.end2end.CustomEntityDataIT
Tests run: 3, Failures: 0, Errors: 0, Skipped: 0, Time elapsed: 12.668 sec - in org.apache.phoenix.end2end.ColumnProjectionOptimizationIT
Running org.apache.phoenix.end2end.DerivedTableIT
Tests run: 3, Failures: 0, Errors: 0, Skipped: 0, Time elapsed: 3.816 sec - in org.apache.phoenix.end2end.CustomEntityDataIT
Running org.apache.phoenix.end2end.DistinctCountIT
Tests run: 42, Failures: 0, Errors: 0, Skipped: 0, Time elapsed: 79.2 sec - in org.apache.phoenix.end2end.AggregateQueryIT
Running org.apache.phoenix.end2end.DropSchemaIT
Tests run: 2, Failures: 0, Errors: 0, Skipped: 0, Time elapsed: 4.813 sec - in org.apache.phoenix.end2end.DropSchemaIT
Running org.apache.phoenix.end2end.ExtendedQueryExecIT
Tests run: 10, Failures: 0, Errors: 0, Skipped: 0, Time elapsed: 11.541 sec - in org.apache.phoenix.end2end.DistinctCountIT
Running org.apache.phoenix.end2end.FunkyNamesIT
Tests run: 18, Failures: 0, Errors: 0, Skipped: 0, Time elapsed: 14.224 sec - in org.apache.phoenix.end2end.DerivedTableIT
Tests run: 4, Failures: 0, Errors: 0, Skipped: 0, Time elapsed: 3.893 sec - in org.apache.phoenix.end2end.ExtendedQueryExecIT
Running org.apache.phoenix.end2end.GroupByIT
Tests run: 3, Failures: 0, Errors: 0, Skipped: 0, Time elapsed: 3.972 sec - in org.apache.phoenix.end2end.FunkyNamesIT
Running org.apache.phoenix.end2end.MutableQueryIT
Running org.apache.phoenix.end2end.NativeHBaseTypesIT
Tests run: 7, Failures: 0, Errors: 0, Skipped: 0, Time elapsed: 3.133 sec - in org.apache.phoenix.end2end.NativeHBaseTypesIT
Running org.apache.phoenix.end2end.NotQueryIT
Tests run: 19, Failures: 0, Errors: 0, Skipped: 0, Time elapsed: 74.416 sec - in org.apache.phoenix.end2end.CreateTableIT
Running org.apache.phoenix.end2end.PointInTimeQueryIT
Tests run: 77, Failures: 0, Errors: 0, Skipped: 0, Time elapsed: 44.57 sec - in org.apache.phoenix.end2end.NotQueryIT
Tests run: 245, Failures: 0, Errors: 0, Skipped: 0, Time elapsed: 150.212 sec - in org.apache.phoenix.end2end.ClientTimeArithmeticQueryIT
Tests run: 7, Failures: 0, Errors: 0, Skipped: 0, Time elapsed: 17.879 sec - in org.apache.phoenix.end2end.PointInTimeQueryIT
Running org.apache.phoenix.end2end.QueryIT
Running org.apache.phoenix.end2end.QueryDatabaseMetaDataIT
Tests run: 91, Failures: 0, Errors: 0, Skipped: 0, Time elapsed: 78.498 sec - in org.apache.phoenix.end2end.GroupByIT
Running org.apache.phoenix.end2end.ProductMetricsIT
Running org.apache.phoenix.end2end.ReadIsolationLevelIT
Tests run: 61, Failures: 0, Errors: 0, Skipped: 0, Time elapsed: 21.654 sec - in org.apache.phoenix.end2end.ProductMetricsIT
Running org.apache.phoenix.end2end.RowValueConstructorIT
Tests run: 2, Failures: 0, Errors: 0, Skipped: 0, Time elapsed: 2.958 sec - in org.apache.phoenix.end2end.ReadIsolationLevelIT
Running org.apache.phoenix.end2end.ScanQueryIT
Tests run: 112, Failures: 0, Errors: 0, Skipped: 0, Time elapsed: 57.883 sec - in org.apache.phoenix.end2end.QueryIT
Tests run: 112, Failures: 0, Errors: 0, Skipped: 0, Time elapsed: 132.627 sec - in org.apache.phoenix.end2end.MutableQueryIT
Running org.apache.phoenix.end2end.SequenceBulkAllocationIT
Tests run: 19, Failures: 0, Errors: 0, Skipped: 0, Time elapsed: 69.318 sec - in org.apache.phoenix.end2end.QueryDatabaseMetaDataIT
Running org.apache.phoenix.end2end.ToNumberFunctionIT
Tests run: 112, Failures: 0, Errors: 0, Skipped: 0, Time elapsed: 48.661 sec - in org.apache.phoenix.end2end.ScanQueryIT
Running org.apache.phoenix.end2end.TopNIT
Tests run: 18, Failures: 0, Errors: 0, Skipped: 0, Time elapsed: 6.647 sec - in org.apache.phoenix.end2end.ToNumberFunctionIT
Running org.apache.phoenix.end2end.TruncateFunctionIT
Tests run: 4, Failures: 0, Errors: 0, Skipped: 0, Time elapsed: 3.598 sec - in org.apache.phoenix.end2end.TopNIT
Running org.apache.phoenix.end2end.UpsertSelectIT
Tests run: 1, Failures: 0, Errors: 0, Skipped: 0, Time elapsed: 2.515 sec - in org.apache.phoenix.end2end.TruncateFunctionIT
Running org.apache.phoenix.end2end.UpsertValuesIT
Tests run: 46, Failures: 0, Errors: 0, Skipped: 0, Time elapsed: 56.233 sec - in org.apache.phoenix.end2end.RowValueConstructorIT
Running org.apache.phoenix.end2end.VariableLengthPKIT
Running org.apache.phoenix.end2end.SequenceIT
Tests run: 56, Failures: 0, Errors: 0, Skipped: 0, Time elapsed: 17.077 sec - in org.apache.phoenix.end2end.SequenceBulkAllocationIT
Running org.apache.phoenix.end2end.salted.SaltedTableIT
Tests run: 8, Failures: 0, Errors: 0, Skipped: 0, Time elapsed: 4.764 sec - in org.apache.phoenix.end2end.salted.SaltedTableIT
Running org.apache.phoenix.rpc.UpdateCacheWithScnIT
Tests run: 1, Failures: 0, Errors: 0, Skipped: 0, Time elapsed: 2.989 sec - in org.apache.phoenix.rpc.UpdateCacheWithScnIT
Tests run: 54, Failures: 0, Errors: 0, Skipped: 0, Time elapsed: 22.152 sec - in org.apache.phoenix.end2end.SequenceIT
Tests run: 50, Failures: 0, Errors: 0, Skipped: 0, Time elapsed: 35.507 sec - in org.apache.phoenix.end2end.VariableLengthPKIT
Tests run: 25, Failures: 0, Errors: 0, Skipped: 0, Time elapsed: 46.236 sec - in org.apache.phoenix.end2end.UpsertValuesIT
Tests run: 22, Failures: 0, Errors: 0, Skipped: 0, Time elapsed: 57.281 sec - in org.apache.phoenix.end2end.UpsertSelectIT

Results :

Tests run: 1420, Failures: 0, Errors: 0, Skipped: 0

[INFO] 
[INFO] --- maven-failsafe-plugin:2.19.1:integration-test (HBaseManagedTimeTests) @ phoenix-core
---

-------------------------------------------------------
 T E S T S
-------------------------------------------------------

Results :

Tests run: 0, Failures: 0, Errors: 0, Skipped: 0

[INFO] 
[INFO] --- maven-failsafe-plugin:2.19.1:integration-test (NeedTheirOwnClusterTests) @ phoenix-core
---

-------------------------------------------------------
 T E S T S
-------------------------------------------------------
Running org.apache.hadoop.hbase.regionserver.wal.WALReplayWithIndexWritesAndCompressedWALIT
Tests run: 1, Failures: 0, Errors: 0, Skipped: 0, Time elapsed: 20.871 sec - in org.apache.hadoop.hbase.regionserver.wal.WALReplayWithIndexWritesAndCompressedWALIT
Running org.apache.phoenix.end2end.ConnectionUtilIT
Running org.apache.phoenix.end2end.CountDistinctCompressionIT
Running org.apache.phoenix.end2end.ContextClassloaderIT
Running org.apache.phoenix.end2end.CsvBulkLoadToolIT
Tests run: 3, Failures: 0, Errors: 0, Skipped: 0, Time elapsed: 3.1 sec - in org.apache.phoenix.end2end.ContextClassloaderIT
Tests run: 1, Failures: 0, Errors: 0, Skipped: 0, Time elapsed: 18.329 sec - in org.apache.phoenix.end2end.ConnectionUtilIT
Tests run: 1, Failures: 0, Errors: 0, Skipped: 0, Time elapsed: 5.246 sec - in org.apache.phoenix.end2end.CountDistinctCompressionIT
#
# A fatal error has been detected by the Java Runtime Environment:
#
#  Internal Error (sharedRuntime.cpp:814), pid=17540, tid=140280379299584
#  guarantee(cb->is_adapter_blob() || cb->is_method_handles_adapter_blob()) failed:
exception happened outside interpreter, nmethods and vtable stubs (1)
#
# JRE version: Java(TM) SE Runtime Environment (7.0_80-b15) (build 1.7.0_80-b15)
# Java VM: Java HotSpot(TM) 64-Bit Server VM (24.80-b11 mixed mode linux-amd64 compressed
oops)
# Failed to write core dump. Core dumps have been disabled. To enable core dumping, try "ulimit
-c unlimited" before starting Java again
#
# An error report file with more information is saved as:
# <https://builds.apache.org/job/Phoenix-4.x-HBase-0.98/ws/phoenix-core/hs_err_pid17540.log>
#
# If you would like to submit a bug report, please visit:
#   http://bugreport.java.com/bugreport/crash.jsp
#
Aborted
Running org.apache.phoenix.end2end.FlappingLocalIndexIT
Running org.apache.phoenix.end2end.IndexExtendedIT
Running org.apache.phoenix.end2end.IndexToolForPartialBuildIT
Tests run: 2, Failures: 0, Errors: 0, Skipped: 0, Time elapsed: 23.567 sec - in org.apache.phoenix.end2end.IndexToolForPartialBuildIT
Tests run: 11, Failures: 0, Errors: 0, Skipped: 0, Time elapsed: 64.755 sec - in org.apache.phoenix.end2end.CsvBulkLoadToolIT
Running org.apache.phoenix.end2end.QueryTimeoutIT
Tests run: 40, Failures: 0, Errors: 0, Skipped: 16, Time elapsed: 35.547 sec - in org.apache.phoenix.end2end.IndexExtendedIT
Running org.apache.phoenix.end2end.QueryWithLimitIT
Tests run: 2, Failures: 0, Errors: 0, Skipped: 0, Time elapsed: 2.549 sec - in org.apache.phoenix.end2end.QueryWithLimitIT
Tests run: 2, Failures: 0, Errors: 0, Skipped: 0, Time elapsed: 23.129 sec - in org.apache.phoenix.end2end.QueryTimeoutIT
Tests run: 8, Failures: 0, Errors: 0, Skipped: 0, Time elapsed: 64.47 sec - in org.apache.phoenix.end2end.FlappingLocalIndexIT
Running org.apache.phoenix.end2end.RegexBulkLoadToolIT
Running org.apache.phoenix.end2end.RenewLeaseIT
Running org.apache.phoenix.end2end.index.MutableIndexFailureIT
Tests run: 1, Failures: 0, Errors: 0, Skipped: 1, Time elapsed: 0.002 sec - in org.apache.phoenix.end2end.index.MutableIndexFailureIT
Running org.apache.phoenix.hbase.index.FailForUnsupportedHBaseVersionsIT
Running org.apache.phoenix.hbase.index.covered.EndToEndCoveredColumnsIndexBuilderIT
Running org.apache.phoenix.hbase.index.covered.example.FailWithoutRetriesIT

Results :

Tests run: 72, Failures: 0, Errors: 0, Skipped: 17

[INFO] 
[INFO] --- maven-failsafe-plugin:2.19.1:verify (ParallelStatsEnabledTest) @ phoenix-core ---
[INFO] ------------------------------------------------------------------------
[INFO] Reactor Summary:
[INFO] 
[INFO] Apache Phoenix ..................................... SUCCESS [  2.410 s]
[INFO] Phoenix Core ....................................... FAILURE [46:47 min]
[INFO] Phoenix - Flume .................................... SKIPPED
[INFO] Phoenix - Kafka .................................... SKIPPED
[INFO] Phoenix - Pig ...................................... SKIPPED
[INFO] Phoenix Query Server Client ........................ SKIPPED
[INFO] Phoenix Query Server ............................... SKIPPED
[INFO] Phoenix - Pherf .................................... SKIPPED
[INFO] Phoenix - Spark .................................... SKIPPED
[INFO] Phoenix - Hive ..................................... SKIPPED
[INFO] Phoenix Client ..................................... SKIPPED
[INFO] Phoenix Server ..................................... SKIPPED
[INFO] Phoenix Assembly ................................... SKIPPED
[INFO] Phoenix - Tracing Web Application .................. SKIPPED
[INFO] ------------------------------------------------------------------------
[INFO] BUILD FAILURE
[INFO] ------------------------------------------------------------------------
[INFO] Total time: 46:51 min
[INFO] Finished at: 2017-06-08T18:58:02Z
[INFO] Final Memory: 76M/1321M
[INFO] ------------------------------------------------------------------------
[ERROR] Failed to execute goal org.apache.maven.plugins:maven-failsafe-plugin:2.19.1:verify
(ParallelStatsEnabledTest) on project phoenix-core: There was a timeout or other error in
the fork -> [Help 1]
[ERROR] 
[ERROR] To see the full stack trace of the errors, re-run Maven with the -e switch.
[ERROR] Re-run Maven using the -X switch to enable full debug logging.
[ERROR] 
[ERROR] For more information about the errors and possible solutions, please read the following
articles:
[ERROR] [Help 1] http://cwiki.apache.org/confluence/display/MAVEN/MojoExecutionException
[ERROR] 
[ERROR] After correcting the problems, you can resume the build with the command
[ERROR]   mvn <goals> -rf :phoenix-core
Build step 'Invoke top-level Maven targets' marked build as failure
Archiving artifacts
Recording test results
Not sending mail to unregistered user ankitsinghal59@gmail.com

Mime
View raw message