phoenix-commits mailing list archives

Site index · List index
Message view « Date » · « Thread »
Top « Date » · « Thread »
From Apache Jenkins Server <jenk...@builds.apache.org>
Subject Build failed in Jenkins: Phoenix-4.x-HBase-1.2 #31
Date Sat, 03 Jun 2017 03:55:25 GMT
See <https://builds.apache.org/job/Phoenix-4.x-HBase-1.2/31/display/redirect?page=changes>

Changes:

[jamestaylor] PHOENIX-3744 Support snapshot scanners for MR-based Non-aggregate

[samarth] PHOENIX-3904 Queries with LIKE and LIMIT OFFSET fail for mutable tables

------------------------------------------
[...truncated 101.42 KB...]
 T E S T S
-------------------------------------------------------

Results :

Tests run: 0, Failures: 0, Errors: 0, Skipped: 0

[INFO] 
[INFO] --- maven-failsafe-plugin:2.19.1:integration-test (NeedTheirOwnClusterTests) @ phoenix-core
---

-------------------------------------------------------
 T E S T S
-------------------------------------------------------
Running org.apache.hadoop.hbase.regionserver.wal.WALReplayWithIndexWritesAndCompressedWALIT
Running org.apache.phoenix.end2end.ConnectionUtilIT
Tests run: 1, Failures: 0, Errors: 0, Skipped: 0, Time elapsed: 29.704 sec - in org.apache.hadoop.hbase.regionserver.wal.WALReplayWithIndexWritesAndCompressedWALIT
Running org.apache.phoenix.end2end.CsvBulkLoadToolIT
Running org.apache.phoenix.end2end.ContextClassloaderIT
Running org.apache.phoenix.end2end.CountDistinctCompressionIT
Tests run: 1, Failures: 0, Errors: 0, Skipped: 0, Time elapsed: 28.637 sec - in org.apache.phoenix.end2end.ConnectionUtilIT
Tests run: 3, Failures: 0, Errors: 0, Skipped: 0, Time elapsed: 4.843 sec - in org.apache.phoenix.end2end.ContextClassloaderIT
Running org.apache.phoenix.end2end.FlappingLocalIndexIT
Tests run: 1, Failures: 0, Errors: 0, Skipped: 0, Time elapsed: 7.143 sec - in org.apache.phoenix.end2end.CountDistinctCompressionIT
Running org.apache.phoenix.end2end.IndexToolForPartialBuildIT
Running org.apache.phoenix.end2end.IndexExtendedIT
Running org.apache.phoenix.end2end.IndexToolForPartialBuildWithNamespaceEnabledIT
Tests run: 2, Failures: 0, Errors: 0, Skipped: 0, Time elapsed: 27.311 sec - in org.apache.phoenix.end2end.IndexToolForPartialBuildIT
Tests run: 2, Failures: 0, Errors: 0, Skipped: 0, Time elapsed: 28.335 sec - in org.apache.phoenix.end2end.IndexToolForPartialBuildWithNamespaceEnabledIT
Running org.apache.phoenix.end2end.QueryTimeoutIT
Running org.apache.phoenix.end2end.QueryWithLimitIT
Running org.apache.phoenix.end2end.RegexBulkLoadToolIT
Tests run: 2, Failures: 0, Errors: 0, Skipped: 0, Time elapsed: 8.49 sec - in org.apache.phoenix.end2end.QueryWithLimitIT
Tests run: 2, Failures: 0, Errors: 0, Skipped: 0, Time elapsed: 17.632 sec - in org.apache.phoenix.end2end.QueryTimeoutIT
Tests run: 11, Failures: 0, Errors: 0, Skipped: 0, Time elapsed: 78.327 sec - in org.apache.phoenix.end2end.CsvBulkLoadToolIT
Running org.apache.phoenix.end2end.RenewLeaseIT
Tests run: 8, Failures: 0, Errors: 0, Skipped: 0, Time elapsed: 80.422 sec - in org.apache.phoenix.end2end.FlappingLocalIndexIT
Running org.apache.phoenix.end2end.SpillableGroupByIT
Running org.apache.phoenix.end2end.StatsCollectorIT
Running org.apache.phoenix.end2end.SysTableNamespaceMappedStatsCollectorIT
Tests run: 1, Failures: 0, Errors: 0, Skipped: 0, Time elapsed: 35.299 sec - in org.apache.phoenix.end2end.RenewLeaseIT
Tests run: 2, Failures: 0, Errors: 0, Skipped: 0, Time elapsed: 16.53 sec - in org.apache.phoenix.end2end.SpillableGroupByIT
Running org.apache.phoenix.end2end.UpdateCacheAcrossDifferentClientsIT
Tests run: 10, Failures: 0, Errors: 0, Skipped: 0, Time elapsed: 76.436 sec - in org.apache.phoenix.end2end.RegexBulkLoadToolIT
Running org.apache.phoenix.end2end.UserDefinedFunctionsIT
Running org.apache.phoenix.end2end.index.ImmutableIndexIT
Running org.apache.phoenix.end2end.index.LocalIndexIT
Running org.apache.phoenix.end2end.index.MutableIndexFailureIT
Tests run: 6, Failures: 0, Errors: 0, Skipped: 0, Time elapsed: 43.485 sec - in org.apache.phoenix.end2end.UpdateCacheAcrossDifferentClientsIT
Tests run: 14, Failures: 0, Errors: 0, Skipped: 0, Time elapsed: 55.108 sec - in org.apache.phoenix.end2end.UserDefinedFunctionsIT
Running org.apache.phoenix.end2end.index.MutableIndexReplicationIT
Tests run: 1, Failures: 0, Errors: 0, Skipped: 0, Time elapsed: 27.303 sec - in org.apache.phoenix.end2end.index.MutableIndexReplicationIT
Running org.apache.phoenix.end2end.index.txn.TxWriteFailureIT
Running org.apache.phoenix.execute.PartialCommitIT
Tests run: 80, Failures: 0, Errors: 0, Skipped: 0, Time elapsed: 276.271 sec - in org.apache.phoenix.end2end.IndexExtendedIT
Running org.apache.phoenix.hbase.index.FailForUnsupportedHBaseVersionsIT
Tests run: 12, Failures: 0, Errors: 0, Skipped: 0, Time elapsed: 11.259 sec - in org.apache.phoenix.execute.PartialCommitIT
Tests run: 2, Failures: 0, Errors: 0, Skipped: 0, Time elapsed: 20.423 sec - in org.apache.phoenix.hbase.index.FailForUnsupportedHBaseVersionsIT
Running org.apache.phoenix.hbase.index.covered.EndToEndCoveredColumnsIndexBuilderIT
Tests run: 2, Failures: 0, Errors: 0, Skipped: 0, Time elapsed: 18.289 sec - in org.apache.phoenix.hbase.index.covered.EndToEndCoveredColumnsIndexBuilderIT
Running org.apache.phoenix.hbase.index.covered.example.EndToEndCoveredIndexingIT
Running org.apache.phoenix.hbase.index.covered.example.EndtoEndIndexingWithCompressionIT
Tests run: 120, Failures: 0, Errors: 0, Skipped: 24, Time elapsed: 300.081 sec - in org.apache.phoenix.end2end.StatsCollectorIT
Running org.apache.phoenix.hbase.index.covered.example.FailWithoutRetriesIT
Tests run: 120, Failures: 0, Errors: 0, Skipped: 24, Time elapsed: 307.843 sec - in org.apache.phoenix.end2end.SysTableNamespaceMappedStatsCollectorIT
Tests run: 1, Failures: 0, Errors: 0, Skipped: 0, Time elapsed: 8.246 sec - in org.apache.phoenix.hbase.index.covered.example.FailWithoutRetriesIT
Running org.apache.phoenix.iterate.RoundRobinResultIteratorWithStatsIT
Running org.apache.phoenix.iterate.ScannerLeaseRenewalIT
Tests run: 32, Failures: 0, Errors: 0, Skipped: 0, Time elapsed: 311.572 sec - in org.apache.phoenix.end2end.index.LocalIndexIT
Tests run: 1, Failures: 0, Errors: 0, Skipped: 0, Time elapsed: 17.304 sec - in org.apache.phoenix.iterate.RoundRobinResultIteratorWithStatsIT
Tests run: 11, Failures: 0, Errors: 0, Skipped: 0, Time elapsed: 137.104 sec - in org.apache.phoenix.hbase.index.covered.example.EndToEndCoveredIndexingIT
Tests run: 24, Failures: 0, Errors: 0, Skipped: 0, Time elapsed: 335.978 sec - in org.apache.phoenix.end2end.index.ImmutableIndexIT
Running org.apache.phoenix.rpc.PhoenixClientRpcIT
Running org.apache.phoenix.monitoring.PhoenixMetricsIT
Running org.apache.phoenix.rpc.PhoenixServerRpcIT
Tests run: 11, Failures: 0, Errors: 0, Skipped: 0, Time elapsed: 146.917 sec - in org.apache.phoenix.hbase.index.covered.example.EndtoEndIndexingWithCompressionIT
Tests run: 2, Failures: 0, Errors: 0, Skipped: 0, Time elapsed: 12.341 sec - in org.apache.phoenix.rpc.PhoenixClientRpcIT
Tests run: 2, Failures: 0, Errors: 0, Skipped: 0, Time elapsed: 21.939 sec - in org.apache.phoenix.rpc.PhoenixServerRpcIT
Tests run: 21, Failures: 0, Errors: 0, Skipped: 0, Time elapsed: 73.894 sec - in org.apache.phoenix.monitoring.PhoenixMetricsIT
Tests run: 9, Failures: 0, Errors: 9, Skipped: 0, Time elapsed: 377.01 sec <<< FAILURE!
- in org.apache.phoenix.end2end.index.txn.TxWriteFailureIT
testDataTableWriteFailure[TxWriteFailureIT_localIndex=false,mutable=false](org.apache.phoenix.end2end.index.txn.TxWriteFailureIT)
 Time elapsed: 46.149 sec  <<< ERROR!
java.lang.RuntimeException: org.apache.thrift.TException: Unable to discover tx service.
	at org.apache.phoenix.end2end.index.txn.TxWriteFailureIT.helpTestWriteFailure(TxWriteFailureIT.java:122)
	at org.apache.phoenix.end2end.index.txn.TxWriteFailureIT.testDataTableWriteFailure(TxWriteFailureIT.java:113)
Caused by: org.apache.thrift.TException: Unable to discover tx service.
	at org.apache.phoenix.end2end.index.txn.TxWriteFailureIT.helpTestWriteFailure(TxWriteFailureIT.java:122)
	at org.apache.phoenix.end2end.index.txn.TxWriteFailureIT.testDataTableWriteFailure(TxWriteFailureIT.java:113)

testIndexTableWriteFailure[TxWriteFailureIT_localIndex=false,mutable=false](org.apache.phoenix.end2end.index.txn.TxWriteFailureIT)
 Time elapsed: 46.125 sec  <<< ERROR!
java.lang.RuntimeException: org.apache.thrift.TException: Unable to discover tx service.
	at org.apache.phoenix.end2end.index.txn.TxWriteFailureIT.helpTestWriteFailure(TxWriteFailureIT.java:122)
	at org.apache.phoenix.end2end.index.txn.TxWriteFailureIT.testIndexTableWriteFailure(TxWriteFailureIT.java:108)
Caused by: org.apache.thrift.TException: Unable to discover tx service.
	at org.apache.phoenix.end2end.index.txn.TxWriteFailureIT.helpTestWriteFailure(TxWriteFailureIT.java:122)
	at org.apache.phoenix.end2end.index.txn.TxWriteFailureIT.testIndexTableWriteFailure(TxWriteFailureIT.java:108)

testDataTableWriteFailure[TxWriteFailureIT_localIndex=false,mutable=true](org.apache.phoenix.end2end.index.txn.TxWriteFailureIT)
 Time elapsed: 46.128 sec  <<< ERROR!
java.lang.RuntimeException: org.apache.thrift.TException: Unable to discover tx service.
	at org.apache.phoenix.end2end.index.txn.TxWriteFailureIT.helpTestWriteFailure(TxWriteFailureIT.java:122)
	at org.apache.phoenix.end2end.index.txn.TxWriteFailureIT.testDataTableWriteFailure(TxWriteFailureIT.java:113)
Caused by: org.apache.thrift.TException: Unable to discover tx service.
	at org.apache.phoenix.end2end.index.txn.TxWriteFailureIT.helpTestWriteFailure(TxWriteFailureIT.java:122)
	at org.apache.phoenix.end2end.index.txn.TxWriteFailureIT.testDataTableWriteFailure(TxWriteFailureIT.java:113)

testIndexTableWriteFailure[TxWriteFailureIT_localIndex=false,mutable=true](org.apache.phoenix.end2end.index.txn.TxWriteFailureIT)
 Time elapsed: 46.306 sec  <<< ERROR!
java.lang.RuntimeException: org.apache.thrift.TException: Unable to discover tx service.
	at org.apache.phoenix.end2end.index.txn.TxWriteFailureIT.helpTestWriteFailure(TxWriteFailureIT.java:122)
	at org.apache.phoenix.end2end.index.txn.TxWriteFailureIT.testIndexTableWriteFailure(TxWriteFailureIT.java:108)
Caused by: org.apache.thrift.TException: Unable to discover tx service.
	at org.apache.phoenix.end2end.index.txn.TxWriteFailureIT.helpTestWriteFailure(TxWriteFailureIT.java:122)
	at org.apache.phoenix.end2end.index.txn.TxWriteFailureIT.testIndexTableWriteFailure(TxWriteFailureIT.java:108)

testDataTableWriteFailure[TxWriteFailureIT_localIndex=true,mutable=false](org.apache.phoenix.end2end.index.txn.TxWriteFailureIT)
 Time elapsed: 46.12 sec  <<< ERROR!
java.lang.RuntimeException: org.apache.thrift.TException: Unable to discover tx service.
	at org.apache.phoenix.end2end.index.txn.TxWriteFailureIT.helpTestWriteFailure(TxWriteFailureIT.java:122)
	at org.apache.phoenix.end2end.index.txn.TxWriteFailureIT.testDataTableWriteFailure(TxWriteFailureIT.java:113)
Caused by: org.apache.thrift.TException: Unable to discover tx service.
	at org.apache.phoenix.end2end.index.txn.TxWriteFailureIT.helpTestWriteFailure(TxWriteFailureIT.java:122)
	at org.apache.phoenix.end2end.index.txn.TxWriteFailureIT.testDataTableWriteFailure(TxWriteFailureIT.java:113)

testIndexTableWriteFailure[TxWriteFailureIT_localIndex=true,mutable=false](org.apache.phoenix.end2end.index.txn.TxWriteFailureIT)
 Time elapsed: 46.118 sec  <<< ERROR!
java.lang.RuntimeException: org.apache.thrift.TException: Unable to discover tx service.
	at org.apache.phoenix.end2end.index.txn.TxWriteFailureIT.helpTestWriteFailure(TxWriteFailureIT.java:122)
	at org.apache.phoenix.end2end.index.txn.TxWriteFailureIT.testIndexTableWriteFailure(TxWriteFailureIT.java:108)
Caused by: org.apache.thrift.TException: Unable to discover tx service.
	at org.apache.phoenix.end2end.index.txn.TxWriteFailureIT.helpTestWriteFailure(TxWriteFailureIT.java:122)
	at org.apache.phoenix.end2end.index.txn.TxWriteFailureIT.testIndexTableWriteFailure(TxWriteFailureIT.java:108)

testDataTableWriteFailure[TxWriteFailureIT_localIndex=true,mutable=true](org.apache.phoenix.end2end.index.txn.TxWriteFailureIT)
 Time elapsed: 46.125 sec  <<< ERROR!
java.lang.RuntimeException: org.apache.thrift.TException: Unable to discover tx service.
	at org.apache.phoenix.end2end.index.txn.TxWriteFailureIT.helpTestWriteFailure(TxWriteFailureIT.java:122)
	at org.apache.phoenix.end2end.index.txn.TxWriteFailureIT.testDataTableWriteFailure(TxWriteFailureIT.java:113)
Caused by: org.apache.thrift.TException: Unable to discover tx service.
	at org.apache.phoenix.end2end.index.txn.TxWriteFailureIT.helpTestWriteFailure(TxWriteFailureIT.java:122)
	at org.apache.phoenix.end2end.index.txn.TxWriteFailureIT.testDataTableWriteFailure(TxWriteFailureIT.java:113)

testIndexTableWriteFailure[TxWriteFailureIT_localIndex=true,mutable=true](org.apache.phoenix.end2end.index.txn.TxWriteFailureIT)
 Time elapsed: 46.12 sec  <<< ERROR!
java.lang.RuntimeException: org.apache.thrift.TException: Unable to discover tx service.
	at org.apache.phoenix.end2end.index.txn.TxWriteFailureIT.helpTestWriteFailure(TxWriteFailureIT.java:122)
	at org.apache.phoenix.end2end.index.txn.TxWriteFailureIT.testIndexTableWriteFailure(TxWriteFailureIT.java:108)
Caused by: org.apache.thrift.TException: Unable to discover tx service.
	at org.apache.phoenix.end2end.index.txn.TxWriteFailureIT.helpTestWriteFailure(TxWriteFailureIT.java:122)
	at org.apache.phoenix.end2end.index.txn.TxWriteFailureIT.testIndexTableWriteFailure(TxWriteFailureIT.java:108)

org.apache.phoenix.end2end.index.txn.TxWriteFailureIT  Time elapsed: 53.937 sec  <<<
ERROR!
com.google.common.util.concurrent.UncheckedExecutionException: java.lang.Exception: Service
failed while running
Caused by: java.lang.Exception: Service failed while running
Caused by: com.google.common.util.concurrent.UncheckedExecutionException: org.apache.thrift.transport.TTransportException:
Could not create ServerSocket on address /0.0.0.0:35418.
Caused by: org.apache.thrift.transport.TTransportException: Could not create ServerSocket
on address /0.0.0.0:35418.

Tests run: 2, Failures: 0, Errors: 0, Skipped: 0, Time elapsed: 166.673 sec - in org.apache.phoenix.iterate.ScannerLeaseRenewalIT
Tests run: 11, Failures: 6, Errors: 0, Skipped: 0, Time elapsed: 471.852 sec <<<
FAILURE! - in org.apache.phoenix.end2end.index.MutableIndexFailureIT
testWriteFailureDisablesIndex[MutableIndexFailureIT_transactional=false,localIndex=false,isNamespaceMapped=true,disableIndexOnWriteFailure=true,rebuildIndexOnWriteFailure=true](org.apache.phoenix.end2end.index.MutableIndexFailureIT)
 Time elapsed: 70.816 sec  <<< FAILURE!
java.lang.AssertionError
	at org.apache.phoenix.end2end.index.MutableIndexFailureIT.waitForIndexToBeRebuilt(MutableIndexFailureIT.java:316)
	at org.apache.phoenix.end2end.index.MutableIndexFailureIT.helpTestWriteFailureDisablesIndex(MutableIndexFailureIT.java:278)
	at org.apache.phoenix.end2end.index.MutableIndexFailureIT.testWriteFailureDisablesIndex(MutableIndexFailureIT.java:162)

testWriteFailureDisablesIndex[MutableIndexFailureIT_transactional=false,localIndex=false,isNamespaceMapped=false,disableIndexOnWriteFailure=true,rebuildIndexOnWriteFailure=true](org.apache.phoenix.end2end.index.MutableIndexFailureIT)
 Time elapsed: 69.451 sec  <<< FAILURE!
java.lang.AssertionError
	at org.apache.phoenix.end2end.index.MutableIndexFailureIT.waitForIndexToBeRebuilt(MutableIndexFailureIT.java:316)
	at org.apache.phoenix.end2end.index.MutableIndexFailureIT.helpTestWriteFailureDisablesIndex(MutableIndexFailureIT.java:278)
	at org.apache.phoenix.end2end.index.MutableIndexFailureIT.testWriteFailureDisablesIndex(MutableIndexFailureIT.java:162)

testWriteFailureDisablesIndex[MutableIndexFailureIT_transactional=false,localIndex=true,isNamespaceMapped=true,disableIndexOnWriteFailure=true,rebuildIndexOnWriteFailure=true](org.apache.phoenix.end2end.index.MutableIndexFailureIT)
 Time elapsed: 69.968 sec  <<< FAILURE!
java.lang.AssertionError
	at org.apache.phoenix.end2end.index.MutableIndexFailureIT.waitForIndexToBeRebuilt(MutableIndexFailureIT.java:316)
	at org.apache.phoenix.end2end.index.MutableIndexFailureIT.helpTestWriteFailureDisablesIndex(MutableIndexFailureIT.java:278)
	at org.apache.phoenix.end2end.index.MutableIndexFailureIT.testWriteFailureDisablesIndex(MutableIndexFailureIT.java:162)

testWriteFailureDisablesIndex[MutableIndexFailureIT_transactional=false,localIndex=true,isNamespaceMapped=false,disableIndexOnWriteFailure=null,rebuildIndexOnWriteFailure=null](org.apache.phoenix.end2end.index.MutableIndexFailureIT)
 Time elapsed: 68.863 sec  <<< FAILURE!
java.lang.AssertionError
	at org.apache.phoenix.end2end.index.MutableIndexFailureIT.waitForIndexToBeRebuilt(MutableIndexFailureIT.java:316)
	at org.apache.phoenix.end2end.index.MutableIndexFailureIT.helpTestWriteFailureDisablesIndex(MutableIndexFailureIT.java:278)
	at org.apache.phoenix.end2end.index.MutableIndexFailureIT.testWriteFailureDisablesIndex(MutableIndexFailureIT.java:162)

testWriteFailureDisablesIndex[MutableIndexFailureIT_transactional=false,localIndex=false,isNamespaceMapped=false,disableIndexOnWriteFailure=false,rebuildIndexOnWriteFailure=true](org.apache.phoenix.end2end.index.MutableIndexFailureIT)
 Time elapsed: 68.909 sec  <<< FAILURE!
java.lang.AssertionError
	at org.apache.phoenix.end2end.index.MutableIndexFailureIT.waitForIndexToBeRebuilt(MutableIndexFailureIT.java:316)
	at org.apache.phoenix.end2end.index.MutableIndexFailureIT.helpTestWriteFailureDisablesIndex(MutableIndexFailureIT.java:278)
	at org.apache.phoenix.end2end.index.MutableIndexFailureIT.testWriteFailureDisablesIndex(MutableIndexFailureIT.java:162)

testWriteFailureDisablesIndex[MutableIndexFailureIT_transactional=false,localIndex=true,isNamespaceMapped=false,disableIndexOnWriteFailure=false,rebuildIndexOnWriteFailure=null](org.apache.phoenix.end2end.index.MutableIndexFailureIT)
 Time elapsed: 68.987 sec  <<< FAILURE!
java.lang.AssertionError
	at org.apache.phoenix.end2end.index.MutableIndexFailureIT.waitForIndexToBeRebuilt(MutableIndexFailureIT.java:316)
	at org.apache.phoenix.end2end.index.MutableIndexFailureIT.helpTestWriteFailureDisablesIndex(MutableIndexFailureIT.java:278)
	at org.apache.phoenix.end2end.index.MutableIndexFailureIT.testWriteFailureDisablesIndex(MutableIndexFailureIT.java:162)


Results :

Failed tests: 
  MutableIndexFailureIT.testWriteFailureDisablesIndex:162->helpTestWriteFailureDisablesIndex:278->waitForIndexToBeRebuilt:316
  MutableIndexFailureIT.testWriteFailureDisablesIndex:162->helpTestWriteFailureDisablesIndex:278->waitForIndexToBeRebuilt:316
  MutableIndexFailureIT.testWriteFailureDisablesIndex:162->helpTestWriteFailureDisablesIndex:278->waitForIndexToBeRebuilt:316
  MutableIndexFailureIT.testWriteFailureDisablesIndex:162->helpTestWriteFailureDisablesIndex:278->waitForIndexToBeRebuilt:316
  MutableIndexFailureIT.testWriteFailureDisablesIndex:162->helpTestWriteFailureDisablesIndex:278->waitForIndexToBeRebuilt:316
  MutableIndexFailureIT.testWriteFailureDisablesIndex:162->helpTestWriteFailureDisablesIndex:278->waitForIndexToBeRebuilt:316
Tests in error: 
  TxWriteFailureIT>BaseUniqueNamesOwnClusterIT.doTeardown:36->BaseTest.tearDownMiniCluster:544->BaseTest.tearDownTxManager:441
» UncheckedExecution
  TxWriteFailureIT.testDataTableWriteFailure:113->helpTestWriteFailure:122 » Runtime
  TxWriteFailureIT.testDataTableWriteFailure:113->helpTestWriteFailure:122 » Runtime
  TxWriteFailureIT.testDataTableWriteFailure:113->helpTestWriteFailure:122 » Runtime
  TxWriteFailureIT.testDataTableWriteFailure:113->helpTestWriteFailure:122 » Runtime
  TxWriteFailureIT.testIndexTableWriteFailure:108->helpTestWriteFailure:122 » Runtime
  TxWriteFailureIT.testIndexTableWriteFailure:108->helpTestWriteFailure:122 » Runtime
  TxWriteFailureIT.testIndexTableWriteFailure:108->helpTestWriteFailure:122 » Runtime
  TxWriteFailureIT.testIndexTableWriteFailure:108->helpTestWriteFailure:122 » Runtime

Tests run: 530, Failures: 6, Errors: 9, Skipped: 48

[INFO] 
[INFO] --- maven-failsafe-plugin:2.19.1:verify (ParallelStatsEnabledTest) @ phoenix-core ---
[INFO] ------------------------------------------------------------------------
[INFO] Reactor Summary:
[INFO] 
[INFO] Apache Phoenix ..................................... SUCCESS [  3.779 s]
[INFO] Phoenix Core ....................................... FAILURE [  01:01 h]
[INFO] Phoenix - Flume .................................... SKIPPED
[INFO] Phoenix - Kafka .................................... SKIPPED
[INFO] Phoenix - Pig ...................................... SKIPPED
[INFO] Phoenix Query Server Client ........................ SKIPPED
[INFO] Phoenix Query Server ............................... SKIPPED
[INFO] Phoenix - Pherf .................................... SKIPPED
[INFO] Phoenix - Spark .................................... SKIPPED
[INFO] Phoenix - Hive ..................................... SKIPPED
[INFO] Phoenix Client ..................................... SKIPPED
[INFO] Phoenix Server ..................................... SKIPPED
[INFO] Phoenix Assembly ................................... SKIPPED
[INFO] Phoenix - Tracing Web Application .................. SKIPPED
[INFO] ------------------------------------------------------------------------
[INFO] BUILD FAILURE
[INFO] ------------------------------------------------------------------------
[INFO] Total time: 01:02 h
[INFO] Finished at: 2017-06-03T03:52:17Z
[INFO] Final Memory: 61M/1567M
[INFO] ------------------------------------------------------------------------
[ERROR] Failed to execute goal org.apache.maven.plugins:maven-failsafe-plugin:2.19.1:verify
(ParallelStatsEnabledTest) on project phoenix-core: There was a timeout or other error in
the fork -> [Help 1]
[ERROR] 
[ERROR] To see the full stack trace of the errors, re-run Maven with the -e switch.
[ERROR] Re-run Maven using the -X switch to enable full debug logging.
[ERROR] 
[ERROR] For more information about the errors and possible solutions, please read the following
articles:
[ERROR] [Help 1] http://cwiki.apache.org/confluence/display/MAVEN/MojoExecutionException
[ERROR] 
[ERROR] After correcting the problems, you can resume the build with the command
[ERROR]   mvn <goals> -rf :phoenix-core
Build step 'Invoke top-level Maven targets' marked build as failure
Archiving artifacts
Recording test results

Mime
View raw message