phoenix-commits mailing list archives

Site index · List index
Message view « Date » · « Thread »
Top « Date » · « Thread »
From Apache Jenkins Server <jenk...@builds.apache.org>
Subject Build failed in Jenkins: Phoenix | Master #1646
Date Wed, 07 Jun 2017 19:13:27 GMT
See <https://builds.apache.org/job/Phoenix-master/1646/display/redirect?page=changes>

Changes:

[jamestaylor] PHOENIX-3913 Support PArrayDataType.appendItemToArray to append item to

[jamestaylor] PHOENIX-3773 Support FIRST_VALUES and LAST_VALUES aggregate function to

------------------------------------------
[...truncated 92.87 KB...]
Tests in error: 
  TimezoneOffsetFunctionIT.dateParameterNull:172 » SQL ERROR 201 (22000): Illega...
  TimezoneOffsetFunctionIT.testBothParametersNull:130 » SQL ERROR 201 (22000): I...
  TimezoneOffsetFunctionIT.timezoneParameterNull:151 » SQL ERROR 201 (22000): Il...

Tests run: 2092, Failures: 0, Errors: 3, Skipped: 4

[INFO] 
[INFO] --- maven-failsafe-plugin:2.19.1:integration-test (ClientManagedTimeTests) @ phoenix-core
---

-------------------------------------------------------
 T E S T S
-------------------------------------------------------
Running org.apache.phoenix.end2end.CreateSchemaIT
Running org.apache.phoenix.end2end.ColumnProjectionOptimizationIT
Running org.apache.phoenix.end2end.ArrayIT
Tests run: 1, Failures: 0, Errors: 0, Skipped: 0, Time elapsed: 1.915 sec - in org.apache.phoenix.end2end.CreateSchemaIT
Running org.apache.phoenix.end2end.CustomEntityDataIT
Running org.apache.phoenix.end2end.CreateTableIT
Running org.apache.phoenix.end2end.ClientTimeArithmeticQueryIT
Running org.apache.phoenix.end2end.CaseStatementIT
Running org.apache.phoenix.end2end.AggregateQueryIT
Running org.apache.phoenix.end2end.CastAndCoerceIT
Tests run: 3, Failures: 0, Errors: 0, Skipped: 0, Time elapsed: 11.978 sec - in org.apache.phoenix.end2end.CustomEntityDataIT
Running org.apache.phoenix.end2end.DerivedTableIT
Tests run: 3, Failures: 0, Errors: 0, Skipped: 0, Time elapsed: 34.308 sec - in org.apache.phoenix.end2end.ColumnProjectionOptimizationIT
Running org.apache.phoenix.end2end.DistinctCountIT
Tests run: 18, Failures: 0, Errors: 0, Skipped: 0, Time elapsed: 36.218 sec - in org.apache.phoenix.end2end.DerivedTableIT
Running org.apache.phoenix.end2end.DropSchemaIT
Tests run: 10, Failures: 0, Errors: 0, Skipped: 0, Time elapsed: 25.542 sec - in org.apache.phoenix.end2end.DistinctCountIT
Running org.apache.phoenix.end2end.ExtendedQueryExecIT
Tests run: 2, Failures: 0, Errors: 0, Skipped: 0, Time elapsed: 17.088 sec - in org.apache.phoenix.end2end.DropSchemaIT
Running org.apache.phoenix.end2end.FunkyNamesIT
Tests run: 4, Failures: 0, Errors: 0, Skipped: 0, Time elapsed: 8.937 sec - in org.apache.phoenix.end2end.ExtendedQueryExecIT
Running org.apache.phoenix.end2end.GroupByIT
Tests run: 3, Failures: 0, Errors: 0, Skipped: 0, Time elapsed: 6.203 sec - in org.apache.phoenix.end2end.FunkyNamesIT
Running org.apache.phoenix.end2end.MutableQueryIT
Tests run: 80, Failures: 0, Errors: 0, Skipped: 0, Time elapsed: 118.235 sec - in org.apache.phoenix.end2end.ArrayIT
Running org.apache.phoenix.end2end.NativeHBaseTypesIT
Tests run: 49, Failures: 0, Errors: 0, Skipped: 0, Time elapsed: 120.667 sec - in org.apache.phoenix.end2end.CastAndCoerceIT
Running org.apache.phoenix.end2end.NotQueryIT
Tests run: 7, Failures: 0, Errors: 0, Skipped: 0, Time elapsed: 8.702 sec - in org.apache.phoenix.end2end.NativeHBaseTypesIT
Tests run: 42, Failures: 0, Errors: 0, Skipped: 0, Time elapsed: 133.207 sec - in org.apache.phoenix.end2end.AggregateQueryIT
Running org.apache.phoenix.end2end.ProductMetricsIT
Running org.apache.phoenix.end2end.PointInTimeQueryIT
Tests run: 19, Failures: 0, Errors: 0, Skipped: 0, Time elapsed: 184.619 sec - in org.apache.phoenix.end2end.CreateTableIT
Running org.apache.phoenix.end2end.QueryDatabaseMetaDataIT
Tests run: 61, Failures: 0, Errors: 0, Skipped: 0, Time elapsed: 47.778 sec - in org.apache.phoenix.end2end.ProductMetricsIT
Tests run: 91, Failures: 0, Errors: 0, Skipped: 0, Time elapsed: 134.778 sec - in org.apache.phoenix.end2end.GroupByIT
Tests run: 77, Failures: 0, Errors: 0, Skipped: 0, Time elapsed: 81.252 sec - in org.apache.phoenix.end2end.NotQueryIT
Running org.apache.phoenix.end2end.QueryIT
Tests run: 7, Failures: 0, Errors: 0, Skipped: 0, Time elapsed: 82.125 sec - in org.apache.phoenix.end2end.PointInTimeQueryIT
Running org.apache.phoenix.end2end.ScanQueryIT
Running org.apache.phoenix.end2end.ReadIsolationLevelIT
Tests run: 245, Failures: 0, Errors: 0, Skipped: 0, Time elapsed: 241.27 sec - in org.apache.phoenix.end2end.ClientTimeArithmeticQueryIT
Tests run: 2, Failures: 0, Errors: 0, Skipped: 0, Time elapsed: 5.706 sec - in org.apache.phoenix.end2end.ReadIsolationLevelIT
Running org.apache.phoenix.end2end.SequenceBulkAllocationIT
Running org.apache.phoenix.end2end.RowValueConstructorIT
Running org.apache.phoenix.end2end.SequenceIT
Tests run: 56, Failures: 0, Errors: 0, Skipped: 0, Time elapsed: 67.877 sec - in org.apache.phoenix.end2end.SequenceBulkAllocationIT
Tests run: 112, Failures: 0, Errors: 0, Skipped: 0, Time elapsed: 96.338 sec - in org.apache.phoenix.end2end.QueryIT
Running org.apache.phoenix.end2end.ToNumberFunctionIT
Tests run: 112, Failures: 0, Errors: 0, Skipped: 0, Time elapsed: 238.966 sec - in org.apache.phoenix.end2end.MutableQueryIT
Tests run: 18, Failures: 0, Errors: 0, Skipped: 0, Time elapsed: 9.721 sec - in org.apache.phoenix.end2end.ToNumberFunctionIT
Running org.apache.phoenix.end2end.TruncateFunctionIT
Tests run: 19, Failures: 0, Errors: 0, Skipped: 0, Time elapsed: 139.823 sec - in org.apache.phoenix.end2end.QueryDatabaseMetaDataIT
Running org.apache.phoenix.end2end.UpsertValuesIT
Tests run: 112, Failures: 0, Errors: 0, Skipped: 0, Time elapsed: 104.384 sec - in org.apache.phoenix.end2end.ScanQueryIT
Tests run: 1, Failures: 0, Errors: 0, Skipped: 0, Time elapsed: 5.004 sec - in org.apache.phoenix.end2end.TruncateFunctionIT
Running org.apache.phoenix.end2end.VariableLengthPKIT
Tests run: 54, Failures: 0, Errors: 0, Skipped: 0, Time elapsed: 56.058 sec - in org.apache.phoenix.end2end.SequenceIT
Running org.apache.phoenix.end2end.salted.SaltedTableIT
Tests run: 8, Failures: 0, Errors: 0, Skipped: 0, Time elapsed: 7.461 sec - in org.apache.phoenix.end2end.salted.SaltedTableIT
Running org.apache.phoenix.end2end.TopNIT
Running org.apache.phoenix.end2end.UpsertSelectIT
Tests run: 4, Failures: 0, Errors: 0, Skipped: 0, Time elapsed: 7.238 sec - in org.apache.phoenix.end2end.TopNIT
Running org.apache.phoenix.rpc.UpdateCacheWithScnIT
Tests run: 1, Failures: 0, Errors: 0, Skipped: 0, Time elapsed: 5.602 sec - in org.apache.phoenix.rpc.UpdateCacheWithScnIT
Tests run: 46, Failures: 0, Errors: 0, Skipped: 0, Time elapsed: 127.424 sec - in org.apache.phoenix.end2end.RowValueConstructorIT
Tests run: 50, Failures: 0, Errors: 0, Skipped: 0, Time elapsed: 51.297 sec - in org.apache.phoenix.end2end.VariableLengthPKIT
Tests run: 57, Failures: 0, Errors: 1, Skipped: 0, Time elapsed: 414.09 sec <<< FAILURE!
- in org.apache.phoenix.end2end.CaseStatementIT
org.apache.phoenix.end2end.CaseStatementIT  Time elapsed: 333.93 sec  <<< ERROR!
java.sql.SQLTimeoutException: Operation timed out.

Tests run: 25, Failures: 0, Errors: 0, Skipped: 0, Time elapsed: 117.952 sec - in org.apache.phoenix.end2end.UpsertValuesIT
Tests run: 24, Failures: 0, Errors: 0, Skipped: 0, Time elapsed: 136.997 sec - in org.apache.phoenix.end2end.UpsertSelectIT

Results :

Tests in error: 
  CaseStatementIT>BaseClientManagedTimeIT.doTeardown:77->BaseTest.dropNonSystemTables:533->BaseTest.disableAndDropNonSystemTables:1505->BaseTest.disableAndDropTable:1532
» SQLTimeout

Tests run: 1423, Failures: 0, Errors: 1, Skipped: 0

[INFO] 
[INFO] --- maven-failsafe-plugin:2.19.1:integration-test (HBaseManagedTimeTests) @ phoenix-core
---

-------------------------------------------------------
 T E S T S
-------------------------------------------------------

Results :

Tests run: 0, Failures: 0, Errors: 0, Skipped: 0

[INFO] 
[INFO] --- maven-failsafe-plugin:2.19.1:integration-test (NeedTheirOwnClusterTests) @ phoenix-core
---

-------------------------------------------------------
 T E S T S
-------------------------------------------------------
Running org.apache.hadoop.hbase.regionserver.wal.WALReplayWithIndexWritesAndCompressedWALIT
Running org.apache.phoenix.end2end.ConnectionUtilIT
Tests run: 1, Failures: 0, Errors: 0, Skipped: 0, Time elapsed: 59.036 sec - in org.apache.hadoop.hbase.regionserver.wal.WALReplayWithIndexWritesAndCompressedWALIT
Running org.apache.phoenix.end2end.ContextClassloaderIT
Running org.apache.phoenix.end2end.CountDistinctCompressionIT
Running org.apache.phoenix.end2end.CsvBulkLoadToolIT
Tests run: 3, Failures: 0, Errors: 0, Skipped: 0, Time elapsed: 10.407 sec - in org.apache.phoenix.end2end.ContextClassloaderIT
Tests run: 1, Failures: 0, Errors: 0, Skipped: 0, Time elapsed: 11.572 sec - in org.apache.phoenix.end2end.CountDistinctCompressionIT
Tests run: 1, Failures: 0, Errors: 0, Skipped: 0, Time elapsed: 34.353 sec - in org.apache.phoenix.end2end.ConnectionUtilIT
Running org.apache.phoenix.end2end.FlappingLocalIndexIT
Running org.apache.phoenix.end2end.IndexExtendedIT
Running org.apache.phoenix.end2end.IndexToolForPartialBuildIT
Running org.apache.phoenix.end2end.IndexToolForPartialBuildWithNamespaceEnabledIT
Tests run: 1, Failures: 0, Errors: 0, Skipped: 0, Time elapsed: 22.421 sec - in org.apache.phoenix.end2end.IndexToolForPartialBuildIT
Tests run: 2, Failures: 0, Errors: 0, Skipped: 0, Time elapsed: 39.535 sec - in org.apache.phoenix.end2end.IndexToolForPartialBuildWithNamespaceEnabledIT
Running org.apache.phoenix.end2end.QueryTimeoutIT
Running org.apache.phoenix.end2end.QueryWithLimitIT
Tests run: 2, Failures: 0, Errors: 0, Skipped: 0, Time elapsed: 11.275 sec - in org.apache.phoenix.end2end.QueryWithLimitIT
Running org.apache.phoenix.end2end.RegexBulkLoadToolIT
Tests run: 11, Failures: 0, Errors: 0, Skipped: 0, Time elapsed: 102.587 sec - in org.apache.phoenix.end2end.CsvBulkLoadToolIT
Running org.apache.phoenix.end2end.RenewLeaseIT
Tests run: 8, Failures: 0, Errors: 0, Skipped: 0, Time elapsed: 91.672 sec - in org.apache.phoenix.end2end.FlappingLocalIndexIT
Tests run: 2, Failures: 0, Errors: 0, Skipped: 0, Time elapsed: 50.996 sec - in org.apache.phoenix.end2end.QueryTimeoutIT
Tests run: 1, Failures: 0, Errors: 0, Skipped: 0, Time elapsed: 33.248 sec - in org.apache.phoenix.end2end.RenewLeaseIT
Running org.apache.phoenix.end2end.StatsCollectorIT
Running org.apache.phoenix.end2end.SpillableGroupByIT
Running org.apache.phoenix.end2end.SysTableNamespaceMappedStatsCollectorIT
Running org.apache.phoenix.end2end.UpdateCacheAcrossDifferentClientsIT
Tests run: 2, Failures: 0, Errors: 0, Skipped: 0, Time elapsed: 28.633 sec - in org.apache.phoenix.end2end.SpillableGroupByIT
Tests run: 10, Failures: 0, Errors: 0, Skipped: 0, Time elapsed: 92.349 sec - in org.apache.phoenix.end2end.RegexBulkLoadToolIT
Running org.apache.phoenix.end2end.UserDefinedFunctionsIT
Running org.apache.phoenix.end2end.index.ImmutableIndexIT
Tests run: 6, Failures: 0, Errors: 0, Skipped: 0, Time elapsed: 41.039 sec - in org.apache.phoenix.end2end.UpdateCacheAcrossDifferentClientsIT
Running org.apache.phoenix.end2end.index.LocalIndexIT
Running org.apache.phoenix.end2end.index.MutableIndexFailureIT
Tests run: 14, Failures: 0, Errors: 0, Skipped: 0, Time elapsed: 42.92 sec - in org.apache.phoenix.end2end.UserDefinedFunctionsIT
Running org.apache.phoenix.end2end.index.MutableIndexReplicationIT
Tests run: 1, Failures: 0, Errors: 0, Skipped: 0, Time elapsed: 31.651 sec - in org.apache.phoenix.end2end.index.MutableIndexReplicationIT
Running org.apache.phoenix.end2end.index.txn.TxWriteFailureIT
Tests run: 8, Failures: 0, Errors: 0, Skipped: 0, Time elapsed: 63.085 sec - in org.apache.phoenix.end2end.index.txn.TxWriteFailureIT
Running org.apache.phoenix.hbase.index.FailForUnsupportedHBaseVersionsIT
Running org.apache.phoenix.execute.PartialCommitIT
Tests run: 12, Failures: 0, Errors: 0, Skipped: 0, Time elapsed: 10.298 sec - in org.apache.phoenix.execute.PartialCommitIT
Tests run: 2, Failures: 0, Errors: 0, Skipped: 0, Time elapsed: 29.5 sec - in org.apache.phoenix.hbase.index.FailForUnsupportedHBaseVersionsIT
Running org.apache.phoenix.hbase.index.covered.EndToEndCoveredColumnsIndexBuilderIT
Tests run: 2, Failures: 0, Errors: 0, Skipped: 0, Time elapsed: 24.675 sec - in org.apache.phoenix.hbase.index.covered.EndToEndCoveredColumnsIndexBuilderIT
Tests run: 120, Failures: 0, Errors: 0, Skipped: 24, Time elapsed: 312.905 sec - in org.apache.phoenix.end2end.StatsCollectorIT
Running org.apache.phoenix.hbase.index.covered.example.EndToEndCoveredIndexingIT
Tests run: 120, Failures: 0, Errors: 0, Skipped: 24, Time elapsed: 309.376 sec - in org.apache.phoenix.end2end.SysTableNamespaceMappedStatsCollectorIT
Running org.apache.phoenix.hbase.index.covered.example.FailWithoutRetriesIT
Tests run: 1, Failures: 0, Errors: 0, Skipped: 0, Time elapsed: 5.176 sec - in org.apache.phoenix.hbase.index.covered.example.FailWithoutRetriesIT
Running org.apache.phoenix.hbase.index.covered.example.EndtoEndIndexingWithCompressionIT
Running org.apache.phoenix.iterate.RoundRobinResultIteratorWithStatsIT
Running org.apache.phoenix.iterate.ScannerLeaseRenewalIT
Tests run: 32, Failures: 0, Errors: 0, Skipped: 0, Time elapsed: 321.471 sec - in org.apache.phoenix.end2end.index.LocalIndexIT
Tests run: 1, Failures: 0, Errors: 0, Skipped: 0, Time elapsed: 33.374 sec - in org.apache.phoenix.iterate.RoundRobinResultIteratorWithStatsIT
Tests run: 24, Failures: 0, Errors: 0, Skipped: 0, Time elapsed: 374.76 sec - in org.apache.phoenix.end2end.index.ImmutableIndexIT
Tests run: 11, Failures: 0, Errors: 0, Skipped: 0, Time elapsed: 130.883 sec - in org.apache.phoenix.hbase.index.covered.example.EndToEndCoveredIndexingIT
Running org.apache.phoenix.monitoring.PhoenixMetricsIT
Tests run: 11, Failures: 3, Errors: 0, Skipped: 0, Time elapsed: 345.102 sec <<<
FAILURE! - in org.apache.phoenix.end2end.index.MutableIndexFailureIT
testWriteFailureDisablesIndex[MutableIndexFailureIT_transactional=false,localIndex=false,isNamespaceMapped=true,disableIndexOnWriteFailure=true,rebuildIndexOnWriteFailure=true](org.apache.phoenix.end2end.index.MutableIndexFailureIT)
 Time elapsed: 74.492 sec  <<< FAILURE!
java.lang.AssertionError
	at org.apache.phoenix.end2end.index.MutableIndexFailureIT.waitForIndexToBeRebuilt(MutableIndexFailureIT.java:316)
	at org.apache.phoenix.end2end.index.MutableIndexFailureIT.helpTestWriteFailureDisablesIndex(MutableIndexFailureIT.java:278)
	at org.apache.phoenix.end2end.index.MutableIndexFailureIT.testWriteFailureDisablesIndex(MutableIndexFailureIT.java:162)

testWriteFailureDisablesIndex[MutableIndexFailureIT_transactional=false,localIndex=false,isNamespaceMapped=false,disableIndexOnWriteFailure=true,rebuildIndexOnWriteFailure=true](org.apache.phoenix.end2end.index.MutableIndexFailureIT)
 Time elapsed: 72.583 sec  <<< FAILURE!
java.lang.AssertionError
	at org.apache.phoenix.end2end.index.MutableIndexFailureIT.waitForIndexToBeRebuilt(MutableIndexFailureIT.java:316)
	at org.apache.phoenix.end2end.index.MutableIndexFailureIT.helpTestWriteFailureDisablesIndex(MutableIndexFailureIT.java:278)
	at org.apache.phoenix.end2end.index.MutableIndexFailureIT.testWriteFailureDisablesIndex(MutableIndexFailureIT.java:162)

testWriteFailureDisablesIndex[MutableIndexFailureIT_transactional=false,localIndex=false,isNamespaceMapped=false,disableIndexOnWriteFailure=false,rebuildIndexOnWriteFailure=true](org.apache.phoenix.end2end.index.MutableIndexFailureIT)
 Time elapsed: 72.328 sec  <<< FAILURE!
java.lang.AssertionError
	at org.apache.phoenix.end2end.index.MutableIndexFailureIT.waitForIndexToBeRebuilt(MutableIndexFailureIT.java:316)
	at org.apache.phoenix.end2end.index.MutableIndexFailureIT.helpTestWriteFailureDisablesIndex(MutableIndexFailureIT.java:278)
	at org.apache.phoenix.end2end.index.MutableIndexFailureIT.testWriteFailureDisablesIndex(MutableIndexFailureIT.java:162)

Running org.apache.phoenix.rpc.PhoenixClientRpcIT
Tests run: 2, Failures: 0, Errors: 0, Skipped: 0, Time elapsed: 11.797 sec - in org.apache.phoenix.rpc.PhoenixClientRpcIT
Running org.apache.phoenix.rpc.PhoenixServerRpcIT
Tests run: 11, Failures: 0, Errors: 0, Skipped: 0, Time elapsed: 140.715 sec - in org.apache.phoenix.hbase.index.covered.example.EndtoEndIndexingWithCompressionIT
Tests run: 2, Failures: 0, Errors: 0, Skipped: 0, Time elapsed: 22.397 sec - in org.apache.phoenix.rpc.PhoenixServerRpcIT
Tests run: 21, Failures: 0, Errors: 0, Skipped: 0, Time elapsed: 65.466 sec - in org.apache.phoenix.monitoring.PhoenixMetricsIT
Tests run: 80, Failures: 0, Errors: 0, Skipped: 0, Time elapsed: 663.182 sec - in org.apache.phoenix.end2end.IndexExtendedIT
Tests run: 2, Failures: 0, Errors: 0, Skipped: 0, Time elapsed: 170.526 sec - in org.apache.phoenix.iterate.ScannerLeaseRenewalIT

Results :

Failed tests: 
  MutableIndexFailureIT.testWriteFailureDisablesIndex:162->helpTestWriteFailureDisablesIndex:278->waitForIndexToBeRebuilt:316
  MutableIndexFailureIT.testWriteFailureDisablesIndex:162->helpTestWriteFailureDisablesIndex:278->waitForIndexToBeRebuilt:316
  MutableIndexFailureIT.testWriteFailureDisablesIndex:162->helpTestWriteFailureDisablesIndex:278->waitForIndexToBeRebuilt:316

Tests run: 528, Failures: 3, Errors: 0, Skipped: 48

[INFO] 
[INFO] --- maven-failsafe-plugin:2.19.1:verify (ParallelStatsEnabledTest) @ phoenix-core ---
[INFO] ------------------------------------------------------------------------
[INFO] Reactor Summary:
[INFO] 
[INFO] Apache Phoenix ..................................... SUCCESS [  5.147 s]
[INFO] Phoenix Core ....................................... FAILURE [  01:18 h]
[INFO] Phoenix - Flume .................................... SKIPPED
[INFO] Phoenix - Kafka .................................... SKIPPED
[INFO] Phoenix - Pig ...................................... SKIPPED
[INFO] Phoenix Query Server Client ........................ SKIPPED
[INFO] Phoenix Query Server ............................... SKIPPED
[INFO] Phoenix - Pherf .................................... SKIPPED
[INFO] Phoenix - Spark .................................... SKIPPED
[INFO] Phoenix - Hive ..................................... SKIPPED
[INFO] Phoenix Client ..................................... SKIPPED
[INFO] Phoenix Server ..................................... SKIPPED
[INFO] Phoenix Assembly ................................... SKIPPED
[INFO] Phoenix - Tracing Web Application .................. SKIPPED
[INFO] ------------------------------------------------------------------------
[INFO] BUILD FAILURE
[INFO] ------------------------------------------------------------------------
[INFO] Total time: 01:18 h
[INFO] Finished at: 2017-06-07T19:02:08Z
[INFO] Final Memory: 60M/1345M
[INFO] ------------------------------------------------------------------------
[ERROR] Failed to execute goal org.apache.maven.plugins:maven-failsafe-plugin:2.19.1:verify
(ParallelStatsEnabledTest) on project phoenix-core: There was a timeout or other error in
the fork -> [Help 1]
[ERROR] 
[ERROR] To see the full stack trace of the errors, re-run Maven with the -e switch.
[ERROR] Re-run Maven using the -X switch to enable full debug logging.
[ERROR] 
[ERROR] For more information about the errors and possible solutions, please read the following
articles:
[ERROR] [Help 1] http://cwiki.apache.org/confluence/display/MAVEN/MojoExecutionException
[ERROR] 
[ERROR] After correcting the problems, you can resume the build with the command
[ERROR]   mvn <goals> -rf :phoenix-core
Build step 'Invoke top-level Maven targets' marked build as failure
Archiving artifacts
[JIRA] Updating issue PHOENIX-3913
[JIRA] Updating issue PHOENIX-3773
Recording test results
Not sending mail to unregistered user ankitsinghal59@gmail.com

Mime
View raw message