phoenix-commits mailing list archives

Site index · List index
Message view « Date » · « Thread »
Top « Date » · « Thread »
From Apache Jenkins Server <jenk...@builds.apache.org>
Subject Build failed in Jenkins: Phoenix-Calcite #128
Date Thu, 29 Jun 2017 09:52:31 GMT
See <https://builds.apache.org/job/Phoenix-calcite/128/display/redirect?page=changes>

Changes:

[rajeshbabu] PHOENIX-3984 PDataType to Calcite type conversion should consider

------------------------------------------
[...truncated 4.19 MB...]

testGlobalPhoenixMetricsForUpsertSelect(org.apache.phoenix.monitoring.PhoenixMetricsIT)  Time
elapsed: 5.003 sec  <<< FAILURE!
java.lang.AssertionError: expected:<10> but was:<20>
	at org.apache.phoenix.monitoring.PhoenixMetricsIT.testGlobalPhoenixMetricsForUpsertSelect(PhoenixMetricsIT.java:164)

testGlobalPhoenixMetricsForMutations(org.apache.phoenix.monitoring.PhoenixMetricsIT)  Time
elapsed: 1.459 sec  <<< FAILURE!
java.lang.AssertionError: expected:<10> but was:<0>
	at org.apache.phoenix.monitoring.PhoenixMetricsIT.testGlobalPhoenixMetricsForMutations(PhoenixMetricsIT.java:140)

testMetricsForDeleteWithAutoCommit(org.apache.phoenix.monitoring.PhoenixMetricsIT)  Time elapsed:
2.957 sec  <<< FAILURE!
java.lang.AssertionError: The two metrics have different or unequal number of table names

	at org.apache.phoenix.monitoring.PhoenixMetricsIT.assertMetricsAreSame(PhoenixMetricsIT.java:649)
	at org.apache.phoenix.monitoring.PhoenixMetricsIT.testMetricsForDeleteWithAutoCommit(PhoenixMetricsIT.java:439)

testMetricsForUpsertSelect(org.apache.phoenix.monitoring.PhoenixMetricsIT)  Time elapsed:
5.094 sec  <<< FAILURE!
java.lang.AssertionError: Mutation batch sizes didn't match! expected:<10> but was:<20>
	at org.apache.phoenix.monitoring.PhoenixMetricsIT.assertMutationMetrics(PhoenixMetricsIT.java:816)
	at org.apache.phoenix.monitoring.PhoenixMetricsIT.testMetricsForUpsertSelect(PhoenixMetricsIT.java:303)

Tests run: 2, Failures: 0, Errors: 0, Skipped: 0, Time elapsed: 163.393 sec - in org.apache.phoenix.iterate.ScannerLeaseRenewalIT

Results :

Failed tests: 
  CsvBulkLoadToolIT.testImportOneIndexTable:283->testImportOneIndexTable:321
  CsvBulkLoadToolIT.testImportOneLocalIndexTable:288->testImportOneIndexTable:321
  QueryTimeoutIT.testQueryTimeout:136 Total time of query was 17276 ms, but expected to be
greater than 1000
  QueryTimeoutIT.testSetRPCTimeOnConnection:102
  RegexBulkLoadToolIT.testImportOneIndexTable:250->testImportOneIndexTable:289
  RegexBulkLoadToolIT.testImportOneLocalIndexTable:255->testImportOneIndexTable:289
  StatsCollectorIT.testUpdateStatsWithMultipleTables:301->upsertValues:341->upsertStmt:406
  StatsCollectorIT.testUpdateStatsWithMultipleTables:301->upsertValues:341->upsertStmt:406
  StatsCollectorIT.testUpdateStatsWithMultipleTables:301->upsertValues:341->upsertStmt:406
  StatsCollectorIT.testUpdateStatsWithMultipleTables:301->upsertValues:341->upsertStmt:406
  StatsCollectorIT.testUpdateStatsWithMultipleTables:301->upsertValues:341->upsertStmt:406
  StatsCollectorIT.testUpdateStatsWithMultipleTables:301->upsertValues:341->upsertStmt:406
  StatsCollectorIT.testUpdateStatsWithMultipleTables:301->upsertValues:341->upsertStmt:406
  StatsCollectorIT.testUpdateStatsWithMultipleTables:301->upsertValues:341->upsertStmt:406
  StatsCollectorIT.testUpdateStatsWithMultipleTables:301->upsertValues:341->upsertStmt:406
  StatsCollectorIT.testUpdateStatsWithMultipleTables:301->upsertValues:341->upsertStmt:406
  StatsCollectorIT.testUpdateStatsWithMultipleTables:301->upsertValues:341->upsertStmt:406
  StatsCollectorIT.testUpdateStatsWithMultipleTables:301->upsertValues:341->upsertStmt:406
  StatsCollectorIT.testUpdateStats:234->upsertValues:341->upsertStmt:406
  StatsCollectorIT.testUpdateStats:234->upsertValues:341->upsertStmt:406
  StatsCollectorIT.testUpdateStats:234->upsertValues:341->upsertStmt:406
  StatsCollectorIT.testUpdateStats:234->upsertValues:341->upsertStmt:406
  StatsCollectorIT.testUpdateStats:234->upsertValues:341->upsertStmt:406
  StatsCollectorIT.testUpdateStats:234->upsertValues:341->upsertStmt:406
  StatsCollectorIT.testUpdateStats:234->upsertValues:341->upsertStmt:406
  StatsCollectorIT.testUpdateStats:234->upsertValues:341->upsertStmt:406
  StatsCollectorIT.testUpdateStats:234->upsertValues:341->upsertStmt:406
  StatsCollectorIT.testUpdateStats:234->upsertValues:341->upsertStmt:406
  StatsCollectorIT.testUpdateStats:234->upsertValues:341->upsertStmt:406
  StatsCollectorIT.testUpdateStats:234->upsertValues:341->upsertStmt:406
  SysTableNamespaceMappedStatsCollectorIT>StatsCollectorIT.testUpdateStatsWithMultipleTables:301->StatsCollectorIT.upsertValues:341->StatsCollectorIT.upsertStmt:406
  SysTableNamespaceMappedStatsCollectorIT>StatsCollectorIT.testUpdateStatsWithMultipleTables:301->StatsCollectorIT.upsertValues:341->StatsCollectorIT.upsertStmt:406
  SysTableNamespaceMappedStatsCollectorIT>StatsCollectorIT.testUpdateStatsWithMultipleTables:301->StatsCollectorIT.upsertValues:341->StatsCollectorIT.upsertStmt:406
  SysTableNamespaceMappedStatsCollectorIT>StatsCollectorIT.testUpdateStatsWithMultipleTables:301->StatsCollectorIT.upsertValues:341->StatsCollectorIT.upsertStmt:406
  SysTableNamespaceMappedStatsCollectorIT>StatsCollectorIT.testUpdateStatsWithMultipleTables:301->StatsCollectorIT.upsertValues:341->StatsCollectorIT.upsertStmt:406
  SysTableNamespaceMappedStatsCollectorIT>StatsCollectorIT.testUpdateStatsWithMultipleTables:301->StatsCollectorIT.upsertValues:341->StatsCollectorIT.upsertStmt:406
  SysTableNamespaceMappedStatsCollectorIT>StatsCollectorIT.testUpdateStatsWithMultipleTables:301->StatsCollectorIT.upsertValues:341->StatsCollectorIT.upsertStmt:406
  SysTableNamespaceMappedStatsCollectorIT>StatsCollectorIT.testUpdateStatsWithMultipleTables:301->StatsCollectorIT.upsertValues:341->StatsCollectorIT.upsertStmt:406
  SysTableNamespaceMappedStatsCollectorIT>StatsCollectorIT.testUpdateStatsWithMultipleTables:301->StatsCollectorIT.upsertValues:341->StatsCollectorIT.upsertStmt:406
  SysTableNamespaceMappedStatsCollectorIT>StatsCollectorIT.testUpdateStatsWithMultipleTables:301->StatsCollectorIT.upsertValues:341->StatsCollectorIT.upsertStmt:406
  SysTableNamespaceMappedStatsCollectorIT>StatsCollectorIT.testUpdateStatsWithMultipleTables:301->StatsCollectorIT.upsertValues:341->StatsCollectorIT.upsertStmt:406
  SysTableNamespaceMappedStatsCollectorIT>StatsCollectorIT.testUpdateStatsWithMultipleTables:301->StatsCollectorIT.upsertValues:341->StatsCollectorIT.upsertStmt:406
  SysTableNamespaceMappedStatsCollectorIT>StatsCollectorIT.testUpdateStats:234->StatsCollectorIT.upsertValues:341->StatsCollectorIT.upsertStmt:406
  SysTableNamespaceMappedStatsCollectorIT>StatsCollectorIT.testUpdateStats:234->StatsCollectorIT.upsertValues:341->StatsCollectorIT.upsertStmt:406
  SysTableNamespaceMappedStatsCollectorIT>StatsCollectorIT.testUpdateStats:234->StatsCollectorIT.upsertValues:341->StatsCollectorIT.upsertStmt:406
  SysTableNamespaceMappedStatsCollectorIT>StatsCollectorIT.testUpdateStats:234->StatsCollectorIT.upsertValues:341->StatsCollectorIT.upsertStmt:406
  SysTableNamespaceMappedStatsCollectorIT>StatsCollectorIT.testUpdateStats:234->StatsCollectorIT.upsertValues:341->StatsCollectorIT.upsertStmt:406
  SysTableNamespaceMappedStatsCollectorIT>StatsCollectorIT.testUpdateStats:234->StatsCollectorIT.upsertValues:341->StatsCollectorIT.upsertStmt:406
  SysTableNamespaceMappedStatsCollectorIT>StatsCollectorIT.testUpdateStats:234->StatsCollectorIT.upsertValues:341->StatsCollectorIT.upsertStmt:406
  SysTableNamespaceMappedStatsCollectorIT>StatsCollectorIT.testUpdateStats:234->StatsCollectorIT.upsertValues:341->StatsCollectorIT.upsertStmt:406
  SysTableNamespaceMappedStatsCollectorIT>StatsCollectorIT.testUpdateStats:234->StatsCollectorIT.upsertValues:341->StatsCollectorIT.upsertStmt:406
  SysTableNamespaceMappedStatsCollectorIT>StatsCollectorIT.testUpdateStats:234->StatsCollectorIT.upsertValues:341->StatsCollectorIT.upsertStmt:406
  SysTableNamespaceMappedStatsCollectorIT>StatsCollectorIT.testUpdateStats:234->StatsCollectorIT.upsertValues:341->StatsCollectorIT.upsertStmt:406
  SysTableNamespaceMappedStatsCollectorIT>StatsCollectorIT.testUpdateStats:234->StatsCollectorIT.upsertValues:341->StatsCollectorIT.upsertStmt:406
  UserDefinedFunctionsIT.testTemporaryFunctions:603 FunctionNotFoundException should be thrown
  ImmutableIndexIT.testDropIfImmutableKeyValueColumn:150
  ImmutableIndexIT.testDropIfImmutableKeyValueColumn:150
  ImmutableIndexIT.testDropIfImmutableKeyValueColumn:150
  ImmutableIndexIT.testDropIfImmutableKeyValueColumn:150
  ImmutableIndexIT.testDropIfImmutableKeyValueColumn:150
  ImmutableIndexIT.testDropIfImmutableKeyValueColumn:150
  ImmutableIndexIT.testDropIfImmutableKeyValueColumn:150
  ImmutableIndexIT.testDropIfImmutableKeyValueColumn:150
  LocalIndexIT.testLocalIndexScanJoinColumnsFromDataTable:342->BaseTest.assertEquals:1786
expected:<[f]> but was:<[b]>
  LocalIndexIT.testLocalIndexScanJoinColumnsFromDataTable:342->BaseTest.assertEquals:1786
expected:<[f]> but was:<[b]>
  LocalIndexIT.testLocalIndexScanWithInList:550->BaseTest.assertEquals:1786 expected:<[j]>
but was:<[b]>
  LocalIndexIT.testLocalIndexScanWithInList:550->BaseTest.assertEquals:1786 expected:<[j]>
but was:<[b]>
  PhoenixMetricsIT.testGlobalPhoenixMetricsForMutations:140->BaseTest.assertEquals:1830
expected:<10> but was:<0>
  PhoenixMetricsIT.testGlobalPhoenixMetricsForQueries:120->BaseTest.assertEquals:1830 expected:<1>
but was:<0>
  PhoenixMetricsIT.testGlobalPhoenixMetricsForUpsertSelect:164->BaseTest.assertEquals:1830
expected:<10> but was:<20>
  PhoenixMetricsIT.testMetricsForDelete:328->assertReadMetricsForMutatingSql:784 No read
metrics present when there should have been!
  PhoenixMetricsIT.testMetricsForDeleteWithAutoCommit:439->assertMetricsAreSame:649 The
two metrics have different or unequal number of table names 
  PhoenixMetricsIT.testMetricsForUpsertSelect:303->assertMutationMetrics:816->BaseTest.assertEquals:1826
Mutation batch sizes didn't match! expected:<10> but was:<20>
Tests in error: 
  CsvBulkLoadToolIT.testImportWithLocalIndex:268 » SQL java.sql.SQLException: Er...
  FlappingLocalIndexIT.testLocalIndexScanWithSmallChunks:97 » SQL java.sql.SQLEx...
  FlappingLocalIndexIT.testLocalIndexScanWithSmallChunks:97 » SQL java.sql.SQLEx...
  FlappingLocalIndexIT.testScanWhenATableHasMultipleLocalIndexes:68 » SQL java.s...
  FlappingLocalIndexIT.testScanWhenATableHasMultipleLocalIndexes:68 » SQL java.s...
  IndexExtendedIT.testLocalIndexScanAfterRegionSplit:432 » SQL java.sql.SQLExcep...
  IndexExtendedIT.testLocalIndexScanAfterRegionsMerge:534 » SQL java.sql.SQLExce...
  IndexExtendedIT.testMutableIndexWithUpdates:163 » SQL java.sql.SQLException: E...
  IndexExtendedIT.testMutableIndexWithUpdates:163 » SQL java.sql.SQLException: E...
  IndexExtendedIT.testMutableIndexWithUpdates:163 » SQL java.sql.SQLException: E...
  IndexExtendedIT.testMutableIndexWithUpdates:163 » SQL java.sql.SQLException: E...
  IndexExtendedIT.testSecondaryIndex:246 » SQL java.sql.SQLException: Error whil...
  IndexExtendedIT.testSecondaryIndex:246 » SQL java.sql.SQLException: Error whil...
  IndexExtendedIT.testSecondaryIndex:246 » SQL java.sql.SQLException: Error whil...
  IndexExtendedIT.testSecondaryIndex:246 » SQL java.sql.SQLException: Error whil...
  IndexExtendedIT.testSecondaryIndex:246 » SQL java.sql.SQLException: Error whil...
  IndexExtendedIT.testSecondaryIndex:246 » SQL java.sql.SQLException: Error whil...
  IndexExtendedIT.testSecondaryIndex:246 » SQL java.sql.SQLException: Error whil...
  IndexExtendedIT.testSecondaryIndex:246 » SQL java.sql.SQLException: Error whil...
  IndexExtendedIT.testSecondaryIndex:246 » SQL java.sql.SQLException: Error whil...
  IndexExtendedIT.testSecondaryIndex:246 » SQL java.sql.SQLException: Error whil...
  IndexExtendedIT.testSecondaryIndex:246 » SQL java.sql.SQLException: Error whil...
  IndexExtendedIT.testSecondaryIndex:246 » SQL java.sql.SQLException: Error whil...
  IndexExtendedIT.testSecondaryIndex:246 » SQL java.sql.SQLException: Error whil...
  IndexExtendedIT.testSecondaryIndex:246 » SQL java.sql.SQLException: Error whil...
  IndexExtendedIT.testSecondaryIndex:246 » SQL java.sql.SQLException: Error whil...
  IndexExtendedIT.testSecondaryIndex:246 » SQL java.sql.SQLException: Error whil...
  IndexToolForPartialBuildIT.testSecondaryIndex:180 » SQL java.sql.SQLException:...
  IndexToolForPartialBuildIT.testSecondaryIndex:180 » SQL java.sql.SQLException:...
  IndexToolForPartialBuildWithNamespaceEnabledIT>IndexToolForPartialBuildIT.testSecondaryIndex:180
» SQL
  IndexToolForPartialBuildWithNamespaceEnabledIT>IndexToolForPartialBuildIT.testSecondaryIndex:180
» SQL
  RegexBulkLoadToolIT.testImportWithLocalIndex:239 » SQL java.sql.SQLException: ...
  SpillableGroupByIT.testScanUri:120 » SQL java.sql.SQLException: Error while ex...
  StatsCollectorIT.testRowCountAndByteCounts:635 » SQL java.sql.SQLException: Er...
  StatsCollectorIT.testRowCountAndByteCounts:635 » SQL java.sql.SQLException: Er...
  StatsCollectorIT.testRowCountAndByteCounts:635 » SQL java.sql.SQLException: Er...
  StatsCollectorIT.testRowCountAndByteCounts:635 » SQL java.sql.SQLException: Er...
  StatsCollectorIT.testRowCountAndByteCounts:635 » SQL java.sql.SQLException: Er...
  StatsCollectorIT.testRowCountAndByteCounts:635 » SQL java.sql.SQLException: Er...
  StatsCollectorIT.testRowCountAndByteCounts:635 » SQL java.sql.SQLException: Er...
  StatsCollectorIT.testRowCountAndByteCounts:635 » SQL java.sql.SQLException: Er...
  StatsCollectorIT.testRowCountAndByteCounts:635 » SQL java.sql.SQLException: Er...
  StatsCollectorIT.testRowCountAndByteCounts:635 » SQL java.sql.SQLException: Er...
  StatsCollectorIT.testRowCountAndByteCounts:635 » SQL java.sql.SQLException: Er...
  StatsCollectorIT.testRowCountAndByteCounts:635 » SQL java.sql.SQLException: Er...
  StatsCollectorIT.testWithMultiCF:561 » SQL java.sql.SQLException: Error while ...
  StatsCollectorIT.testWithMultiCF:561 » SQL java.sql.SQLException: Error while ...
  StatsCollectorIT.testWithMultiCF:561 » SQL java.sql.SQLException: Error while ...
  StatsCollectorIT.testWithMultiCF:561 » SQL java.sql.SQLException: Error while ...
  StatsCollectorIT.testWithMultiCF:561 » SQL java.sql.SQLException: Error while ...
  StatsCollectorIT.testWithMultiCF:561 » SQL java.sql.SQLException: Error while ...
  StatsCollectorIT.testWithMultiCF:561 » SQL java.sql.SQLException: Error while ...
  StatsCollectorIT.testWithMultiCF:561 » SQL java.sql.SQLException: Error while ...
  StatsCollectorIT.testWithMultiCF:561 » SQL java.sql.SQLException: Error while ...
  StatsCollectorIT.testWithMultiCF:561 » SQL java.sql.SQLException: Error while ...
  StatsCollectorIT.testWithMultiCF:561 » SQL java.sql.SQLException: Error while ...
  StatsCollectorIT.testWithMultiCF:561 » SQL java.sql.SQLException: Error while ...
  SysTableNamespaceMappedStatsCollectorIT>StatsCollectorIT.testRowCountAndByteCounts:635
» SQL
  SysTableNamespaceMappedStatsCollectorIT>StatsCollectorIT.testRowCountAndByteCounts:635
» SQL
  SysTableNamespaceMappedStatsCollectorIT>StatsCollectorIT.testRowCountAndByteCounts:635
» SQL
  SysTableNamespaceMappedStatsCollectorIT>StatsCollectorIT.testRowCountAndByteCounts:635
» SQL
  SysTableNamespaceMappedStatsCollectorIT>StatsCollectorIT.testRowCountAndByteCounts:635
» SQL
  SysTableNamespaceMappedStatsCollectorIT>StatsCollectorIT.testRowCountAndByteCounts:635
» SQL
  SysTableNamespaceMappedStatsCollectorIT>StatsCollectorIT.testRowCountAndByteCounts:635
» SQL
  SysTableNamespaceMappedStatsCollectorIT>StatsCollectorIT.testRowCountAndByteCounts:635
» SQL
  SysTableNamespaceMappedStatsCollectorIT>StatsCollectorIT.testRowCountAndByteCounts:635
» SQL
  SysTableNamespaceMappedStatsCollectorIT>StatsCollectorIT.testRowCountAndByteCounts:635
» SQL
  SysTableNamespaceMappedStatsCollectorIT>StatsCollectorIT.testRowCountAndByteCounts:635
» SQL
  SysTableNamespaceMappedStatsCollectorIT>StatsCollectorIT.testRowCountAndByteCounts:635
» SQL
  SysTableNamespaceMappedStatsCollectorIT>StatsCollectorIT.testWithMultiCF:561 » SQL
  SysTableNamespaceMappedStatsCollectorIT>StatsCollectorIT.testWithMultiCF:561 » SQL
  SysTableNamespaceMappedStatsCollectorIT>StatsCollectorIT.testWithMultiCF:561 » SQL
  SysTableNamespaceMappedStatsCollectorIT>StatsCollectorIT.testWithMultiCF:561 » SQL
  SysTableNamespaceMappedStatsCollectorIT>StatsCollectorIT.testWithMultiCF:561 » SQL
  SysTableNamespaceMappedStatsCollectorIT>StatsCollectorIT.testWithMultiCF:561 » SQL
  SysTableNamespaceMappedStatsCollectorIT>StatsCollectorIT.testWithMultiCF:561 » SQL
  SysTableNamespaceMappedStatsCollectorIT>StatsCollectorIT.testWithMultiCF:561 » SQL
  SysTableNamespaceMappedStatsCollectorIT>StatsCollectorIT.testWithMultiCF:561 » SQL
  SysTableNamespaceMappedStatsCollectorIT>StatsCollectorIT.testWithMultiCF:561 » SQL
  SysTableNamespaceMappedStatsCollectorIT>StatsCollectorIT.testWithMultiCF:561 » SQL
  SysTableNamespaceMappedStatsCollectorIT>StatsCollectorIT.testWithMultiCF:561 » SQL
  UserDefinedFunctionsIT.testCreateFunction:395 » SQL java.sql.SQLException: Err...
  UserDefinedFunctionsIT.testDeleteJar:303 » SQL java.sql.SQLException: Error wh...
  UserDefinedFunctionsIT.testDropFunction:639 » SQL java.sql.SQLException: Error...
  UserDefinedFunctionsIT.testFunctionalIndexesWithUDFFunction:765 » FunctionNotFound
  UserDefinedFunctionsIT.testListJars:283 » SQL java.sql.SQLException: Error whi...
  UserDefinedFunctionsIT.testUDFsWhenTimestampManagedAtClient:691 » SQL java.sql...
  UserDefinedFunctionsIT.testUDFsWithMultipleConnections:515 » SQL java.sql.SQLE...
  ImmutableIndexIT.testCreateIndexDuringUpsertSelect:188 » SQL java.sql.SQLExcep...
  ImmutableIndexIT.testCreateIndexDuringUpsertSelect:188 » SQL java.sql.SQLExcep...
  ImmutableIndexIT.testCreateIndexDuringUpsertSelect:188 » SQL java.sql.SQLExcep...
  ImmutableIndexIT.testCreateIndexDuringUpsertSelect:188 » SQL java.sql.SQLExcep...
  LocalIndexIT.testIndexPlanSelectionIfBothGlobalAndLocalIndexesHasSameColumnsAndOrder:403
» SQL
  LocalIndexIT.testIndexPlanSelectionIfBothGlobalAndLocalIndexesHasSameColumnsAndOrder:403
» SQL
  LocalIndexIT.testLocalIndexesOnTableWithImmutableRows:500 » SQL java.sql.SQLEx...
  LocalIndexIT.testLocalIndexesOnTableWithImmutableRows:500 » SQL java.sql.SQLEx...
  MutableIndexFailureIT.testWriteFailureDisablesIndex:134->helpTestWriteFailureDisablesIndex:232
» Commit
  RoundRobinResultIteratorWithStatsIT.testRoundRobinBehavior:87 » SQL java.sql.S...
  PhoenixMetricsIT.testNoMetricsCollectedForConnection:348 » SQL does not implem...
  PhoenixMetricsIT.testReadMetricsForSelect:227 » SQL does not implement 'class ...

Tests run: 519, Failures: 73, Errors: 100, Skipped: 48

[INFO] 
[INFO] --- maven-failsafe-plugin:2.19.1:verify (ParallelStatsEnabledTest) @ phoenix-core ---
[INFO] ------------------------------------------------------------------------
[INFO] Reactor Summary:
[INFO] 
[INFO] Apache Phoenix ..................................... SUCCESS [  4.332 s]
[INFO] Phoenix Core ....................................... FAILURE [  01:34 h]
[INFO] Phoenix - Flume .................................... SKIPPED
[INFO] Phoenix - Kafka .................................... SKIPPED
[INFO] Phoenix - Pig ...................................... SKIPPED
[INFO] Phoenix Query Server Client ........................ SKIPPED
[INFO] Phoenix Query Server ............................... SKIPPED
[INFO] Phoenix - Pherf .................................... SKIPPED
[INFO] Phoenix - Spark .................................... SKIPPED
[INFO] Phoenix - Hive ..................................... SKIPPED
[INFO] Phoenix Client ..................................... SKIPPED
[INFO] Phoenix Server ..................................... SKIPPED
[INFO] Phoenix Assembly ................................... SKIPPED
[INFO] Phoenix - Tracing Web Application .................. SKIPPED
[INFO] ------------------------------------------------------------------------
[INFO] BUILD FAILURE
[INFO] ------------------------------------------------------------------------
[INFO] Total time: 01:35 h
[INFO] Finished at: 2017-06-29T09:49:44Z
[INFO] Final Memory: 71M/871M
[INFO] ------------------------------------------------------------------------
[ERROR] Failed to execute goal org.apache.maven.plugins:maven-failsafe-plugin:2.19.1:verify
(ParallelStatsEnabledTest) on project phoenix-core: There are test failures.
[ERROR] 
[ERROR] Please refer to <https://builds.apache.org/job/Phoenix-calcite/ws/phoenix-core/target/failsafe-reports>
for the individual test results.
[ERROR] -> [Help 1]
[ERROR] 
[ERROR] To see the full stack trace of the errors, re-run Maven with the -e switch.
[ERROR] Re-run Maven using the -X switch to enable full debug logging.
[ERROR] 
[ERROR] For more information about the errors and possible solutions, please read the following
articles:
[ERROR] [Help 1] http://cwiki.apache.org/confluence/display/MAVEN/MojoFailureException
[ERROR] 
[ERROR] After correcting the problems, you can resume the build with the command
[ERROR]   mvn <goals> -rf :phoenix-core
Build step 'Invoke top-level Maven targets' marked build as failure
Archiving artifacts
No prior successful build to compare, so performing full copy of artifacts
Recording test results
Not sending mail to unregistered user gabrielr@ngdata.com
Not sending mail to unregistered user twdsilva@gmail.com
Not sending mail to unregistered user sergey.soldatov@gmail.com
Not sending mail to unregistered user kliewkliew@users.noreply.github.com
Not sending mail to unregistered user ankitsinghal59@gmail.com

Mime
View raw message