phoenix-commits mailing list archives

Site index · List index
Message view « Date » · « Thread »
Top « Date » · « Thread »
From Apache Jenkins Server <jenk...@builds.apache.org>
Subject Build failed in Jenkins: Phoenix | 4.x-HBase-0.98 #1525
Date Tue, 06 Jun 2017 01:23:22 GMT
See <https://builds.apache.org/job/Phoenix-4.x-HBase-0.98/1525/display/redirect?page=changes>

Changes:

[jamestaylor] PHOENIX-3744 Support snapshot scanners for MR-based queries (Akshita

------------------------------------------
[...truncated 88.80 KB...]
Running org.apache.phoenix.end2end.salted.SaltedTableVarLengthRowKeyIT
Tests run: 1, Failures: 0, Errors: 0, Skipped: 0, Time elapsed: 1.235 sec - in org.apache.phoenix.end2end.salted.SaltedTableVarLengthRowKeyIT
Running org.apache.phoenix.iterate.PhoenixQueryTimeoutIT
Tests run: 8, Failures: 0, Errors: 0, Skipped: 0, Time elapsed: 32.933 sec - in org.apache.phoenix.end2end.index.ViewIndexIT
Running org.apache.phoenix.iterate.RoundRobinResultIteratorIT
Tests run: 2, Failures: 0, Errors: 0, Skipped: 0, Time elapsed: 3.176 sec - in org.apache.phoenix.iterate.PhoenixQueryTimeoutIT
Running org.apache.phoenix.rpc.UpdateCacheIT
Tests run: 6, Failures: 0, Errors: 0, Skipped: 0, Time elapsed: 16.151 sec - in org.apache.phoenix.end2end.salted.SaltedTableUpsertSelectIT
Running org.apache.phoenix.trace.PhoenixTableMetricsWriterIT
Tests run: 2, Failures: 0, Errors: 0, Skipped: 0, Time elapsed: 2.754 sec - in org.apache.phoenix.trace.PhoenixTableMetricsWriterIT
Running org.apache.phoenix.trace.PhoenixTraceReaderIT
Tests run: 2, Failures: 0, Errors: 0, Skipped: 0, Time elapsed: 2.327 sec - in org.apache.phoenix.trace.PhoenixTraceReaderIT
Running org.apache.phoenix.trace.PhoenixTracingEndToEndIT
Tests run: 7, Failures: 0, Errors: 0, Skipped: 0, Time elapsed: 18.487 sec - in org.apache.phoenix.rpc.UpdateCacheIT
Running org.apache.phoenix.tx.FlappingTransactionIT
Tests run: 4, Failures: 0, Errors: 0, Skipped: 0, Time elapsed: 4.623 sec - in org.apache.phoenix.tx.FlappingTransactionIT
Running org.apache.phoenix.tx.ParameterizedTransactionIT
Tests run: 9, Failures: 0, Errors: 0, Skipped: 0, Time elapsed: 38.967 sec - in org.apache.phoenix.iterate.RoundRobinResultIteratorIT
Running org.apache.phoenix.tx.TransactionIT
Tests run: 7, Failures: 0, Errors: 0, Skipped: 0, Time elapsed: 34.621 sec - in org.apache.phoenix.tx.TransactionIT
Running org.apache.phoenix.tx.TxCheckpointIT
Tests run: 64, Failures: 0, Errors: 0, Skipped: 0, Time elapsed: 461.912 sec - in org.apache.phoenix.end2end.index.MutableIndexIT
Tests run: 6, Failures: 0, Errors: 0, Skipped: 0, Time elapsed: 85.321 sec - in org.apache.phoenix.trace.PhoenixTracingEndToEndIT
Tests run: 52, Failures: 0, Errors: 0, Skipped: 4, Time elapsed: 133.502 sec - in org.apache.phoenix.tx.ParameterizedTransactionIT
Tests run: 40, Failures: 0, Errors: 0, Skipped: 0, Time elapsed: 206.37 sec - in org.apache.phoenix.tx.TxCheckpointIT
Tests run: 304, Failures: 0, Errors: 0, Skipped: 0, Time elapsed: 1,460.261 sec - in org.apache.phoenix.end2end.index.IndexIT

Results :

Tests in error: 
  UpgradeIT.testMapMultiTenantTableToNamespaceDuringUpgrade:350 » TableNotFound ...
  UpgradeIT.testMapTableToNamespaceDuringUpgrade:226 » TableNotFound ERROR 1012 ...

Tests run: 2065, Failures: 0, Errors: 2, Skipped: 4

[INFO] 
[INFO] --- maven-failsafe-plugin:2.19.1:integration-test (ClientManagedTimeTests) @ phoenix-core
---

-------------------------------------------------------
 T E S T S
-------------------------------------------------------
Running org.apache.phoenix.end2end.ArrayIT
Running org.apache.phoenix.end2end.ClientTimeArithmeticQueryIT
Running org.apache.phoenix.end2end.CaseStatementIT
Running org.apache.phoenix.end2end.AggregateQueryIT
Running org.apache.phoenix.end2end.CastAndCoerceIT
Tests run: 80, Failures: 0, Errors: 0, Skipped: 0, Time elapsed: 66.508 sec - in org.apache.phoenix.end2end.ArrayIT
Running org.apache.phoenix.end2end.ColumnProjectionOptimizationIT
Tests run: 56, Failures: 0, Errors: 0, Skipped: 0, Time elapsed: 66.545 sec - in org.apache.phoenix.end2end.CaseStatementIT
Running org.apache.phoenix.end2end.CreateSchemaIT
Tests run: 49, Failures: 0, Errors: 0, Skipped: 0, Time elapsed: 65.888 sec - in org.apache.phoenix.end2end.CastAndCoerceIT
Tests run: 1, Failures: 0, Errors: 0, Skipped: 0, Time elapsed: 0.36 sec - in org.apache.phoenix.end2end.CreateSchemaIT
Running org.apache.phoenix.end2end.CreateTableIT
Running org.apache.phoenix.end2end.CustomEntityDataIT
Tests run: 3, Failures: 0, Errors: 0, Skipped: 0, Time elapsed: 3.698 sec - in org.apache.phoenix.end2end.CustomEntityDataIT
Running org.apache.phoenix.end2end.DerivedTableIT
Tests run: 3, Failures: 0, Errors: 0, Skipped: 0, Time elapsed: 16.613 sec - in org.apache.phoenix.end2end.ColumnProjectionOptimizationIT
Running org.apache.phoenix.end2end.DistinctCountIT
Tests run: 42, Failures: 0, Errors: 0, Skipped: 0, Time elapsed: 82.888 sec - in org.apache.phoenix.end2end.AggregateQueryIT
Running org.apache.phoenix.end2end.DropSchemaIT
Tests run: 18, Failures: 0, Errors: 0, Skipped: 0, Time elapsed: 13.405 sec - in org.apache.phoenix.end2end.DerivedTableIT
Running org.apache.phoenix.end2end.ExtendedQueryExecIT
Tests run: 4, Failures: 0, Errors: 0, Skipped: 0, Time elapsed: 4.22 sec - in org.apache.phoenix.end2end.ExtendedQueryExecIT
Tests run: 2, Failures: 0, Errors: 0, Skipped: 0, Time elapsed: 5.921 sec - in org.apache.phoenix.end2end.DropSchemaIT
Running org.apache.phoenix.end2end.FunkyNamesIT
Running org.apache.phoenix.end2end.GroupByIT
Tests run: 3, Failures: 0, Errors: 0, Skipped: 0, Time elapsed: 3.153 sec - in org.apache.phoenix.end2end.FunkyNamesIT
Tests run: 10, Failures: 0, Errors: 0, Skipped: 0, Time elapsed: 12.945 sec - in org.apache.phoenix.end2end.DistinctCountIT
Running org.apache.phoenix.end2end.MutableQueryIT
Running org.apache.phoenix.end2end.NativeHBaseTypesIT
Tests run: 7, Failures: 0, Errors: 0, Skipped: 0, Time elapsed: 2.858 sec - in org.apache.phoenix.end2end.NativeHBaseTypesIT
Running org.apache.phoenix.end2end.NotQueryIT
Tests run: 245, Failures: 0, Errors: 0, Skipped: 0, Time elapsed: 149.095 sec - in org.apache.phoenix.end2end.ClientTimeArithmeticQueryIT
Tests run: 91, Failures: 0, Errors: 0, Skipped: 0, Time elapsed: 60.206 sec - in org.apache.phoenix.end2end.GroupByIT
Running org.apache.phoenix.end2end.ProductMetricsIT
Tests run: 19, Failures: 0, Errors: 0, Skipped: 0, Time elapsed: 89.813 sec - in org.apache.phoenix.end2end.CreateTableIT
Running org.apache.phoenix.end2end.QueryDatabaseMetaDataIT
Running org.apache.phoenix.end2end.PointInTimeQueryIT
Tests run: 77, Failures: 0, Errors: 0, Skipped: 0, Time elapsed: 73.398 sec - in org.apache.phoenix.end2end.NotQueryIT
Tests run: 61, Failures: 0, Errors: 0, Skipped: 0, Time elapsed: 31.015 sec - in org.apache.phoenix.end2end.ProductMetricsIT
Tests run: 7, Failures: 0, Errors: 0, Skipped: 0, Time elapsed: 21.919 sec - in org.apache.phoenix.end2end.PointInTimeQueryIT
Running org.apache.phoenix.end2end.RowValueConstructorIT
Running org.apache.phoenix.end2end.QueryIT
Running org.apache.phoenix.end2end.ReadIsolationLevelIT
Tests run: 2, Failures: 0, Errors: 0, Skipped: 0, Time elapsed: 3.067 sec - in org.apache.phoenix.end2end.ReadIsolationLevelIT
Running org.apache.phoenix.end2end.ScanQueryIT
Tests run: 19, Failures: 0, Errors: 0, Skipped: 0, Time elapsed: 89.54 sec - in org.apache.phoenix.end2end.QueryDatabaseMetaDataIT
Running org.apache.phoenix.end2end.SequenceBulkAllocationIT
Tests run: 112, Failures: 0, Errors: 0, Skipped: 0, Time elapsed: 152.035 sec - in org.apache.phoenix.end2end.MutableQueryIT
Tests run: 46, Failures: 0, Errors: 0, Skipped: 0, Time elapsed: 72.477 sec - in org.apache.phoenix.end2end.RowValueConstructorIT
Running org.apache.phoenix.end2end.ToNumberFunctionIT
Running org.apache.phoenix.end2end.SequenceIT
Tests run: 112, Failures: 0, Errors: 0, Skipped: 0, Time elapsed: 59.223 sec - in org.apache.phoenix.end2end.QueryIT
Running org.apache.phoenix.end2end.TopNIT
Tests run: 112, Failures: 0, Errors: 0, Skipped: 0, Time elapsed: 54.898 sec - in org.apache.phoenix.end2end.ScanQueryIT
Running org.apache.phoenix.end2end.TruncateFunctionIT
Tests run: 56, Failures: 0, Errors: 0, Skipped: 0, Time elapsed: 28.933 sec - in org.apache.phoenix.end2end.SequenceBulkAllocationIT
Running org.apache.phoenix.end2end.UpsertSelectIT
Tests run: 1, Failures: 0, Errors: 0, Skipped: 0, Time elapsed: 3.338 sec - in org.apache.phoenix.end2end.TruncateFunctionIT
Running org.apache.phoenix.end2end.UpsertValuesIT
Tests run: 18, Failures: 0, Errors: 0, Skipped: 0, Time elapsed: 9.005 sec - in org.apache.phoenix.end2end.ToNumberFunctionIT
Tests run: 4, Failures: 0, Errors: 0, Skipped: 0, Time elapsed: 4.319 sec - in org.apache.phoenix.end2end.TopNIT
Running org.apache.phoenix.end2end.VariableLengthPKIT
Running org.apache.phoenix.end2end.salted.SaltedTableIT
Tests run: 8, Failures: 0, Errors: 0, Skipped: 0, Time elapsed: 5.468 sec - in org.apache.phoenix.end2end.salted.SaltedTableIT
Running org.apache.phoenix.rpc.UpdateCacheWithScnIT
Tests run: 1, Failures: 0, Errors: 0, Skipped: 0, Time elapsed: 3.175 sec - in org.apache.phoenix.rpc.UpdateCacheWithScnIT
Tests run: 54, Failures: 0, Errors: 0, Skipped: 0, Time elapsed: 30.169 sec - in org.apache.phoenix.end2end.SequenceIT
Tests run: 50, Failures: 0, Errors: 0, Skipped: 0, Time elapsed: 43.549 sec - in org.apache.phoenix.end2end.VariableLengthPKIT
Tests run: 25, Failures: 0, Errors: 0, Skipped: 0, Time elapsed: 61.971 sec - in org.apache.phoenix.end2end.UpsertValuesIT
Tests run: 22, Failures: 0, Errors: 0, Skipped: 0, Time elapsed: 76.163 sec - in org.apache.phoenix.end2end.UpsertSelectIT

Results :

Tests run: 1420, Failures: 0, Errors: 0, Skipped: 0

[INFO] 
[INFO] --- maven-failsafe-plugin:2.19.1:integration-test (HBaseManagedTimeTests) @ phoenix-core
---

-------------------------------------------------------
 T E S T S
-------------------------------------------------------

Results :

Tests run: 0, Failures: 0, Errors: 0, Skipped: 0

[INFO] 
[INFO] --- maven-failsafe-plugin:2.19.1:integration-test (NeedTheirOwnClusterTests) @ phoenix-core
---

-------------------------------------------------------
 T E S T S
-------------------------------------------------------
Running org.apache.hadoop.hbase.regionserver.wal.WALReplayWithIndexWritesAndCompressedWALIT
Tests run: 1, Failures: 0, Errors: 0, Skipped: 0, Time elapsed: 18.313 sec - in org.apache.hadoop.hbase.regionserver.wal.WALReplayWithIndexWritesAndCompressedWALIT
Running org.apache.phoenix.end2end.ConnectionUtilIT
Running org.apache.phoenix.end2end.CountDistinctCompressionIT
Running org.apache.phoenix.end2end.ContextClassloaderIT
Running org.apache.phoenix.end2end.CsvBulkLoadToolIT
Tests run: 1, Failures: 0, Errors: 0, Skipped: 0, Time elapsed: 18.254 sec - in org.apache.phoenix.end2end.ConnectionUtilIT
Tests run: 3, Failures: 0, Errors: 0, Skipped: 0, Time elapsed: 10.724 sec - in org.apache.phoenix.end2end.ContextClassloaderIT
Tests run: 1, Failures: 0, Errors: 0, Skipped: 0, Time elapsed: 12.278 sec - in org.apache.phoenix.end2end.CountDistinctCompressionIT
Running org.apache.phoenix.end2end.FlappingLocalIndexIT
Running org.apache.phoenix.end2end.IndexToolForPartialBuildIT
Running org.apache.phoenix.end2end.IndexExtendedIT
Running org.apache.phoenix.end2end.IndexToolForPartialBuildWithNamespaceEnabledIT
Tests run: 2, Failures: 0, Errors: 0, Skipped: 0, Time elapsed: 21.255 sec - in org.apache.phoenix.end2end.IndexToolForPartialBuildIT
Tests run: 2, Failures: 0, Errors: 0, Skipped: 0, Time elapsed: 20.962 sec - in org.apache.phoenix.end2end.IndexToolForPartialBuildWithNamespaceEnabledIT
Tests run: 11, Failures: 0, Errors: 0, Skipped: 0, Time elapsed: 64.382 sec - in org.apache.phoenix.end2end.CsvBulkLoadToolIT
Tests run: 40, Failures: 0, Errors: 0, Skipped: 16, Time elapsed: 43.08 sec - in org.apache.phoenix.end2end.IndexExtendedIT
Tests run: 8, Failures: 0, Errors: 0, Skipped: 0, Time elapsed: 65.374 sec - in org.apache.phoenix.end2end.FlappingLocalIndexIT
Running org.apache.phoenix.end2end.QueryTimeoutIT
Running org.apache.phoenix.end2end.QueryWithLimitIT
Running org.apache.phoenix.end2end.RegexBulkLoadToolIT
Running org.apache.phoenix.end2end.RenewLeaseIT
Tests run: 2, Failures: 0, Errors: 0, Skipped: 0, Time elapsed: 11.77 sec - in org.apache.phoenix.end2end.QueryWithLimitIT
Tests run: 2, Failures: 0, Errors: 0, Skipped: 0, Time elapsed: 22.014 sec - in org.apache.phoenix.end2end.QueryTimeoutIT
Running org.apache.phoenix.end2end.SpillableGroupByIT
Running org.apache.phoenix.end2end.StatsCollectorIT
Tests run: 1, Failures: 0, Errors: 0, Skipped: 0, Time elapsed: 32.329 sec - in org.apache.phoenix.end2end.RenewLeaseIT
Tests run: 2, Failures: 0, Errors: 0, Skipped: 0, Time elapsed: 13.28 sec - in org.apache.phoenix.end2end.SpillableGroupByIT
Running org.apache.phoenix.end2end.SysTableNamespaceMappedStatsCollectorIT
Tests run: 10, Failures: 0, Errors: 0, Skipped: 0, Time elapsed: 56.213 sec - in org.apache.phoenix.end2end.RegexBulkLoadToolIT
Running org.apache.phoenix.end2end.UpdateCacheAcrossDifferentClientsIT
Running org.apache.phoenix.end2end.UserDefinedFunctionsIT
Running org.apache.phoenix.end2end.index.ImmutableIndexIT
Tests run: 6, Failures: 0, Errors: 0, Skipped: 0, Time elapsed: 22.146 sec - in org.apache.phoenix.end2end.UpdateCacheAcrossDifferentClientsIT
Tests run: 14, Failures: 0, Errors: 0, Skipped: 0, Time elapsed: 31.884 sec - in org.apache.phoenix.end2end.UserDefinedFunctionsIT
Running org.apache.phoenix.end2end.index.MutableIndexFailureIT
Tests run: 1, Failures: 0, Errors: 0, Skipped: 1, Time elapsed: 0.001 sec - in org.apache.phoenix.end2end.index.MutableIndexFailureIT
Running org.apache.phoenix.end2end.index.LocalIndexIT
Running org.apache.phoenix.end2end.index.MutableIndexReplicationIT
Tests run: 1, Failures: 0, Errors: 0, Skipped: 0, Time elapsed: 18.427 sec - in org.apache.phoenix.end2end.index.MutableIndexReplicationIT
Running org.apache.phoenix.end2end.index.txn.TxWriteFailureIT
Tests run: 120, Failures: 0, Errors: 0, Skipped: 24, Time elapsed: 185.909 sec - in org.apache.phoenix.end2end.StatsCollectorIT
Tests run: 120, Failures: 0, Errors: 0, Skipped: 24, Time elapsed: 193.007 sec - in org.apache.phoenix.end2end.SysTableNamespaceMappedStatsCollectorIT
Running org.apache.phoenix.hbase.index.FailForUnsupportedHBaseVersionsIT
Running org.apache.phoenix.execute.PartialCommitIT
Tests run: 8, Failures: 0, Errors: 0, Skipped: 0, Time elapsed: 50.622 sec - in org.apache.phoenix.end2end.index.txn.TxWriteFailureIT
Tests run: 2, Failures: 0, Errors: 0, Skipped: 0, Time elapsed: 19.292 sec - in org.apache.phoenix.hbase.index.FailForUnsupportedHBaseVersionsIT
Tests run: 12, Failures: 0, Errors: 0, Skipped: 0, Time elapsed: 5.842 sec - in org.apache.phoenix.execute.PartialCommitIT
Running org.apache.phoenix.hbase.index.covered.EndToEndCoveredColumnsIndexBuilderIT
Tests run: 2, Failures: 0, Errors: 0, Skipped: 0, Time elapsed: 7.632 sec - in org.apache.phoenix.hbase.index.covered.EndToEndCoveredColumnsIndexBuilderIT
Running org.apache.phoenix.hbase.index.covered.example.EndtoEndIndexingWithCompressionIT
Running org.apache.phoenix.hbase.index.covered.example.EndToEndCoveredIndexingIT
Running org.apache.phoenix.hbase.index.covered.example.FailWithoutRetriesIT
Tests run: 1, Failures: 0, Errors: 0, Skipped: 0, Time elapsed: 7.623 sec - in org.apache.phoenix.hbase.index.covered.example.FailWithoutRetriesIT
Running org.apache.phoenix.iterate.RoundRobinResultIteratorWithStatsIT
Tests run: 1, Failures: 0, Errors: 0, Skipped: 0, Time elapsed: 12.647 sec - in org.apache.phoenix.iterate.RoundRobinResultIteratorWithStatsIT
Tests run: 11, Failures: 0, Errors: 0, Skipped: 0, Time elapsed: 62.745 sec - in org.apache.phoenix.hbase.index.covered.example.EndToEndCoveredIndexingIT
Tests run: 11, Failures: 0, Errors: 0, Skipped: 0, Time elapsed: 63.538 sec - in org.apache.phoenix.hbase.index.covered.example.EndtoEndIndexingWithCompressionIT
Running org.apache.phoenix.iterate.ScannerLeaseRenewalIT
Tests run: 24, Failures: 0, Errors: 0, Skipped: 0, Time elapsed: 289.874 sec - in org.apache.phoenix.end2end.index.ImmutableIndexIT
Running org.apache.phoenix.rpc.PhoenixClientRpcIT
Tests run: 32, Failures: 0, Errors: 0, Skipped: 0, Time elapsed: 247.781 sec - in org.apache.phoenix.end2end.index.LocalIndexIT
Running org.apache.phoenix.monitoring.PhoenixMetricsIT
Tests run: 2, Failures: 0, Errors: 0, Skipped: 0, Time elapsed: 4.917 sec - in org.apache.phoenix.rpc.PhoenixClientRpcIT
Running org.apache.phoenix.rpc.PhoenixServerRpcIT
Tests run: 2, Failures: 0, Errors: 0, Skipped: 0, Time elapsed: 14.593 sec - in org.apache.phoenix.rpc.PhoenixServerRpcIT
Tests run: 21, Failures: 0, Errors: 0, Skipped: 0, Time elapsed: 51.555 sec - in org.apache.phoenix.monitoring.PhoenixMetricsIT
Tests run: 2, Failures: 0, Errors: 0, Skipped: 0, Time elapsed: 163.927 sec - in org.apache.phoenix.iterate.ScannerLeaseRenewalIT

Results :

Tests run: 479, Failures: 0, Errors: 0, Skipped: 65

[INFO] 
[INFO] --- maven-failsafe-plugin:2.19.1:verify (ParallelStatsEnabledTest) @ phoenix-core ---
[INFO] ------------------------------------------------------------------------
[INFO] Reactor Summary:
[INFO] 
[INFO] Apache Phoenix ..................................... SUCCESS [  2.969 s]
[INFO] Phoenix Core ....................................... FAILURE [  01:08 h]
[INFO] Phoenix - Flume .................................... SKIPPED
[INFO] Phoenix - Kafka .................................... SKIPPED
[INFO] Phoenix - Pig ...................................... SKIPPED
[INFO] Phoenix Query Server Client ........................ SKIPPED
[INFO] Phoenix Query Server ............................... SKIPPED
[INFO] Phoenix - Pherf .................................... SKIPPED
[INFO] Phoenix - Spark .................................... SKIPPED
[INFO] Phoenix - Hive ..................................... SKIPPED
[INFO] Phoenix Client ..................................... SKIPPED
[INFO] Phoenix Server ..................................... SKIPPED
[INFO] Phoenix Assembly ................................... SKIPPED
[INFO] Phoenix - Tracing Web Application .................. SKIPPED
[INFO] ------------------------------------------------------------------------
[INFO] BUILD FAILURE
[INFO] ------------------------------------------------------------------------
[INFO] Total time: 01:08 h
[INFO] Finished at: 2017-06-06T01:16:03Z
[INFO] Final Memory: 58M/703M
[INFO] ------------------------------------------------------------------------
[ERROR] Failed to execute goal org.apache.maven.plugins:maven-failsafe-plugin:2.19.1:verify
(ParallelStatsEnabledTest) on project phoenix-core: There are test failures.
[ERROR] 
[ERROR] Please refer to <https://builds.apache.org/job/Phoenix-4.x-HBase-0.98/ws/phoenix-core/target/failsafe-reports>
for the individual test results.
[ERROR] -> [Help 1]
[ERROR] 
[ERROR] To see the full stack trace of the errors, re-run Maven with the -e switch.
[ERROR] Re-run Maven using the -X switch to enable full debug logging.
[ERROR] 
[ERROR] For more information about the errors and possible solutions, please read the following
articles:
[ERROR] [Help 1] http://cwiki.apache.org/confluence/display/MAVEN/MojoFailureException
[ERROR] 
[ERROR] After correcting the problems, you can resume the build with the command
[ERROR]   mvn <goals> -rf :phoenix-core
Build step 'Invoke top-level Maven targets' marked build as failure
Archiving artifacts
Compressed 1.47 GB of artifacts by 14.8% relative to #1519
Recording test results

Mime
View raw message