phoenix-commits mailing list archives

Site index · List index
Message view « Date » · « Thread »
Top « Date » · « Thread »
From Apache Jenkins Server <jenk...@builds.apache.org>
Subject Build failed in Jenkins: Phoenix-4.x-HBase-1.1 #416
Date Fri, 02 Jun 2017 22:53:17 GMT
See <https://builds.apache.org/job/Phoenix-4.x-HBase-1.1/416/display/redirect?page=changes>

Changes:

[thomas] PHOENIX-3612 Make tracking of max allowed number of mutations bytes

------------------------------------------
[...truncated 92.54 KB...]
java.lang.AssertionError: Sink not flushed. commit() not called on the connection
	at org.apache.phoenix.trace.PhoenixTracingEndToEndIT.testWriteSpans(PhoenixTracingEndToEndIT.java:112)

testScanTracing(org.apache.phoenix.trace.PhoenixTracingEndToEndIT)  Time elapsed: 209.527
sec  <<< FAILURE!
java.lang.AssertionError: Get expected updates to trace table
	at org.apache.phoenix.trace.PhoenixTracingEndToEndIT.testScanTracing(PhoenixTracingEndToEndIT.java:263)

testMultipleSpans(org.apache.phoenix.trace.PhoenixTracingEndToEndIT)  Time elapsed: 106.292
sec  <<< FAILURE!
java.lang.AssertionError: Updates not written in table
	at org.apache.phoenix.trace.PhoenixTracingEndToEndIT.testMultipleSpans(PhoenixTracingEndToEndIT.java:488)

Tests run: 304, Failures: 0, Errors: 0, Skipped: 0, Time elapsed: 1,983.151 sec - in org.apache.phoenix.end2end.index.IndexIT

Results :

Failed tests: 
  PhoenixTracingEndToEndIT.testMultipleSpans:488 Updates not written in table
  PhoenixTracingEndToEndIT.testScanTracing:263 Get expected updates to trace table
  PhoenixTracingEndToEndIT.testWriteSpans:112 Sink not flushed. commit() not called on the
connection
Tests in error: 
  UpgradeIT.testMapMultiTenantTableToNamespaceDuringUpgrade:350 » TableNotFound ...
  UpgradeIT.testMapTableToNamespaceDuringUpgrade:226 » TableNotFound ERROR 1012 ...

Tests run: 2063, Failures: 3, Errors: 2, Skipped: 4

[INFO] 
[INFO] --- maven-failsafe-plugin:2.19.1:integration-test (ClientManagedTimeTests) @ phoenix-core
---

-------------------------------------------------------
 T E S T S
-------------------------------------------------------
Running org.apache.phoenix.end2end.ColumnProjectionOptimizationIT
Running org.apache.phoenix.end2end.ArrayIT
Running org.apache.phoenix.end2end.ClientTimeArithmeticQueryIT
Running org.apache.phoenix.end2end.CaseStatementIT
Running org.apache.phoenix.end2end.AggregateQueryIT
Running org.apache.phoenix.end2end.CastAndCoerceIT
Tests run: 3, Failures: 0, Errors: 0, Skipped: 0, Time elapsed: 28.21 sec - in org.apache.phoenix.end2end.ColumnProjectionOptimizationIT
Running org.apache.phoenix.end2end.CreateSchemaIT
Tests run: 1, Failures: 0, Errors: 0, Skipped: 0, Time elapsed: 0.375 sec - in org.apache.phoenix.end2end.CreateSchemaIT
Running org.apache.phoenix.end2end.CreateTableIT
Tests run: 80, Failures: 0, Errors: 0, Skipped: 0, Time elapsed: 101.343 sec - in org.apache.phoenix.end2end.ArrayIT
Running org.apache.phoenix.end2end.CustomEntityDataIT
Tests run: 56, Failures: 0, Errors: 0, Skipped: 0, Time elapsed: 97.929 sec - in org.apache.phoenix.end2end.CaseStatementIT
Running org.apache.phoenix.end2end.DerivedTableIT
Tests run: 49, Failures: 0, Errors: 0, Skipped: 0, Time elapsed: 100.43 sec - in org.apache.phoenix.end2end.CastAndCoerceIT
Running org.apache.phoenix.end2end.DistinctCountIT
Tests run: 3, Failures: 0, Errors: 0, Skipped: 0, Time elapsed: 6.845 sec - in org.apache.phoenix.end2end.CustomEntityDataIT
Running org.apache.phoenix.end2end.DropSchemaIT
Tests run: 42, Failures: 0, Errors: 0, Skipped: 0, Time elapsed: 110.096 sec - in org.apache.phoenix.end2end.AggregateQueryIT
Running org.apache.phoenix.end2end.ExtendedQueryExecIT
Tests run: 2, Failures: 0, Errors: 0, Skipped: 0, Time elapsed: 10.819 sec - in org.apache.phoenix.end2end.DropSchemaIT
Running org.apache.phoenix.end2end.FunkyNamesIT
Tests run: 4, Failures: 0, Errors: 0, Skipped: 0, Time elapsed: 7.264 sec - in org.apache.phoenix.end2end.ExtendedQueryExecIT
Tests run: 18, Failures: 0, Errors: 0, Skipped: 0, Time elapsed: 21.091 sec - in org.apache.phoenix.end2end.DerivedTableIT
Running org.apache.phoenix.end2end.GroupByIT
Tests run: 3, Failures: 0, Errors: 0, Skipped: 0, Time elapsed: 5.409 sec - in org.apache.phoenix.end2end.FunkyNamesIT
Tests run: 10, Failures: 0, Errors: 0, Skipped: 0, Time elapsed: 21.258 sec - in org.apache.phoenix.end2end.DistinctCountIT
Running org.apache.phoenix.end2end.MutableQueryIT
Running org.apache.phoenix.end2end.NotQueryIT
Running org.apache.phoenix.end2end.NativeHBaseTypesIT
Tests run: 7, Failures: 0, Errors: 0, Skipped: 0, Time elapsed: 5.4 sec - in org.apache.phoenix.end2end.NativeHBaseTypesIT
Running org.apache.phoenix.end2end.PointInTimeQueryIT
Tests run: 245, Failures: 0, Errors: 0, Skipped: 0, Time elapsed: 179.229 sec - in org.apache.phoenix.end2end.ClientTimeArithmeticQueryIT
Tests run: 77, Failures: 0, Errors: 0, Skipped: 0, Time elapsed: 67.048 sec - in org.apache.phoenix.end2end.NotQueryIT
Running org.apache.phoenix.end2end.QueryDatabaseMetaDataIT
Tests run: 19, Failures: 0, Errors: 0, Skipped: 0, Time elapsed: 169.486 sec - in org.apache.phoenix.end2end.CreateTableIT
Tests run: 91, Failures: 0, Errors: 0, Skipped: 0, Time elapsed: 76.11 sec - in org.apache.phoenix.end2end.GroupByIT
Running org.apache.phoenix.end2end.ReadIsolationLevelIT
Running org.apache.phoenix.end2end.QueryIT
Tests run: 2, Failures: 0, Errors: 0, Skipped: 0, Time elapsed: 6.229 sec - in org.apache.phoenix.end2end.ReadIsolationLevelIT
Running org.apache.phoenix.end2end.RowValueConstructorIT
Running org.apache.phoenix.end2end.ProductMetricsIT
Tests run: 7, Failures: 0, Errors: 0, Skipped: 0, Time elapsed: 78.989 sec - in org.apache.phoenix.end2end.PointInTimeQueryIT
Running org.apache.phoenix.end2end.ScanQueryIT
Tests run: 61, Failures: 0, Errors: 0, Skipped: 0, Time elapsed: 24.55 sec - in org.apache.phoenix.end2end.ProductMetricsIT
Running org.apache.phoenix.end2end.SequenceBulkAllocationIT
Tests run: 56, Failures: 0, Errors: 0, Skipped: 0, Time elapsed: 36.772 sec - in org.apache.phoenix.end2end.SequenceBulkAllocationIT
Running org.apache.phoenix.end2end.SequenceIT
Tests run: 112, Failures: 0, Errors: 0, Skipped: 0, Time elapsed: 76.767 sec - in org.apache.phoenix.end2end.ScanQueryIT
Tests run: 112, Failures: 0, Errors: 0, Skipped: 0, Time elapsed: 109.449 sec - in org.apache.phoenix.end2end.QueryIT
Running org.apache.phoenix.end2end.TopNIT
Tests run: 4, Failures: 0, Errors: 0, Skipped: 0, Time elapsed: 7.585 sec - in org.apache.phoenix.end2end.TopNIT
Running org.apache.phoenix.end2end.TruncateFunctionIT
Tests run: 1, Failures: 0, Errors: 0, Skipped: 0, Time elapsed: 5.103 sec - in org.apache.phoenix.end2end.TruncateFunctionIT
Tests run: 54, Failures: 0, Errors: 0, Skipped: 0, Time elapsed: 51.869 sec - in org.apache.phoenix.end2end.SequenceIT
Running org.apache.phoenix.end2end.UpsertSelectIT
Running org.apache.phoenix.end2end.ToNumberFunctionIT
Tests run: 19, Failures: 0, Errors: 0, Skipped: 0, Time elapsed: 138.373 sec - in org.apache.phoenix.end2end.QueryDatabaseMetaDataIT
Tests run: 112, Failures: 0, Errors: 0, Skipped: 0, Time elapsed: 210.854 sec - in org.apache.phoenix.end2end.MutableQueryIT
Tests run: 46, Failures: 0, Errors: 0, Skipped: 0, Time elapsed: 131.597 sec - in org.apache.phoenix.end2end.RowValueConstructorIT
Tests run: 18, Failures: 0, Errors: 0, Skipped: 0, Time elapsed: 8.139 sec - in org.apache.phoenix.end2end.ToNumberFunctionIT
Running org.apache.phoenix.end2end.VariableLengthPKIT
Running org.apache.phoenix.end2end.UpsertValuesIT
Running org.apache.phoenix.end2end.salted.SaltedTableIT
Running org.apache.phoenix.rpc.UpdateCacheWithScnIT
Tests run: 8, Failures: 0, Errors: 0, Skipped: 0, Time elapsed: 7.364 sec - in org.apache.phoenix.end2end.salted.SaltedTableIT
Tests run: 1, Failures: 0, Errors: 0, Skipped: 0, Time elapsed: 5.185 sec - in org.apache.phoenix.rpc.UpdateCacheWithScnIT
Tests run: 50, Failures: 0, Errors: 0, Skipped: 0, Time elapsed: 47.916 sec - in org.apache.phoenix.end2end.VariableLengthPKIT
Tests run: 24, Failures: 0, Errors: 0, Skipped: 0, Time elapsed: 137.698 sec - in org.apache.phoenix.end2end.UpsertSelectIT
Tests run: 25, Failures: 0, Errors: 0, Skipped: 0, Time elapsed: 115.126 sec - in org.apache.phoenix.end2end.UpsertValuesIT

Results :

Tests run: 1422, Failures: 0, Errors: 0, Skipped: 0

[INFO] 
[INFO] --- maven-failsafe-plugin:2.19.1:integration-test (HBaseManagedTimeTests) @ phoenix-core
---

-------------------------------------------------------
 T E S T S
-------------------------------------------------------

Results :

Tests run: 0, Failures: 0, Errors: 0, Skipped: 0

[INFO] 
[INFO] --- maven-failsafe-plugin:2.19.1:integration-test (NeedTheirOwnClusterTests) @ phoenix-core
---

-------------------------------------------------------
 T E S T S
-------------------------------------------------------
Running org.apache.hadoop.hbase.regionserver.wal.WALReplayWithIndexWritesAndCompressedWALIT
Running org.apache.phoenix.end2end.ConnectionUtilIT
Tests run: 1, Failures: 0, Errors: 0, Skipped: 0, Time elapsed: 31.804 sec - in org.apache.hadoop.hbase.regionserver.wal.WALReplayWithIndexWritesAndCompressedWALIT
Running org.apache.phoenix.end2end.CountDistinctCompressionIT
Running org.apache.phoenix.end2end.CsvBulkLoadToolIT
Running org.apache.phoenix.end2end.ContextClassloaderIT
Tests run: 1, Failures: 0, Errors: 0, Skipped: 0, Time elapsed: 9.666 sec - in org.apache.phoenix.end2end.CountDistinctCompressionIT
Tests run: 1, Failures: 0, Errors: 0, Skipped: 0, Time elapsed: 28.384 sec - in org.apache.phoenix.end2end.ConnectionUtilIT
Tests run: 3, Failures: 0, Errors: 0, Skipped: 0, Time elapsed: 4.022 sec - in org.apache.phoenix.end2end.ContextClassloaderIT
Running org.apache.phoenix.end2end.FlappingLocalIndexIT
Running org.apache.phoenix.end2end.IndexExtendedIT
Running org.apache.phoenix.end2end.IndexToolForPartialBuildIT
Running org.apache.phoenix.end2end.IndexToolForPartialBuildWithNamespaceEnabledIT
Tests run: 11, Failures: 0, Errors: 0, Skipped: 0, Time elapsed: 80.904 sec - in org.apache.phoenix.end2end.CsvBulkLoadToolIT
Tests run: 2, Failures: 0, Errors: 0, Skipped: 0, Time elapsed: 36.663 sec - in org.apache.phoenix.end2end.IndexToolForPartialBuildIT
Tests run: 2, Failures: 0, Errors: 0, Skipped: 0, Time elapsed: 37.699 sec - in org.apache.phoenix.end2end.IndexToolForPartialBuildWithNamespaceEnabledIT
Running org.apache.phoenix.end2end.QueryTimeoutIT
Tests run: 8, Failures: 0, Errors: 0, Skipped: 0, Time elapsed: 82.291 sec - in org.apache.phoenix.end2end.FlappingLocalIndexIT
Running org.apache.phoenix.end2end.QueryWithLimitIT
Running org.apache.phoenix.end2end.RegexBulkLoadToolIT
Tests run: 2, Failures: 0, Errors: 0, Skipped: 0, Time elapsed: 27.234 sec - in org.apache.phoenix.end2end.QueryTimeoutIT
Tests run: 2, Failures: 0, Errors: 0, Skipped: 0, Time elapsed: 8.859 sec - in org.apache.phoenix.end2end.QueryWithLimitIT
Running org.apache.phoenix.end2end.RenewLeaseIT
Running org.apache.phoenix.end2end.SpillableGroupByIT
Running org.apache.phoenix.end2end.StatsCollectorIT
Tests run: 1, Failures: 0, Errors: 0, Skipped: 0, Time elapsed: 36.996 sec - in org.apache.phoenix.end2end.RenewLeaseIT
Running org.apache.phoenix.end2end.SysTableNamespaceMappedStatsCollectorIT
Tests run: 2, Failures: 0, Errors: 0, Skipped: 0, Time elapsed: 18.153 sec - in org.apache.phoenix.end2end.SpillableGroupByIT
Tests run: 10, Failures: 0, Errors: 0, Skipped: 0, Time elapsed: 78.113 sec - in org.apache.phoenix.end2end.RegexBulkLoadToolIT
Running org.apache.phoenix.end2end.UpdateCacheAcrossDifferentClientsIT
Running org.apache.phoenix.end2end.UserDefinedFunctionsIT
Tests run: 5, Failures: 0, Errors: 0, Skipped: 0, Time elapsed: 28.462 sec - in org.apache.phoenix.end2end.UpdateCacheAcrossDifferentClientsIT
Running org.apache.phoenix.end2end.index.ImmutableIndexIT
Tests run: 14, Failures: 0, Errors: 0, Skipped: 0, Time elapsed: 50.352 sec - in org.apache.phoenix.end2end.UserDefinedFunctionsIT
Running org.apache.phoenix.end2end.index.MutableIndexFailureIT
Tests run: 1, Failures: 0, Errors: 0, Skipped: 1, Time elapsed: 0.003 sec - in org.apache.phoenix.end2end.index.MutableIndexFailureIT
Running org.apache.phoenix.end2end.index.LocalIndexIT
Tests run: 80, Failures: 0, Errors: 0, Skipped: 0, Time elapsed: 279.179 sec - in org.apache.phoenix.end2end.IndexExtendedIT
Running org.apache.phoenix.end2end.index.MutableIndexReplicationIT
Tests run: 1, Failures: 0, Errors: 0, Skipped: 0, Time elapsed: 30.128 sec - in org.apache.phoenix.end2end.index.MutableIndexReplicationIT
Running org.apache.phoenix.end2end.index.txn.TxWriteFailureIT
Running org.apache.phoenix.execute.PartialCommitIT
Tests run: 12, Failures: 0, Errors: 0, Skipped: 0, Time elapsed: 4.004 sec - in org.apache.phoenix.execute.PartialCommitIT
Running org.apache.phoenix.hbase.index.FailForUnsupportedHBaseVersionsIT
Tests run: 8, Failures: 0, Errors: 0, Skipped: 0, Time elapsed: 59.601 sec - in org.apache.phoenix.end2end.index.txn.TxWriteFailureIT
Tests run: 120, Failures: 0, Errors: 0, Skipped: 24, Time elapsed: 274.363 sec - in org.apache.phoenix.end2end.StatsCollectorIT
Tests run: 2, Failures: 0, Errors: 0, Skipped: 0, Time elapsed: 24.917 sec - in org.apache.phoenix.hbase.index.FailForUnsupportedHBaseVersionsIT
Running org.apache.phoenix.hbase.index.covered.EndToEndCoveredColumnsIndexBuilderIT
Tests run: 120, Failures: 0, Errors: 0, Skipped: 24, Time elapsed: 270.376 sec - in org.apache.phoenix.end2end.SysTableNamespaceMappedStatsCollectorIT
Tests run: 2, Failures: 0, Errors: 0, Skipped: 0, Time elapsed: 18.682 sec - in org.apache.phoenix.hbase.index.covered.EndToEndCoveredColumnsIndexBuilderIT
Running org.apache.phoenix.hbase.index.covered.example.FailWithoutRetriesIT
Running org.apache.phoenix.hbase.index.covered.example.EndToEndCoveredIndexingIT
Tests run: 1, Failures: 0, Errors: 0, Skipped: 0, Time elapsed: 8.251 sec - in org.apache.phoenix.hbase.index.covered.example.FailWithoutRetriesIT
Running org.apache.phoenix.hbase.index.covered.example.EndtoEndIndexingWithCompressionIT
Running org.apache.phoenix.iterate.RoundRobinResultIteratorWithStatsIT
Running org.apache.phoenix.iterate.ScannerLeaseRenewalIT
Tests run: 1, Failures: 0, Errors: 0, Skipped: 0, Time elapsed: 17.699 sec - in org.apache.phoenix.iterate.RoundRobinResultIteratorWithStatsIT
Running org.apache.phoenix.monitoring.PhoenixMetricsIT
Tests run: 1, Failures: 0, Errors: 1, Skipped: 0, Time elapsed: 0.007 sec <<< FAILURE!
- in org.apache.phoenix.monitoring.PhoenixMetricsIT
org.apache.phoenix.monitoring.PhoenixMetricsIT  Time elapsed: 0.007 sec  <<< ERROR!
org.apache.phoenix.exception.PhoenixIOException: java.lang.NullPointerException
	at org.apache.phoenix.monitoring.PhoenixMetricsIT.doSetup(PhoenixMetricsIT.java:95)
Caused by: java.util.concurrent.ExecutionException: java.lang.NullPointerException
	at org.apache.phoenix.monitoring.PhoenixMetricsIT.doSetup(PhoenixMetricsIT.java:95)
Caused by: java.lang.NullPointerException

Tests run: 32, Failures: 0, Errors: 0, Skipped: 0, Time elapsed: 289.106 sec - in org.apache.phoenix.end2end.index.LocalIndexIT
Tests run: 24, Failures: 0, Errors: 0, Skipped: 0, Time elapsed: 337.58 sec - in org.apache.phoenix.end2end.index.ImmutableIndexIT
Running org.apache.phoenix.rpc.PhoenixClientRpcIT
Running org.apache.phoenix.rpc.PhoenixServerRpcIT
Tests run: 2, Failures: 0, Errors: 0, Skipped: 0, Time elapsed: 9.856 sec - in org.apache.phoenix.rpc.PhoenixClientRpcIT
Tests run: 11, Failures: 0, Errors: 0, Skipped: 0, Time elapsed: 137.23 sec - in org.apache.phoenix.hbase.index.covered.example.EndToEndCoveredIndexingIT
Tests run: 11, Failures: 0, Errors: 0, Skipped: 0, Time elapsed: 135.954 sec - in org.apache.phoenix.hbase.index.covered.example.EndtoEndIndexingWithCompressionIT
Tests run: 2, Failures: 0, Errors: 0, Skipped: 0, Time elapsed: 19.452 sec - in org.apache.phoenix.rpc.PhoenixServerRpcIT
Tests run: 2, Failures: 0, Errors: 0, Skipped: 0, Time elapsed: 169.978 sec - in org.apache.phoenix.iterate.ScannerLeaseRenewalIT

Results :

Tests in error: 
  PhoenixMetricsIT.doSetup:95->BaseTest.setUpTestDriver:563->BaseTest.setUpTestDriver:571->BaseTest.initAndRegisterTestDriver:687
» PhoenixIO

Tests run: 498, Failures: 0, Errors: 1, Skipped: 49

[INFO] 
[INFO] --- maven-failsafe-plugin:2.19.1:verify (ParallelStatsEnabledTest) @ phoenix-core ---
[INFO] ------------------------------------------------------------------------
[INFO] Reactor Summary:
[INFO] 
[INFO] Apache Phoenix ..................................... SUCCESS [  3.166 s]
[INFO] Phoenix Core ....................................... FAILURE [  01:24 h]
[INFO] Phoenix - Flume .................................... SKIPPED
[INFO] Phoenix - Kafka .................................... SKIPPED
[INFO] Phoenix - Pig ...................................... SKIPPED
[INFO] Phoenix Query Server Client ........................ SKIPPED
[INFO] Phoenix Query Server ............................... SKIPPED
[INFO] Phoenix - Pherf .................................... SKIPPED
[INFO] Phoenix - Spark .................................... SKIPPED
[INFO] Phoenix - Hive ..................................... SKIPPED
[INFO] Phoenix Client ..................................... SKIPPED
[INFO] Phoenix Server ..................................... SKIPPED
[INFO] Phoenix Assembly ................................... SKIPPED
[INFO] Phoenix - Tracing Web Application .................. SKIPPED
[INFO] ------------------------------------------------------------------------
[INFO] BUILD FAILURE
[INFO] ------------------------------------------------------------------------
[INFO] Total time: 01:24 h
[INFO] Finished at: 2017-06-02T22:43:35Z
[INFO] Final Memory: 59M/1134M
[INFO] ------------------------------------------------------------------------
[ERROR] Failed to execute goal org.apache.maven.plugins:maven-failsafe-plugin:2.19.1:verify
(ParallelStatsEnabledTest) on project phoenix-core: There are test failures.
[ERROR] 
[ERROR] Please refer to <https://builds.apache.org/job/Phoenix-4.x-HBase-1.1/ws/phoenix-core/target/failsafe-reports>
for the individual test results.
[ERROR] -> [Help 1]
[ERROR] 
[ERROR] To see the full stack trace of the errors, re-run Maven with the -e switch.
[ERROR] Re-run Maven using the -X switch to enable full debug logging.
[ERROR] 
[ERROR] For more information about the errors and possible solutions, please read the following
articles:
[ERROR] [Help 1] http://cwiki.apache.org/confluence/display/MAVEN/MojoFailureException
[ERROR] 
[ERROR] After correcting the problems, you can resume the build with the command
[ERROR]   mvn <goals> -rf :phoenix-core
Build step 'Invoke top-level Maven targets' marked build as failure
Archiving artifacts
Compressed 980.96 MB of artifacts by 48.1% relative to #404
Recording test results

Mime
View raw message