phoenix-commits mailing list archives

Site index · List index
Message view « Date » · « Thread »
Top « Date » · « Thread »
From Apache Jenkins Server <jenk...@builds.apache.org>
Subject Build failed in Jenkins: Phoenix-4.x-HBase-1.2 #44
Date Fri, 09 Jun 2017 23:06:47 GMT
See <https://builds.apache.org/job/Phoenix-4.x-HBase-1.2/44/display/redirect?page=changes>

Changes:

[rajeshbabu] PHOENIX-3898 Empty result set after split with local index on

------------------------------------------
[...truncated 79.75 KB...]
[INFO] Running org.apache.phoenix.end2end.DerivedTableIT
[INFO] Tests run: 3, Failures: 0, Errors: 0, Skipped: 0, Time elapsed: 29.816 s - in org.apache.phoenix.end2end.ColumnProjectionOptimizationIT
[INFO] Running org.apache.phoenix.end2end.DistinctCountIT
[INFO] Tests run: 18, Failures: 0, Errors: 0, Skipped: 0, Time elapsed: 22.684 s - in org.apache.phoenix.end2end.DerivedTableIT
[INFO] Running org.apache.phoenix.end2end.DropSchemaIT
[INFO] Tests run: 2, Failures: 0, Errors: 0, Skipped: 0, Time elapsed: 14.072 s - in org.apache.phoenix.end2end.DropSchemaIT
[INFO] Running org.apache.phoenix.end2end.ExtendedQueryExecIT
[INFO] Tests run: 10, Failures: 0, Errors: 0, Skipped: 0, Time elapsed: 21.185 s - in org.apache.phoenix.end2end.DistinctCountIT
[INFO] Running org.apache.phoenix.end2end.FunkyNamesIT
[INFO] Tests run: 4, Failures: 0, Errors: 0, Skipped: 0, Time elapsed: 7.29 s - in org.apache.phoenix.end2end.ExtendedQueryExecIT
[INFO] Running org.apache.phoenix.end2end.GroupByIT
[INFO] Tests run: 3, Failures: 0, Errors: 0, Skipped: 0, Time elapsed: 6.37 s - in org.apache.phoenix.end2end.FunkyNamesIT
[INFO] Running org.apache.phoenix.end2end.MutableQueryIT
[INFO] Tests run: 56, Failures: 0, Errors: 0, Skipped: 0, Time elapsed: 91.09 s - in org.apache.phoenix.end2end.CaseStatementIT
[INFO] Tests run: 49, Failures: 0, Errors: 0, Skipped: 0, Time elapsed: 92.31 s - in org.apache.phoenix.end2end.CastAndCoerceIT
[INFO] Tests run: 80, Failures: 0, Errors: 0, Skipped: 0, Time elapsed: 100.848 s - in org.apache.phoenix.end2end.ArrayIT
[INFO] Running org.apache.phoenix.end2end.NotQueryIT
[INFO] Running org.apache.phoenix.end2end.NativeHBaseTypesIT
[INFO] Running org.apache.phoenix.end2end.PointInTimeQueryIT
[INFO] Tests run: 7, Failures: 0, Errors: 0, Skipped: 0, Time elapsed: 4.741 s - in org.apache.phoenix.end2end.NativeHBaseTypesIT
[INFO] Running org.apache.phoenix.end2end.ProductMetricsIT
[INFO] Tests run: 42, Failures: 0, Errors: 0, Skipped: 0, Time elapsed: 106.894 s - in org.apache.phoenix.end2end.AggregateQueryIT
[INFO] Running org.apache.phoenix.end2end.QueryDatabaseMetaDataIT
[INFO] Tests run: 61, Failures: 0, Errors: 0, Skipped: 0, Time elapsed: 25.261 s - in org.apache.phoenix.end2end.ProductMetricsIT
[INFO] Tests run: 77, Failures: 0, Errors: 0, Skipped: 0, Time elapsed: 53.849 s - in org.apache.phoenix.end2end.NotQueryIT
[INFO] Tests run: 91, Failures: 0, Errors: 0, Skipped: 0, Time elapsed: 100.453 s - in org.apache.phoenix.end2end.GroupByIT
[INFO] Tests run: 245, Failures: 0, Errors: 0, Skipped: 0, Time elapsed: 153.21 s - in org.apache.phoenix.end2end.ClientTimeArithmeticQueryIT
[INFO] Running org.apache.phoenix.end2end.QueryIT
[INFO] Tests run: 19, Failures: 0, Errors: 0, Skipped: 0, Time elapsed: 173.104 s - in org.apache.phoenix.end2end.CreateTableIT
[INFO] Running org.apache.phoenix.end2end.SequenceBulkAllocationIT
[INFO] Tests run: 7, Failures: 0, Errors: 0, Skipped: 0, Time elapsed: 80.112 s - in org.apache.phoenix.end2end.PointInTimeQueryIT
[INFO] Running org.apache.phoenix.end2end.SequenceIT
[INFO] Running org.apache.phoenix.end2end.ReadIsolationLevelIT
[INFO] Running org.apache.phoenix.end2end.RowValueConstructorIT
[INFO] Tests run: 2, Failures: 0, Errors: 0, Skipped: 0, Time elapsed: 5.95 s - in org.apache.phoenix.end2end.ReadIsolationLevelIT
[INFO] Running org.apache.phoenix.end2end.ToNumberFunctionIT
[INFO] Running org.apache.phoenix.end2end.ScanQueryIT
[INFO] Tests run: 56, Failures: 0, Errors: 0, Skipped: 0, Time elapsed: 30.679 s - in org.apache.phoenix.end2end.SequenceBulkAllocationIT
[INFO] Running org.apache.phoenix.end2end.TopNIT
[INFO] Tests run: 18, Failures: 0, Errors: 0, Skipped: 0, Time elapsed: 7.769 s - in org.apache.phoenix.end2end.ToNumberFunctionIT
[INFO] Running org.apache.phoenix.end2end.TruncateFunctionIT
[INFO] Tests run: 4, Failures: 0, Errors: 0, Skipped: 0, Time elapsed: 6.524 s - in org.apache.phoenix.end2end.TopNIT
[INFO] Running org.apache.phoenix.end2end.UpsertSelectIT
[INFO] Tests run: 1, Failures: 0, Errors: 0, Skipped: 0, Time elapsed: 5.799 s - in org.apache.phoenix.end2end.TruncateFunctionIT
[INFO] Running org.apache.phoenix.end2end.UpsertValuesIT
[INFO] Tests run: 112, Failures: 0, Errors: 0, Skipped: 0, Time elapsed: 57.235 s - in org.apache.phoenix.end2end.QueryIT
[INFO] Tests run: 54, Failures: 0, Errors: 0, Skipped: 0, Time elapsed: 54.416 s - in org.apache.phoenix.end2end.SequenceIT
[INFO] Tests run: 112, Failures: 0, Errors: 0, Skipped: 0, Time elapsed: 179.433 s - in org.apache.phoenix.end2end.MutableQueryIT
[INFO] Tests run: 19, Failures: 0, Errors: 0, Skipped: 0, Time elapsed: 132.54 s - in org.apache.phoenix.end2end.QueryDatabaseMetaDataIT
[INFO] Running org.apache.phoenix.rpc.UpdateCacheWithScnIT
[INFO] Tests run: 112, Failures: 0, Errors: 0, Skipped: 0, Time elapsed: 52.977 s - in org.apache.phoenix.end2end.ScanQueryIT
[INFO] Tests run: 1, Failures: 0, Errors: 0, Skipped: 0, Time elapsed: 6.282 s - in org.apache.phoenix.rpc.UpdateCacheWithScnIT
[INFO] Running org.apache.phoenix.end2end.VariableLengthPKIT
[INFO] Running org.apache.phoenix.end2end.salted.SaltedTableIT
[INFO] Tests run: 8, Failures: 0, Errors: 0, Skipped: 0, Time elapsed: 6.832 s - in org.apache.phoenix.end2end.salted.SaltedTableIT
[INFO] Tests run: 50, Failures: 0, Errors: 0, Skipped: 0, Time elapsed: 44.952 s - in org.apache.phoenix.end2end.VariableLengthPKIT
[INFO] Tests run: 46, Failures: 0, Errors: 0, Skipped: 0, Time elapsed: 121.328 s - in org.apache.phoenix.end2end.RowValueConstructorIT
[INFO] Tests run: 25, Failures: 0, Errors: 0, Skipped: 0, Time elapsed: 122.36 s - in org.apache.phoenix.end2end.UpsertValuesIT
[INFO] Tests run: 24, Failures: 0, Errors: 0, Skipped: 0, Time elapsed: 141.376 s - in org.apache.phoenix.end2end.UpsertSelectIT
[INFO] 
[INFO] Results:
[INFO] 
[INFO] Tests run: 1422, Failures: 0, Errors: 0, Skipped: 0
[INFO] 
[INFO] 
[INFO] --- maven-failsafe-plugin:2.20:integration-test (HBaseManagedTimeTests) @ phoenix-core
---
[INFO] 
[INFO] -------------------------------------------------------
[INFO]  T E S T S
[INFO] -------------------------------------------------------
[INFO] 
[INFO] Results:
[INFO] 
[INFO] Tests run: 0, Failures: 0, Errors: 0, Skipped: 0
[INFO] 
[INFO] 
[INFO] --- maven-failsafe-plugin:2.20:integration-test (NeedTheirOwnClusterTests) @ phoenix-core
---
[INFO] 
[INFO] -------------------------------------------------------
[INFO]  T E S T S
[INFO] -------------------------------------------------------
[INFO] Running org.apache.hadoop.hbase.regionserver.wal.WALReplayWithIndexWritesAndCompressedWALIT
[INFO] Running org.apache.phoenix.end2end.ConnectionUtilIT
[INFO] Tests run: 1, Failures: 0, Errors: 0, Skipped: 0, Time elapsed: 30.551 s - in org.apache.hadoop.hbase.regionserver.wal.WALReplayWithIndexWritesAndCompressedWALIT
[INFO] Running org.apache.phoenix.end2end.CountDistinctCompressionIT
[INFO] Running org.apache.phoenix.end2end.ContextClassloaderIT
[INFO] Running org.apache.phoenix.end2end.CsvBulkLoadToolIT
[INFO] Tests run: 1, Failures: 0, Errors: 0, Skipped: 0, Time elapsed: 28.039 s - in org.apache.phoenix.end2end.ConnectionUtilIT
[INFO] Tests run: 1, Failures: 0, Errors: 0, Skipped: 0, Time elapsed: 7.682 s - in org.apache.phoenix.end2end.CountDistinctCompressionIT
[INFO] Tests run: 3, Failures: 0, Errors: 0, Skipped: 0, Time elapsed: 6.026 s - in org.apache.phoenix.end2end.ContextClassloaderIT
[INFO] Running org.apache.phoenix.end2end.FlappingLocalIndexIT
[INFO] Running org.apache.phoenix.end2end.IndexToolForPartialBuildIT
[INFO] Running org.apache.phoenix.end2end.IndexExtendedIT
[INFO] Running org.apache.phoenix.end2end.IndexToolForPartialBuildWithNamespaceEnabledIT
[INFO] Tests run: 2, Failures: 0, Errors: 0, Skipped: 0, Time elapsed: 27.93 s - in org.apache.phoenix.end2end.IndexToolForPartialBuildIT
[INFO] Running org.apache.phoenix.end2end.QueryTimeoutIT
[INFO] Running org.apache.phoenix.end2end.QueryWithLimitIT
[INFO] Tests run: 2, Failures: 0, Errors: 0, Skipped: 0, Time elapsed: 28.253 s - in org.apache.phoenix.end2end.IndexToolForPartialBuildWithNamespaceEnabledIT
[INFO] Running org.apache.phoenix.end2end.RegexBulkLoadToolIT
[INFO] Tests run: 2, Failures: 0, Errors: 0, Skipped: 0, Time elapsed: 7.589 s - in org.apache.phoenix.end2end.QueryWithLimitIT
[INFO] Running org.apache.phoenix.end2end.RenewLeaseIT
[INFO] Tests run: 2, Failures: 0, Errors: 0, Skipped: 0, Time elapsed: 26.614 s - in org.apache.phoenix.end2end.QueryTimeoutIT
[INFO] Tests run: 11, Failures: 0, Errors: 0, Skipped: 0, Time elapsed: 80.232 s - in org.apache.phoenix.end2end.CsvBulkLoadToolIT
[INFO] Tests run: 8, Failures: 0, Errors: 0, Skipped: 0, Time elapsed: 80.454 s - in org.apache.phoenix.end2end.FlappingLocalIndexIT
[INFO] Running org.apache.phoenix.end2end.SpillableGroupByIT
[INFO] Running org.apache.phoenix.end2end.StatsCollectorIT
[INFO] Tests run: 1, Failures: 0, Errors: 0, Skipped: 0, Time elapsed: 28.274 s - in org.apache.phoenix.end2end.RenewLeaseIT
[INFO] Tests run: 2, Failures: 0, Errors: 0, Skipped: 0, Time elapsed: 18.364 s - in org.apache.phoenix.end2end.SpillableGroupByIT
[INFO] Running org.apache.phoenix.end2end.SysTableNamespaceMappedStatsCollectorIT
[INFO] Running org.apache.phoenix.end2end.UpdateCacheAcrossDifferentClientsIT
[INFO] Tests run: 10, Failures: 0, Errors: 0, Skipped: 0, Time elapsed: 77.29 s - in org.apache.phoenix.end2end.RegexBulkLoadToolIT
[INFO] Running org.apache.phoenix.end2end.UserDefinedFunctionsIT
[INFO] Running org.apache.phoenix.end2end.index.ImmutableIndexIT
[INFO] Running org.apache.phoenix.end2end.index.LocalIndexIT
[INFO] Running org.apache.phoenix.end2end.index.MutableIndexFailureIT
[INFO] Tests run: 6, Failures: 0, Errors: 0, Skipped: 0, Time elapsed: 38.272 s - in org.apache.phoenix.end2end.UpdateCacheAcrossDifferentClientsIT
[INFO] Tests run: 14, Failures: 0, Errors: 0, Skipped: 0, Time elapsed: 52.45 s - in org.apache.phoenix.end2end.UserDefinedFunctionsIT
[INFO] Running org.apache.phoenix.end2end.index.MutableIndexReplicationIT
[INFO] Tests run: 1, Failures: 0, Errors: 0, Skipped: 0, Time elapsed: 28.049 s - in org.apache.phoenix.end2end.index.MutableIndexReplicationIT
[INFO] Running org.apache.phoenix.end2end.index.txn.TxWriteFailureIT
[INFO] Tests run: 80, Failures: 0, Errors: 0, Skipped: 0, Time elapsed: 271.536 s - in org.apache.phoenix.end2end.IndexExtendedIT
[INFO] Running org.apache.phoenix.hbase.index.FailForUnsupportedHBaseVersionsIT
[INFO] Running org.apache.phoenix.execute.PartialCommitIT
[INFO] Tests run: 12, Failures: 0, Errors: 0, Skipped: 0, Time elapsed: 10.443 s - in org.apache.phoenix.execute.PartialCommitIT
[INFO] Tests run: 8, Failures: 0, Errors: 0, Skipped: 0, Time elapsed: 59.79 s - in org.apache.phoenix.end2end.index.txn.TxWriteFailureIT
[INFO] Tests run: 2, Failures: 0, Errors: 0, Skipped: 0, Time elapsed: 20.627 s - in org.apache.phoenix.hbase.index.FailForUnsupportedHBaseVersionsIT
[INFO] Running org.apache.phoenix.hbase.index.covered.EndToEndCoveredColumnsIndexBuilderIT
[INFO] Tests run: 2, Failures: 0, Errors: 0, Skipped: 0, Time elapsed: 18.128 s - in org.apache.phoenix.hbase.index.covered.EndToEndCoveredColumnsIndexBuilderIT
[INFO] Running org.apache.phoenix.hbase.index.covered.example.EndToEndCoveredIndexingIT
[INFO] Running org.apache.phoenix.hbase.index.covered.example.EndtoEndIndexingWithCompressionIT
[INFO] Running org.apache.phoenix.hbase.index.covered.example.FailWithoutRetriesIT
[INFO] Tests run: 1, Failures: 0, Errors: 0, Skipped: 0, Time elapsed: 8.216 s - in org.apache.phoenix.hbase.index.covered.example.FailWithoutRetriesIT
[INFO] Running org.apache.phoenix.iterate.RoundRobinResultIteratorWithStatsIT
[INFO] Tests run: 1, Failures: 0, Errors: 0, Skipped: 0, Time elapsed: 18.647 s - in org.apache.phoenix.iterate.RoundRobinResultIteratorWithStatsIT
[INFO] Running org.apache.phoenix.iterate.ScannerLeaseRenewalIT
[INFO] Tests run: 32, Failures: 0, Errors: 0, Skipped: 0, Time elapsed: 310.005 s - in org.apache.phoenix.end2end.index.LocalIndexIT
[INFO] Tests run: 24, Failures: 0, Errors: 0, Skipped: 0, Time elapsed: 325.592 s - in org.apache.phoenix.end2end.index.ImmutableIndexIT
[INFO] Tests run: 11, Failures: 0, Errors: 0, Skipped: 0, Time elapsed: 137.367 s - in org.apache.phoenix.hbase.index.covered.example.EndtoEndIndexingWithCompressionIT
[INFO] Tests run: 11, Failures: 0, Errors: 0, Skipped: 0, Time elapsed: 146.844 s - in org.apache.phoenix.hbase.index.covered.example.EndToEndCoveredIndexingIT
[INFO] Running org.apache.phoenix.monitoring.PhoenixMetricsIT
[INFO] Running org.apache.phoenix.rpc.PhoenixServerRpcIT
[INFO] Running org.apache.phoenix.rpc.PhoenixClientRpcIT
[WARNING] Tests run: 132, Failures: 0, Errors: 0, Skipped: 24, Time elapsed: 411.724 s - in
org.apache.phoenix.end2end.StatsCollectorIT
[INFO] Tests run: 2, Failures: 0, Errors: 0, Skipped: 0, Time elapsed: 11.905 s - in org.apache.phoenix.rpc.PhoenixClientRpcIT
[INFO] Tests run: 2, Failures: 0, Errors: 0, Skipped: 0, Time elapsed: 22.18 s - in org.apache.phoenix.rpc.PhoenixServerRpcIT
[WARNING] Tests run: 132, Failures: 0, Errors: 0, Skipped: 24, Time elapsed: 416.239 s - in
org.apache.phoenix.end2end.SysTableNamespaceMappedStatsCollectorIT
[INFO] Tests run: 21, Failures: 0, Errors: 0, Skipped: 0, Time elapsed: 71.343 s - in org.apache.phoenix.monitoring.PhoenixMetricsIT
[INFO] Tests run: 2, Failures: 0, Errors: 0, Skipped: 0, Time elapsed: 166.707 s - in org.apache.phoenix.iterate.ScannerLeaseRenewalIT
[INFO] 
[INFO] Results:
[INFO] 
[WARNING] Tests run: 542, Failures: 0, Errors: 0, Skipped: 48
[INFO] 
[INFO] 
[INFO] --- maven-failsafe-plugin:2.20:verify (ParallelStatsEnabledTest) @ phoenix-core ---
[INFO] ------------------------------------------------------------------------
[INFO] Reactor Summary:
[INFO] 
[INFO] Apache Phoenix ..................................... SUCCESS [  1.931 s]
[INFO] Phoenix Core ....................................... FAILURE [  01:28 h]
[INFO] Phoenix - Flume .................................... SKIPPED
[INFO] Phoenix - Kafka .................................... SKIPPED
[INFO] Phoenix - Pig ...................................... SKIPPED
[INFO] Phoenix Query Server Client ........................ SKIPPED
[INFO] Phoenix Query Server ............................... SKIPPED
[INFO] Phoenix - Pherf .................................... SKIPPED
[INFO] Phoenix - Spark .................................... SKIPPED
[INFO] Phoenix - Hive ..................................... SKIPPED
[INFO] Phoenix Client ..................................... SKIPPED
[INFO] Phoenix Server ..................................... SKIPPED
[INFO] Phoenix Assembly ................................... SKIPPED
[INFO] Phoenix - Tracing Web Application .................. SKIPPED
[INFO] ------------------------------------------------------------------------
[INFO] BUILD FAILURE
[INFO] ------------------------------------------------------------------------
[INFO] Total time: 01:28 h
[INFO] Finished at: 2017-06-09T23:01:22Z
[INFO] Final Memory: 61M/1443M
[INFO] ------------------------------------------------------------------------
[ERROR] Failed to execute goal org.apache.maven.plugins:maven-failsafe-plugin:2.20:verify
(ParallelStatsEnabledTest) on project phoenix-core: There are test failures.
[ERROR] 
[ERROR] Please refer to <https://builds.apache.org/job/Phoenix-4.x-HBase-1.2/ws/phoenix-core/target/failsafe-reports>
for the individual test results.
[ERROR] Please refer to dump files (if any exist) [date]-jvmRun[N].dump, [date].dumpstream
and [date]-jvmRun[N].dumpstream.
[ERROR] org.apache.maven.surefire.booter.SurefireBooterForkException: ExecutionException The
forked VM terminated without properly saying goodbye. VM crash or System.exit called?
[ERROR] Command was /bin/sh -c cd <https://builds.apache.org/job/Phoenix-4.x-HBase-1.2/ws/phoenix-core>
&& /usr/local/asfpackages/java/jdk1.7.0_80/jre/bin/java -enableassertions -Xmx2000m
-XX:MaxPermSize=256m -Djava.security.egd=file:/dev/./urandom '-Djava.library.path=${hadoop.library.path}:/usr/java/packages/lib/amd64:/usr/lib64:/lib64:/lib:/usr/lib'
-XX:+HeapDumpOnOutOfMemoryError -XX:HeapDumpPath=./target/ -jar <https://builds.apache.org/job/Phoenix-4.x-HBase-1.2/44/artifact/phoenix-core/target/surefire/surefirebooter8001054174400410795.jar>
<https://builds.apache.org/job/Phoenix-4.x-HBase-1.2/ws/phoenix-core/target/surefire>
2017-06-09T21-33-36_146-jvmRun3 surefire7440253758030095730tmp surefire_215699056730992437270tmp
[ERROR] Error occurred in starting fork, check output in log
[ERROR] Process Exit Code: 137
[ERROR] Crashed tests:
[ERROR] org.apache.phoenix.end2end.index.MutableIndexFailureIT
[ERROR] 	at org.apache.maven.plugin.surefire.booterclient.ForkStarter.awaitResultsDone(ForkStarter.java:494)
[ERROR] 	at org.apache.maven.plugin.surefire.booterclient.ForkStarter.runSuitesForkPerTestSet(ForkStarter.java:441)
[ERROR] 	at org.apache.maven.plugin.surefire.booterclient.ForkStarter.run(ForkStarter.java:292)
[ERROR] 	at org.apache.maven.plugin.surefire.booterclient.ForkStarter.run(ForkStarter.java:243)
[ERROR] 	at org.apache.maven.plugin.surefire.AbstractSurefireMojo.executeProvider(AbstractSurefireMojo.java:1077)
[ERROR] 	at org.apache.maven.plugin.surefire.AbstractSurefireMojo.executeAfterPreconditionsChecked(AbstractSurefireMojo.java:907)
[ERROR] 	at org.apache.maven.plugin.surefire.AbstractSurefireMojo.execute(AbstractSurefireMojo.java:785)
[ERROR] 	at org.apache.maven.plugin.DefaultBuildPluginManager.executeMojo(DefaultBuildPluginManager.java:134)
[ERROR] 	at org.apache.maven.lifecycle.internal.MojoExecutor.execute(MojoExecutor.java:208)
[ERROR] 	at org.apache.maven.lifecycle.internal.MojoExecutor.execute(MojoExecutor.java:154)
[ERROR] 	at org.apache.maven.lifecycle.internal.MojoExecutor.execute(MojoExecutor.java:146)
[ERROR] 	at org.apache.maven.lifecycle.internal.LifecycleModuleBuilder.buildProject(LifecycleModuleBuilder.java:117)
[ERROR] 	at org.apache.maven.lifecycle.internal.LifecycleModuleBuilder.buildProject(LifecycleModuleBuilder.java:81)
[ERROR] 	at org.apache.maven.lifecycle.internal.builder.singlethreaded.SingleThreadedBuilder.build(SingleThreadedBuilder.java:51)
[ERROR] 	at org.apache.maven.lifecycle.internal.LifecycleStarter.execute(LifecycleStarter.java:128)
[ERROR] 	at org.apache.maven.DefaultMaven.doExecute(DefaultMaven.java:309)
[ERROR] 	at org.apache.maven.DefaultMaven.doExecute(DefaultMaven.java:194)
[ERROR] 	at org.apache.maven.DefaultMaven.execute(DefaultMaven.java:107)
[ERROR] 	at org.apache.maven.cli.MavenCli.execute(MavenCli.java:993)
[ERROR] 	at org.apache.maven.cli.MavenCli.doMain(MavenCli.java:345)
[ERROR] 	at org.apache.maven.cli.MavenCli.main(MavenCli.java:191)
[ERROR] 	at sun.reflect.NativeMethodAccessorImpl.invoke0(Native Method)
[ERROR] 	at sun.reflect.NativeMethodAccessorImpl.invoke(NativeMethodAccessorImpl.java:57)
[ERROR] 	at sun.reflect.DelegatingMethodAccessorImpl.invoke(DelegatingMethodAccessorImpl.java:43)
[ERROR] 	at java.lang.reflect.Method.invoke(Method.java:606)
[ERROR] 	at org.codehaus.plexus.classworlds.launcher.Launcher.launchEnhanced(Launcher.java:289)
[ERROR] 	at org.codehaus.plexus.classworlds.launcher.Launcher.launch(Launcher.java:229)
[ERROR] 	at org.codehaus.plexus.classworlds.launcher.Launcher.mainWithExitCode(Launcher.java:415)
[ERROR] 	at org.codehaus.plexus.classworlds.launcher.Launcher.main(Launcher.java:356)
[ERROR] Caused by: org.apache.maven.surefire.booter.SurefireBooterForkException: The forked
VM terminated without properly saying goodbye. VM crash or System.exit called?
[ERROR] Command was /bin/sh -c cd <https://builds.apache.org/job/Phoenix-4.x-HBase-1.2/ws/phoenix-core>
&& /usr/local/asfpackages/java/jdk1.7.0_80/jre/bin/java -enableassertions -Xmx2000m
-XX:MaxPermSize=256m -Djava.security.egd=file:/dev/./urandom '-Djava.library.path=${hadoop.library.path}:/usr/java/packages/lib/amd64:/usr/lib64:/lib64:/lib:/usr/lib'
-XX:+HeapDumpOnOutOfMemoryError -XX:HeapDumpPath=./target/ -jar <https://builds.apache.org/job/Phoenix-4.x-HBase-1.2/44/artifact/phoenix-core/target/surefire/surefirebooter8001054174400410795.jar>
<https://builds.apache.org/job/Phoenix-4.x-HBase-1.2/ws/phoenix-core/target/surefire>
2017-06-09T21-33-36_146-jvmRun3 surefire7440253758030095730tmp surefire_215699056730992437270tmp
[ERROR] Error occurred in starting fork, check output in log
[ERROR] Process Exit Code: 137
[ERROR] Crashed tests:
[ERROR] org.apache.phoenix.end2end.index.MutableIndexFailureIT
[ERROR] 	at org.apache.maven.plugin.surefire.booterclient.ForkStarter.fork(ForkStarter.java:679)
[ERROR] 	at org.apache.maven.plugin.surefire.booterclient.ForkStarter.fork(ForkStarter.java:533)
[ERROR] 	at org.apache.maven.plugin.surefire.booterclient.ForkStarter.access$600(ForkStarter.java:117)
[ERROR] 	at org.apache.maven.plugin.surefire.booterclient.ForkStarter$2.call(ForkStarter.java:429)
[ERROR] 	at org.apache.maven.plugin.surefire.booterclient.ForkStarter$2.call(ForkStarter.java:406)
[ERROR] 	at java.util.concurrent.FutureTask.run(FutureTask.java:262)
[ERROR] 	at java.util.concurrent.ThreadPoolExecutor.runWorker(ThreadPoolExecutor.java:1145)
[ERROR] 	at java.util.concurrent.ThreadPoolExecutor$Worker.run(ThreadPoolExecutor.java:615)
[ERROR] 	at java.lang.Thread.run(Thread.java:745)
[ERROR] 
[ERROR] -> [Help 1]
[ERROR] 
[ERROR] To see the full stack trace of the errors, re-run Maven with the -e switch.
[ERROR] Re-run Maven using the -X switch to enable full debug logging.
[ERROR] 
[ERROR] For more information about the errors and possible solutions, please read the following
articles:
[ERROR] [Help 1] http://cwiki.apache.org/confluence/display/MAVEN/MojoExecutionException
[ERROR] 
[ERROR] After correcting the problems, you can resume the build with the command
[ERROR]   mvn <goals> -rf :phoenix-core
Build step 'Invoke top-level Maven targets' marked build as failure
Archiving artifacts
Compressed 822.37 MB of artifacts by 57.7% relative to #10
Recording test results
Not sending mail to unregistered user ankitsinghal59@gmail.com

Mime
View raw message