phoenix-commits mailing list archives

Site index · List index
Message view « Date » · « Thread »
Top « Date » · « Thread »
From Apache Jenkins Server <jenk...@builds.apache.org>
Subject Build failed in Jenkins: Phoenix-4.x-HBase-1.2 #32
Date Mon, 05 Jun 2017 20:06:47 GMT
See <https://builds.apache.org/job/Phoenix-4.x-HBase-1.2/32/display/redirect?page=changes>

Changes:

[samarth] PHOENIX-3896 Fix test failures related to tracing changes (Karan Mehta)

[samarth] PHOENIX-3896 Addendum - add missing file (Karan Mehta)

------------------------------------------
[...truncated 92.45 KB...]
-------------------------------------------------------
Running org.apache.phoenix.end2end.ArrayIT
Running org.apache.phoenix.end2end.CreateSchemaIT
Tests run: 1, Failures: 0, Errors: 0, Skipped: 0, Time elapsed: 1.024 sec - in org.apache.phoenix.end2end.CreateSchemaIT
Running org.apache.phoenix.end2end.CastAndCoerceIT
Running org.apache.phoenix.end2end.CustomEntityDataIT
Running org.apache.phoenix.end2end.AggregateQueryIT
Running org.apache.phoenix.end2end.CaseStatementIT
Running org.apache.phoenix.end2end.ColumnProjectionOptimizationIT
Running org.apache.phoenix.end2end.CreateTableIT
Running org.apache.phoenix.end2end.ClientTimeArithmeticQueryIT
Tests run: 3, Failures: 0, Errors: 0, Skipped: 0, Time elapsed: 13.958 sec - in org.apache.phoenix.end2end.CustomEntityDataIT
Running org.apache.phoenix.end2end.DerivedTableIT
Tests run: 3, Failures: 0, Errors: 0, Skipped: 0, Time elapsed: 35.456 sec - in org.apache.phoenix.end2end.ColumnProjectionOptimizationIT
Running org.apache.phoenix.end2end.DistinctCountIT
Tests run: 18, Failures: 0, Errors: 0, Skipped: 0, Time elapsed: 36.515 sec - in org.apache.phoenix.end2end.DerivedTableIT
Running org.apache.phoenix.end2end.DropSchemaIT
Tests run: 2, Failures: 0, Errors: 0, Skipped: 0, Time elapsed: 12.007 sec - in org.apache.phoenix.end2end.DropSchemaIT
Running org.apache.phoenix.end2end.ExtendedQueryExecIT
Tests run: 10, Failures: 0, Errors: 0, Skipped: 0, Time elapsed: 28.492 sec - in org.apache.phoenix.end2end.DistinctCountIT
Running org.apache.phoenix.end2end.FunkyNamesIT
Tests run: 3, Failures: 0, Errors: 0, Skipped: 0, Time elapsed: 9.101 sec - in org.apache.phoenix.end2end.FunkyNamesIT
Tests run: 4, Failures: 0, Errors: 0, Skipped: 0, Time elapsed: 13.988 sec - in org.apache.phoenix.end2end.ExtendedQueryExecIT
Running org.apache.phoenix.end2end.GroupByIT
Running org.apache.phoenix.end2end.MutableQueryIT
Tests run: 49, Failures: 0, Errors: 0, Skipped: 0, Time elapsed: 122.687 sec - in org.apache.phoenix.end2end.CastAndCoerceIT
Tests run: 56, Failures: 0, Errors: 0, Skipped: 0, Time elapsed: 125.537 sec - in org.apache.phoenix.end2end.CaseStatementIT
Running org.apache.phoenix.end2end.NativeHBaseTypesIT
Running org.apache.phoenix.end2end.NotQueryIT
Tests run: 7, Failures: 0, Errors: 0, Skipped: 0, Time elapsed: 6.198 sec - in org.apache.phoenix.end2end.NativeHBaseTypesIT
Tests run: 42, Failures: 0, Errors: 0, Skipped: 0, Time elapsed: 139.036 sec - in org.apache.phoenix.end2end.AggregateQueryIT
Tests run: 80, Failures: 0, Errors: 0, Skipped: 0, Time elapsed: 142.633 sec - in org.apache.phoenix.end2end.ArrayIT
Running org.apache.phoenix.end2end.ProductMetricsIT
Running org.apache.phoenix.end2end.QueryDatabaseMetaDataIT
Running org.apache.phoenix.end2end.PointInTimeQueryIT
Tests run: 61, Failures: 0, Errors: 0, Skipped: 0, Time elapsed: 48.625 sec - in org.apache.phoenix.end2end.ProductMetricsIT
Tests run: 7, Failures: 0, Errors: 0, Skipped: 0, Time elapsed: 48.345 sec - in org.apache.phoenix.end2end.PointInTimeQueryIT
Running org.apache.phoenix.end2end.QueryIT
Tests run: 19, Failures: 0, Errors: 0, Skipped: 0, Time elapsed: 197.986 sec - in org.apache.phoenix.end2end.CreateTableIT
Running org.apache.phoenix.end2end.RowValueConstructorIT
Tests run: 77, Failures: 0, Errors: 0, Skipped: 0, Time elapsed: 83.82 sec - in org.apache.phoenix.end2end.NotQueryIT
Running org.apache.phoenix.end2end.ReadIsolationLevelIT
Tests run: 2, Failures: 0, Errors: 0, Skipped: 0, Time elapsed: 6.377 sec - in org.apache.phoenix.end2end.ReadIsolationLevelIT
Running org.apache.phoenix.end2end.SequenceBulkAllocationIT
Tests run: 91, Failures: 0, Errors: 0, Skipped: 0, Time elapsed: 138.417 sec - in org.apache.phoenix.end2end.GroupByIT
Tests run: 245, Failures: 0, Errors: 0, Skipped: 0, Time elapsed: 236.064 sec - in org.apache.phoenix.end2end.ClientTimeArithmeticQueryIT
Running org.apache.phoenix.end2end.ScanQueryIT
Running org.apache.phoenix.end2end.SequenceIT
Running org.apache.phoenix.end2end.ToNumberFunctionIT
Tests run: 19, Failures: 0, Errors: 0, Skipped: 0, Time elapsed: 136.195 sec - in org.apache.phoenix.end2end.QueryDatabaseMetaDataIT
Running org.apache.phoenix.end2end.TopNIT
Tests run: 56, Failures: 0, Errors: 0, Skipped: 0, Time elapsed: 58.811 sec - in org.apache.phoenix.end2end.SequenceBulkAllocationIT
Running org.apache.phoenix.end2end.TruncateFunctionIT
Tests run: 18, Failures: 0, Errors: 0, Skipped: 0, Time elapsed: 11.31 sec - in org.apache.phoenix.end2end.ToNumberFunctionIT
Running org.apache.phoenix.end2end.UpsertSelectIT
Tests run: 4, Failures: 0, Errors: 0, Skipped: 0, Time elapsed: 8.548 sec - in org.apache.phoenix.end2end.TopNIT
Tests run: 112, Failures: 0, Errors: 0, Skipped: 0, Time elapsed: 93.535 sec - in org.apache.phoenix.end2end.QueryIT
Tests run: 1, Failures: 0, Errors: 0, Skipped: 0, Time elapsed: 6.307 sec - in org.apache.phoenix.end2end.TruncateFunctionIT
Running org.apache.phoenix.end2end.UpsertValuesIT
Running org.apache.phoenix.end2end.VariableLengthPKIT
Tests run: 54, Failures: 0, Errors: 0, Skipped: 0, Time elapsed: 53.34 sec - in org.apache.phoenix.end2end.SequenceIT
Running org.apache.phoenix.rpc.UpdateCacheWithScnIT
Tests run: 112, Failures: 0, Errors: 0, Skipped: 0, Time elapsed: 235.06 sec - in org.apache.phoenix.end2end.MutableQueryIT
Running org.apache.phoenix.end2end.salted.SaltedTableIT
Tests run: 1, Failures: 0, Errors: 0, Skipped: 0, Time elapsed: 6.837 sec - in org.apache.phoenix.rpc.UpdateCacheWithScnIT
Tests run: 112, Failures: 0, Errors: 0, Skipped: 0, Time elapsed: 78.662 sec - in org.apache.phoenix.end2end.ScanQueryIT
Tests run: 46, Failures: 0, Errors: 0, Skipped: 0, Time elapsed: 128.581 sec - in org.apache.phoenix.end2end.RowValueConstructorIT
Tests run: 8, Failures: 0, Errors: 0, Skipped: 0, Time elapsed: 8.104 sec - in org.apache.phoenix.end2end.salted.SaltedTableIT
Tests run: 50, Failures: 0, Errors: 0, Skipped: 0, Time elapsed: 46.586 sec - in org.apache.phoenix.end2end.VariableLengthPKIT
Tests run: 25, Failures: 0, Errors: 0, Skipped: 0, Time elapsed: 115.902 sec - in org.apache.phoenix.end2end.UpsertValuesIT
Tests run: 24, Failures: 0, Errors: 0, Skipped: 0, Time elapsed: 136.784 sec - in org.apache.phoenix.end2end.UpsertSelectIT

Results :

Tests run: 1422, Failures: 0, Errors: 0, Skipped: 0

[INFO] 
[INFO] --- maven-failsafe-plugin:2.19.1:integration-test (HBaseManagedTimeTests) @ phoenix-core
---

-------------------------------------------------------
 T E S T S
-------------------------------------------------------

Results :

Tests run: 0, Failures: 0, Errors: 0, Skipped: 0

[INFO] 
[INFO] --- maven-failsafe-plugin:2.19.1:integration-test (NeedTheirOwnClusterTests) @ phoenix-core
---

-------------------------------------------------------
 T E S T S
-------------------------------------------------------
Running org.apache.hadoop.hbase.regionserver.wal.WALReplayWithIndexWritesAndCompressedWALIT
Running org.apache.phoenix.end2end.ConnectionUtilIT
Tests run: 1, Failures: 0, Errors: 0, Skipped: 0, Time elapsed: 57.338 sec - in org.apache.hadoop.hbase.regionserver.wal.WALReplayWithIndexWritesAndCompressedWALIT
Running org.apache.phoenix.end2end.CountDistinctCompressionIT
Running org.apache.phoenix.end2end.CsvBulkLoadToolIT
Running org.apache.phoenix.end2end.ContextClassloaderIT
Tests run: 1, Failures: 0, Errors: 0, Skipped: 0, Time elapsed: 34.531 sec - in org.apache.phoenix.end2end.ConnectionUtilIT
Tests run: 1, Failures: 0, Errors: 0, Skipped: 0, Time elapsed: 12.248 sec - in org.apache.phoenix.end2end.CountDistinctCompressionIT
Running org.apache.phoenix.end2end.FlappingLocalIndexIT
Tests run: 3, Failures: 0, Errors: 0, Skipped: 0, Time elapsed: 12.961 sec - in org.apache.phoenix.end2end.ContextClassloaderIT
Running org.apache.phoenix.end2end.IndexToolForPartialBuildIT
Running org.apache.phoenix.end2end.IndexExtendedIT
Running org.apache.phoenix.end2end.IndexToolForPartialBuildWithNamespaceEnabledIT
Running org.apache.phoenix.end2end.QueryTimeoutIT
Tests run: 2, Failures: 0, Errors: 0, Skipped: 0, Time elapsed: 50.602 sec - in org.apache.phoenix.end2end.IndexToolForPartialBuildIT
Running org.apache.phoenix.end2end.QueryWithLimitIT
Running org.apache.phoenix.end2end.RegexBulkLoadToolIT
Tests run: 2, Failures: 0, Errors: 0, Skipped: 0, Time elapsed: 10.749 sec - in org.apache.phoenix.end2end.QueryWithLimitIT
Tests run: 2, Failures: 0, Errors: 0, Skipped: 0, Time elapsed: 50.492 sec - in org.apache.phoenix.end2end.IndexToolForPartialBuildWithNamespaceEnabledIT
Tests run: 8, Failures: 0, Errors: 0, Skipped: 0, Time elapsed: 86.286 sec - in org.apache.phoenix.end2end.FlappingLocalIndexIT
Tests run: 11, Failures: 0, Errors: 0, Skipped: 0, Time elapsed: 122.305 sec - in org.apache.phoenix.end2end.CsvBulkLoadToolIT
Tests run: 2, Failures: 0, Errors: 0, Skipped: 0, Time elapsed: 46.216 sec - in org.apache.phoenix.end2end.QueryTimeoutIT
Running org.apache.phoenix.end2end.RenewLeaseIT
Running org.apache.phoenix.end2end.SpillableGroupByIT
Running org.apache.phoenix.end2end.StatsCollectorIT
Running org.apache.phoenix.end2end.SysTableNamespaceMappedStatsCollectorIT
Tests run: 1, Failures: 0, Errors: 0, Skipped: 0, Time elapsed: 29.081 sec - in org.apache.phoenix.end2end.RenewLeaseIT
Tests run: 2, Failures: 0, Errors: 0, Skipped: 0, Time elapsed: 15.75 sec - in org.apache.phoenix.end2end.SpillableGroupByIT
Running org.apache.phoenix.end2end.UpdateCacheAcrossDifferentClientsIT
Tests run: 10, Failures: 0, Errors: 0, Skipped: 0, Time elapsed: 109.789 sec - in org.apache.phoenix.end2end.RegexBulkLoadToolIT
Running org.apache.phoenix.end2end.UserDefinedFunctionsIT
Tests run: 6, Failures: 0, Errors: 0, Skipped: 0, Time elapsed: 31.871 sec - in org.apache.phoenix.end2end.UpdateCacheAcrossDifferentClientsIT
Running org.apache.phoenix.end2end.index.ImmutableIndexIT
Running org.apache.phoenix.end2end.index.LocalIndexIT
Running org.apache.phoenix.end2end.index.MutableIndexFailureIT
Tests run: 14, Failures: 0, Errors: 0, Skipped: 0, Time elapsed: 51.09 sec - in org.apache.phoenix.end2end.UserDefinedFunctionsIT
Running org.apache.phoenix.end2end.index.MutableIndexReplicationIT
Tests run: 1, Failures: 0, Errors: 0, Skipped: 0, Time elapsed: 32.824 sec - in org.apache.phoenix.end2end.index.MutableIndexReplicationIT
Running org.apache.phoenix.end2end.index.txn.TxWriteFailureIT
Tests run: 80, Failures: 0, Errors: 0, Skipped: 0, Time elapsed: 328.664 sec - in org.apache.phoenix.end2end.IndexExtendedIT
Running org.apache.phoenix.hbase.index.FailForUnsupportedHBaseVersionsIT
Running org.apache.phoenix.execute.PartialCommitIT
Tests run: 8, Failures: 0, Errors: 0, Skipped: 0, Time elapsed: 57.819 sec - in org.apache.phoenix.end2end.index.txn.TxWriteFailureIT
Tests run: 12, Failures: 0, Errors: 0, Skipped: 0, Time elapsed: 10.678 sec - in org.apache.phoenix.execute.PartialCommitIT
Tests run: 2, Failures: 0, Errors: 0, Skipped: 0, Time elapsed: 30.407 sec - in org.apache.phoenix.hbase.index.FailForUnsupportedHBaseVersionsIT
Running org.apache.phoenix.hbase.index.covered.EndToEndCoveredColumnsIndexBuilderIT
Running org.apache.phoenix.hbase.index.covered.example.EndToEndCoveredIndexingIT
Tests run: 2, Failures: 0, Errors: 0, Skipped: 0, Time elapsed: 17.807 sec - in org.apache.phoenix.hbase.index.covered.EndToEndCoveredColumnsIndexBuilderIT
Running org.apache.phoenix.hbase.index.covered.example.EndtoEndIndexingWithCompressionIT
Tests run: 120, Failures: 0, Errors: 0, Skipped: 24, Time elapsed: 284.657 sec - in org.apache.phoenix.end2end.StatsCollectorIT
Tests run: 120, Failures: 0, Errors: 0, Skipped: 24, Time elapsed: 284.663 sec - in org.apache.phoenix.end2end.SysTableNamespaceMappedStatsCollectorIT
Running org.apache.phoenix.hbase.index.covered.example.FailWithoutRetriesIT
Tests run: 1, Failures: 0, Errors: 0, Skipped: 0, Time elapsed: 5.876 sec - in org.apache.phoenix.hbase.index.covered.example.FailWithoutRetriesIT
Running org.apache.phoenix.iterate.RoundRobinResultIteratorWithStatsIT
Running org.apache.phoenix.iterate.ScannerLeaseRenewalIT
Running org.apache.phoenix.monitoring.PhoenixMetricsIT
Tests run: 1, Failures: 0, Errors: 0, Skipped: 0, Time elapsed: 26.065 sec - in org.apache.phoenix.iterate.RoundRobinResultIteratorWithStatsIT
Tests run: 32, Failures: 0, Errors: 0, Skipped: 0, Time elapsed: 298.908 sec - in org.apache.phoenix.end2end.index.LocalIndexIT
Tests run: 11, Failures: 0, Errors: 0, Skipped: 0, Time elapsed: 137.604 sec - in org.apache.phoenix.hbase.index.covered.example.EndToEndCoveredIndexingIT
Tests run: 11, Failures: 0, Errors: 0, Skipped: 0, Time elapsed: 134.586 sec - in org.apache.phoenix.hbase.index.covered.example.EndtoEndIndexingWithCompressionIT
Running org.apache.phoenix.rpc.PhoenixClientRpcIT
Tests run: 21, Failures: 0, Errors: 0, Skipped: 0, Time elapsed: 74.742 sec - in org.apache.phoenix.monitoring.PhoenixMetricsIT
Running org.apache.phoenix.rpc.PhoenixServerRpcIT
Tests run: 2, Failures: 0, Errors: 0, Skipped: 0, Time elapsed: 14.533 sec - in org.apache.phoenix.rpc.PhoenixClientRpcIT
Tests run: 24, Failures: 0, Errors: 0, Skipped: 0, Time elapsed: 365.925 sec - in org.apache.phoenix.end2end.index.ImmutableIndexIT
Tests run: 2, Failures: 0, Errors: 0, Skipped: 0, Time elapsed: 16.432 sec - in org.apache.phoenix.rpc.PhoenixServerRpcIT
Tests run: 2, Failures: 0, Errors: 0, Skipped: 0, Time elapsed: 166.253 sec - in org.apache.phoenix.iterate.ScannerLeaseRenewalIT
Tests run: 11, Failures: 6, Errors: 0, Skipped: 0, Time elapsed: 491.631 sec <<<
FAILURE! - in org.apache.phoenix.end2end.index.MutableIndexFailureIT
testWriteFailureDisablesIndex[MutableIndexFailureIT_transactional=false,localIndex=false,isNamespaceMapped=true,disableIndexOnWriteFailure=true,rebuildIndexOnWriteFailure=true](org.apache.phoenix.end2end.index.MutableIndexFailureIT)
 Time elapsed: 74.01 sec  <<< FAILURE!
java.lang.AssertionError
	at org.apache.phoenix.end2end.index.MutableIndexFailureIT.waitForIndexToBeRebuilt(MutableIndexFailureIT.java:316)
	at org.apache.phoenix.end2end.index.MutableIndexFailureIT.helpTestWriteFailureDisablesIndex(MutableIndexFailureIT.java:278)
	at org.apache.phoenix.end2end.index.MutableIndexFailureIT.testWriteFailureDisablesIndex(MutableIndexFailureIT.java:162)

testWriteFailureDisablesIndex[MutableIndexFailureIT_transactional=false,localIndex=false,isNamespaceMapped=false,disableIndexOnWriteFailure=true,rebuildIndexOnWriteFailure=true](org.apache.phoenix.end2end.index.MutableIndexFailureIT)
 Time elapsed: 69.888 sec  <<< FAILURE!
java.lang.AssertionError
	at org.apache.phoenix.end2end.index.MutableIndexFailureIT.waitForIndexToBeRebuilt(MutableIndexFailureIT.java:316)
	at org.apache.phoenix.end2end.index.MutableIndexFailureIT.helpTestWriteFailureDisablesIndex(MutableIndexFailureIT.java:278)
	at org.apache.phoenix.end2end.index.MutableIndexFailureIT.testWriteFailureDisablesIndex(MutableIndexFailureIT.java:162)

testWriteFailureDisablesIndex[MutableIndexFailureIT_transactional=false,localIndex=true,isNamespaceMapped=true,disableIndexOnWriteFailure=true,rebuildIndexOnWriteFailure=true](org.apache.phoenix.end2end.index.MutableIndexFailureIT)
 Time elapsed: 71.027 sec  <<< FAILURE!
java.lang.AssertionError
	at org.apache.phoenix.end2end.index.MutableIndexFailureIT.waitForIndexToBeRebuilt(MutableIndexFailureIT.java:316)
	at org.apache.phoenix.end2end.index.MutableIndexFailureIT.helpTestWriteFailureDisablesIndex(MutableIndexFailureIT.java:278)
	at org.apache.phoenix.end2end.index.MutableIndexFailureIT.testWriteFailureDisablesIndex(MutableIndexFailureIT.java:162)

testWriteFailureDisablesIndex[MutableIndexFailureIT_transactional=false,localIndex=true,isNamespaceMapped=false,disableIndexOnWriteFailure=null,rebuildIndexOnWriteFailure=null](org.apache.phoenix.end2end.index.MutableIndexFailureIT)
 Time elapsed: 69.915 sec  <<< FAILURE!
java.lang.AssertionError
	at org.apache.phoenix.end2end.index.MutableIndexFailureIT.waitForIndexToBeRebuilt(MutableIndexFailureIT.java:316)
	at org.apache.phoenix.end2end.index.MutableIndexFailureIT.helpTestWriteFailureDisablesIndex(MutableIndexFailureIT.java:278)
	at org.apache.phoenix.end2end.index.MutableIndexFailureIT.testWriteFailureDisablesIndex(MutableIndexFailureIT.java:162)

testWriteFailureDisablesIndex[MutableIndexFailureIT_transactional=false,localIndex=false,isNamespaceMapped=false,disableIndexOnWriteFailure=false,rebuildIndexOnWriteFailure=true](org.apache.phoenix.end2end.index.MutableIndexFailureIT)
 Time elapsed: 71.683 sec  <<< FAILURE!
java.lang.AssertionError
	at org.apache.phoenix.end2end.index.MutableIndexFailureIT.waitForIndexToBeRebuilt(MutableIndexFailureIT.java:316)
	at org.apache.phoenix.end2end.index.MutableIndexFailureIT.helpTestWriteFailureDisablesIndex(MutableIndexFailureIT.java:278)
	at org.apache.phoenix.end2end.index.MutableIndexFailureIT.testWriteFailureDisablesIndex(MutableIndexFailureIT.java:162)

testWriteFailureDisablesIndex[MutableIndexFailureIT_transactional=false,localIndex=true,isNamespaceMapped=false,disableIndexOnWriteFailure=false,rebuildIndexOnWriteFailure=null](org.apache.phoenix.end2end.index.MutableIndexFailureIT)
 Time elapsed: 70.452 sec  <<< FAILURE!
java.lang.AssertionError
	at org.apache.phoenix.end2end.index.MutableIndexFailureIT.waitForIndexToBeRebuilt(MutableIndexFailureIT.java:316)
	at org.apache.phoenix.end2end.index.MutableIndexFailureIT.helpTestWriteFailureDisablesIndex(MutableIndexFailureIT.java:278)
	at org.apache.phoenix.end2end.index.MutableIndexFailureIT.testWriteFailureDisablesIndex(MutableIndexFailureIT.java:162)


Results :

Failed tests: 
  MutableIndexFailureIT.testWriteFailureDisablesIndex:162->helpTestWriteFailureDisablesIndex:278->waitForIndexToBeRebuilt:316
  MutableIndexFailureIT.testWriteFailureDisablesIndex:162->helpTestWriteFailureDisablesIndex:278->waitForIndexToBeRebuilt:316
  MutableIndexFailureIT.testWriteFailureDisablesIndex:162->helpTestWriteFailureDisablesIndex:278->waitForIndexToBeRebuilt:316
  MutableIndexFailureIT.testWriteFailureDisablesIndex:162->helpTestWriteFailureDisablesIndex:278->waitForIndexToBeRebuilt:316
  MutableIndexFailureIT.testWriteFailureDisablesIndex:162->helpTestWriteFailureDisablesIndex:278->waitForIndexToBeRebuilt:316
  MutableIndexFailureIT.testWriteFailureDisablesIndex:162->helpTestWriteFailureDisablesIndex:278->waitForIndexToBeRebuilt:316

Tests run: 529, Failures: 6, Errors: 0, Skipped: 48

[INFO] 
[INFO] --- maven-failsafe-plugin:2.19.1:verify (ParallelStatsEnabledTest) @ phoenix-core ---
[INFO] ------------------------------------------------------------------------
[INFO] Reactor Summary:
[INFO] 
[INFO] Apache Phoenix ..................................... SUCCESS [  5.673 s]
[INFO] Phoenix Core ....................................... FAILURE [52:25 min]
[INFO] Phoenix - Flume .................................... SKIPPED
[INFO] Phoenix - Kafka .................................... SKIPPED
[INFO] Phoenix - Pig ...................................... SKIPPED
[INFO] Phoenix Query Server Client ........................ SKIPPED
[INFO] Phoenix Query Server ............................... SKIPPED
[INFO] Phoenix - Pherf .................................... SKIPPED
[INFO] Phoenix - Spark .................................... SKIPPED
[INFO] Phoenix - Hive ..................................... SKIPPED
[INFO] Phoenix Client ..................................... SKIPPED
[INFO] Phoenix Server ..................................... SKIPPED
[INFO] Phoenix Assembly ................................... SKIPPED
[INFO] Phoenix - Tracing Web Application .................. SKIPPED
[INFO] ------------------------------------------------------------------------
[INFO] BUILD FAILURE
[INFO] ------------------------------------------------------------------------
[INFO] Total time: 52:33 min
[INFO] Finished at: 2017-06-05T20:02:41Z
[INFO] Final Memory: 60M/889M
[INFO] ------------------------------------------------------------------------
[ERROR] Failed to execute goal org.apache.maven.plugins:maven-failsafe-plugin:2.19.1:verify
(ParallelStatsEnabledTest) on project phoenix-core: There was a timeout or other error in
the fork -> [Help 1]
[ERROR] 
[ERROR] To see the full stack trace of the errors, re-run Maven with the -e switch.
[ERROR] Re-run Maven using the -X switch to enable full debug logging.
[ERROR] 
[ERROR] For more information about the errors and possible solutions, please read the following
articles:
[ERROR] [Help 1] http://cwiki.apache.org/confluence/display/MAVEN/MojoExecutionException
[ERROR] 
[ERROR] After correcting the problems, you can resume the build with the command
[ERROR]   mvn <goals> -rf :phoenix-core
Build step 'Invoke top-level Maven targets' marked build as failure
Archiving artifacts
Recording test results

Mime
View raw message