phoenix-commits mailing list archives

Site index · List index
Message view « Date » · « Thread »
Top « Date » · « Thread »
From Apache Jenkins Server <jenk...@builds.apache.org>
Subject Build failed in Jenkins: Phoenix-4.x-HBase-1.2 #24
Date Wed, 31 May 2017 21:15:46 GMT
See <https://builds.apache.org/job/Phoenix-4.x-HBase-1.2/24/display/redirect?page=changes>

Changes:

[samarth] PHOENIX-3901 SpillableGroupByIT.testStatisticsAreNotWritten is failing

------------------------------------------
[...truncated 73.35 KB...]
Running org.apache.phoenix.end2end.index.SaltedIndexIT
Tests run: 3, Failures: 0, Errors: 0, Skipped: 0, Time elapsed: 14.176 sec - in org.apache.phoenix.end2end.index.SaltedIndexIT
Running org.apache.phoenix.end2end.index.ViewIndexIT
Tests run: 16, Failures: 0, Errors: 0, Skipped: 0, Time elapsed: 321.437 sec - in org.apache.phoenix.end2end.index.DropColumnIT
Running org.apache.phoenix.end2end.index.txn.RollbackIT
Running org.apache.phoenix.end2end.index.txn.MutableRollbackIT
Tests run: 8, Failures: 0, Errors: 0, Skipped: 0, Time elapsed: 49.67 sec - in org.apache.phoenix.end2end.index.ViewIndexIT
Running org.apache.phoenix.end2end.salted.SaltedTableUpsertSelectIT
Tests run: 8, Failures: 0, Errors: 0, Skipped: 0, Time elapsed: 55.711 sec - in org.apache.phoenix.end2end.index.txn.RollbackIT
Running org.apache.phoenix.end2end.salted.SaltedTableVarLengthRowKeyIT
Tests run: 1, Failures: 0, Errors: 0, Skipped: 0, Time elapsed: 2.282 sec - in org.apache.phoenix.end2end.salted.SaltedTableVarLengthRowKeyIT
Running org.apache.phoenix.iterate.PhoenixQueryTimeoutIT
Tests run: 6, Failures: 0, Errors: 0, Skipped: 0, Time elapsed: 28.306 sec - in org.apache.phoenix.end2end.salted.SaltedTableUpsertSelectIT
Running org.apache.phoenix.iterate.RoundRobinResultIteratorIT
Tests run: 2, Failures: 0, Errors: 0, Skipped: 0, Time elapsed: 4.875 sec - in org.apache.phoenix.iterate.PhoenixQueryTimeoutIT
Running org.apache.phoenix.replication.SystemCatalogWALEntryFilterIT
Tests run: 2, Failures: 0, Errors: 0, Skipped: 0, Time elapsed: 0.079 sec - in org.apache.phoenix.replication.SystemCatalogWALEntryFilterIT
Running org.apache.phoenix.rpc.UpdateCacheIT
Tests run: 6, Failures: 0, Errors: 0, Skipped: 0, Time elapsed: 71.396 sec - in org.apache.phoenix.end2end.index.txn.MutableRollbackIT
Running org.apache.phoenix.trace.PhoenixTableMetricsWriterIT
Tests run: 7, Failures: 0, Errors: 0, Skipped: 0, Time elapsed: 26.749 sec - in org.apache.phoenix.rpc.UpdateCacheIT
Running org.apache.phoenix.trace.PhoenixTracingEndToEndIT
Tests run: 2, Failures: 0, Errors: 0, Skipped: 0, Time elapsed: 14.714 sec - in org.apache.phoenix.trace.PhoenixTableMetricsWriterIT
Running org.apache.phoenix.tx.FlappingTransactionIT
Tests run: 4, Failures: 0, Errors: 0, Skipped: 0, Time elapsed: 9.638 sec - in org.apache.phoenix.tx.FlappingTransactionIT
Running org.apache.phoenix.tx.ParameterizedTransactionIT
Tests run: 9, Failures: 0, Errors: 0, Skipped: 0, Time elapsed: 49.518 sec - in org.apache.phoenix.iterate.RoundRobinResultIteratorIT
Running org.apache.phoenix.tx.TransactionIT
Tests run: 67, Failures: 0, Errors: 0, Skipped: 0, Time elapsed: 459.037 sec - in org.apache.phoenix.end2end.index.IndexExpressionIT
Tests run: 7, Failures: 0, Errors: 0, Skipped: 0, Time elapsed: 54.505 sec - in org.apache.phoenix.tx.TransactionIT
Running org.apache.phoenix.tx.TxCheckpointIT
Tests run: 8, Failures: 0, Errors: 0, Skipped: 0, Time elapsed: 125.447 sec - in org.apache.phoenix.trace.PhoenixTracingEndToEndIT
Tests run: 64, Failures: 0, Errors: 0, Skipped: 0, Time elapsed: 490.388 sec - in org.apache.phoenix.end2end.index.MutableIndexIT
Tests run: 102, Failures: 0, Errors: 0, Skipped: 0, Time elapsed: 1,137.617 sec - in org.apache.phoenix.end2end.SortMergeJoinIT
Tests run: 52, Failures: 0, Errors: 0, Skipped: 4, Time elapsed: 222.256 sec - in org.apache.phoenix.tx.ParameterizedTransactionIT
Tests run: 40, Failures: 0, Errors: 0, Skipped: 0, Time elapsed: 294.737 sec - in org.apache.phoenix.tx.TxCheckpointIT

Results :

Tests run: 1760, Failures: 0, Errors: 0, Skipped: 4

[INFO] 
[INFO] --- maven-failsafe-plugin:2.19.1:integration-test (ClientManagedTimeTests) @ phoenix-core
---

-------------------------------------------------------
 T E S T S
-------------------------------------------------------
Running org.apache.phoenix.end2end.CreateTableIT
Running org.apache.phoenix.end2end.CreateSchemaIT
Running org.apache.phoenix.end2end.ArrayIT
Tests run: 1, Failures: 0, Errors: 0, Skipped: 0, Time elapsed: 0.509 sec - in org.apache.phoenix.end2end.CreateSchemaIT
Running org.apache.phoenix.end2end.CustomEntityDataIT
Running org.apache.phoenix.end2end.ColumnProjectionOptimizationIT
Running org.apache.phoenix.end2end.AggregateQueryIT
Running org.apache.phoenix.end2end.CaseStatementIT
Running org.apache.phoenix.end2end.ClientTimeArithmeticQueryIT
Running org.apache.phoenix.end2end.CastAndCoerceIT
Tests run: 3, Failures: 0, Errors: 0, Skipped: 0, Time elapsed: 10.314 sec - in org.apache.phoenix.end2end.CustomEntityDataIT
Running org.apache.phoenix.end2end.DerivedTableIT
Tests run: 18, Failures: 0, Errors: 0, Skipped: 0, Time elapsed: 20.247 sec - in org.apache.phoenix.end2end.DerivedTableIT
Tests run: 3, Failures: 0, Errors: 0, Skipped: 0, Time elapsed: 29.344 sec - in org.apache.phoenix.end2end.ColumnProjectionOptimizationIT
Running org.apache.phoenix.end2end.DistinctCountIT
Running org.apache.phoenix.end2end.DropSchemaIT
Tests run: 2, Failures: 0, Errors: 0, Skipped: 0, Time elapsed: 12.318 sec - in org.apache.phoenix.end2end.DropSchemaIT
Running org.apache.phoenix.end2end.ExtendedQueryExecIT
Tests run: 10, Failures: 0, Errors: 0, Skipped: 0, Time elapsed: 19.963 sec - in org.apache.phoenix.end2end.DistinctCountIT
Tests run: 4, Failures: 0, Errors: 0, Skipped: 0, Time elapsed: 6.938 sec - in org.apache.phoenix.end2end.ExtendedQueryExecIT
Running org.apache.phoenix.end2end.FunkyNamesIT
Running org.apache.phoenix.end2end.GroupByIT
Tests run: 3, Failures: 0, Errors: 0, Skipped: 0, Time elapsed: 6.185 sec - in org.apache.phoenix.end2end.FunkyNamesIT
Running org.apache.phoenix.end2end.MutableQueryIT
Tests run: 49, Failures: 0, Errors: 0, Skipped: 0, Time elapsed: 86.194 sec - in org.apache.phoenix.end2end.CastAndCoerceIT
Tests run: 56, Failures: 0, Errors: 0, Skipped: 0, Time elapsed: 87.878 sec - in org.apache.phoenix.end2end.CaseStatementIT
Tests run: 80, Failures: 0, Errors: 0, Skipped: 0, Time elapsed: 95.505 sec - in org.apache.phoenix.end2end.ArrayIT
Running org.apache.phoenix.end2end.NotQueryIT
Running org.apache.phoenix.end2end.PointInTimeQueryIT
Running org.apache.phoenix.end2end.NativeHBaseTypesIT
Tests run: 7, Failures: 0, Errors: 0, Skipped: 0, Time elapsed: 4.532 sec - in org.apache.phoenix.end2end.NativeHBaseTypesIT
Running org.apache.phoenix.end2end.ProductMetricsIT
Tests run: 42, Failures: 0, Errors: 0, Skipped: 0, Time elapsed: 105.08 sec - in org.apache.phoenix.end2end.AggregateQueryIT
Running org.apache.phoenix.end2end.QueryDatabaseMetaDataIT
Tests run: 61, Failures: 0, Errors: 0, Skipped: 0, Time elapsed: 22.988 sec - in org.apache.phoenix.end2end.ProductMetricsIT
Tests run: 77, Failures: 0, Errors: 0, Skipped: 0, Time elapsed: 55.528 sec - in org.apache.phoenix.end2end.NotQueryIT
Tests run: 245, Failures: 0, Errors: 0, Skipped: 0, Time elapsed: 151.52 sec - in org.apache.phoenix.end2end.ClientTimeArithmeticQueryIT
Tests run: 91, Failures: 0, Errors: 0, Skipped: 0, Time elapsed: 102.847 sec - in org.apache.phoenix.end2end.GroupByIT
Running org.apache.phoenix.end2end.RowValueConstructorIT
Running org.apache.phoenix.end2end.QueryIT
Tests run: 18, Failures: 0, Errors: 0, Skipped: 0, Time elapsed: 172.81 sec - in org.apache.phoenix.end2end.CreateTableIT
Running org.apache.phoenix.end2end.SequenceBulkAllocationIT
Tests run: 7, Failures: 0, Errors: 0, Skipped: 0, Time elapsed: 77.376 sec - in org.apache.phoenix.end2end.PointInTimeQueryIT
Running org.apache.phoenix.end2end.SequenceIT
Running org.apache.phoenix.end2end.ReadIsolationLevelIT
Tests run: 2, Failures: 0, Errors: 0, Skipped: 0, Time elapsed: 5.971 sec - in org.apache.phoenix.end2end.ReadIsolationLevelIT
Running org.apache.phoenix.end2end.ToNumberFunctionIT
Running org.apache.phoenix.end2end.ScanQueryIT
Tests run: 18, Failures: 0, Errors: 0, Skipped: 0, Time elapsed: 9.715 sec - in org.apache.phoenix.end2end.ToNumberFunctionIT
Running org.apache.phoenix.end2end.TopNIT
Tests run: 56, Failures: 0, Errors: 0, Skipped: 0, Time elapsed: 31.39 sec - in org.apache.phoenix.end2end.SequenceBulkAllocationIT
Running org.apache.phoenix.end2end.TruncateFunctionIT
Tests run: 1, Failures: 0, Errors: 0, Skipped: 0, Time elapsed: 5.926 sec - in org.apache.phoenix.end2end.TruncateFunctionIT
Tests run: 4, Failures: 0, Errors: 0, Skipped: 0, Time elapsed: 6.38 sec - in org.apache.phoenix.end2end.TopNIT
Running org.apache.phoenix.end2end.UpsertSelectIT
Running org.apache.phoenix.end2end.UpsertValuesIT
Tests run: 112, Failures: 0, Errors: 0, Skipped: 0, Time elapsed: 59.393 sec - in org.apache.phoenix.end2end.QueryIT
Tests run: 54, Failures: 0, Errors: 0, Skipped: 0, Time elapsed: 55.286 sec - in org.apache.phoenix.end2end.SequenceIT
Tests run: 19, Failures: 0, Errors: 0, Skipped: 0, Time elapsed: 134.98 sec - in org.apache.phoenix.end2end.QueryDatabaseMetaDataIT
Running org.apache.phoenix.rpc.UpdateCacheWithScnIT
Tests run: 112, Failures: 0, Errors: 0, Skipped: 0, Time elapsed: 186.579 sec - in org.apache.phoenix.end2end.MutableQueryIT
Tests run: 112, Failures: 0, Errors: 0, Skipped: 0, Time elapsed: 55.705 sec - in org.apache.phoenix.end2end.ScanQueryIT
Tests run: 1, Failures: 0, Errors: 0, Skipped: 0, Time elapsed: 6.284 sec - in org.apache.phoenix.rpc.UpdateCacheWithScnIT
Running org.apache.phoenix.end2end.VariableLengthPKIT
Running org.apache.phoenix.end2end.salted.SaltedTableIT
Tests run: 8, Failures: 0, Errors: 0, Skipped: 0, Time elapsed: 6.672 sec - in org.apache.phoenix.end2end.salted.SaltedTableIT
Tests run: 46, Failures: 0, Errors: 0, Skipped: 0, Time elapsed: 127.388 sec - in org.apache.phoenix.end2end.RowValueConstructorIT
Tests run: 50, Failures: 0, Errors: 0, Skipped: 0, Time elapsed: 47.641 sec - in org.apache.phoenix.end2end.VariableLengthPKIT
Tests run: 25, Failures: 0, Errors: 0, Skipped: 0, Time elapsed: 128.118 sec - in org.apache.phoenix.end2end.UpsertValuesIT
Tests run: 24, Failures: 0, Errors: 0, Skipped: 0, Time elapsed: 143.724 sec - in org.apache.phoenix.end2end.UpsertSelectIT

Results :

Tests run: 1421, Failures: 0, Errors: 0, Skipped: 0

[INFO] 
[INFO] --- maven-failsafe-plugin:2.19.1:integration-test (HBaseManagedTimeTests) @ phoenix-core
---

-------------------------------------------------------
 T E S T S
-------------------------------------------------------

Results :

Tests run: 0, Failures: 0, Errors: 0, Skipped: 0

[INFO] 
[INFO] --- maven-failsafe-plugin:2.19.1:integration-test (NeedTheirOwnClusterTests) @ phoenix-core
---

-------------------------------------------------------
 T E S T S
-------------------------------------------------------
Running org.apache.hadoop.hbase.regionserver.wal.WALReplayWithIndexWritesAndCompressedWALIT
Running org.apache.phoenix.end2end.ConnectionUtilIT
Tests run: 1, Failures: 0, Errors: 0, Skipped: 0, Time elapsed: 30.182 sec - in org.apache.hadoop.hbase.regionserver.wal.WALReplayWithIndexWritesAndCompressedWALIT
Running org.apache.phoenix.end2end.CountDistinctCompressionIT
Running org.apache.phoenix.end2end.CsvBulkLoadToolIT
Running org.apache.phoenix.end2end.ContextClassloaderIT
Tests run: 1, Failures: 0, Errors: 0, Skipped: 0, Time elapsed: 29.08 sec - in org.apache.phoenix.end2end.ConnectionUtilIT
Tests run: 1, Failures: 0, Errors: 0, Skipped: 0, Time elapsed: 10.337 sec - in org.apache.phoenix.end2end.CountDistinctCompressionIT
Tests run: 3, Failures: 0, Errors: 0, Skipped: 0, Time elapsed: 9.363 sec - in org.apache.phoenix.end2end.ContextClassloaderIT
Running org.apache.phoenix.end2end.FlappingLocalIndexIT
Running org.apache.phoenix.end2end.IndexExtendedIT
Running org.apache.phoenix.end2end.IndexToolForPartialBuildIT
Running org.apache.phoenix.end2end.IndexToolForPartialBuildWithNamespaceEnabledIT
Tests run: 2, Failures: 0, Errors: 0, Skipped: 0, Time elapsed: 27.367 sec - in org.apache.phoenix.end2end.IndexToolForPartialBuildIT
Running org.apache.phoenix.end2end.QueryWithLimitIT
Tests run: 2, Failures: 0, Errors: 0, Skipped: 0, Time elapsed: 27.422 sec - in org.apache.phoenix.end2end.IndexToolForPartialBuildWithNamespaceEnabledIT
Running org.apache.phoenix.end2end.QueryTimeoutIT
Running org.apache.phoenix.end2end.RegexBulkLoadToolIT
Tests run: 2, Failures: 0, Errors: 0, Skipped: 0, Time elapsed: 8.161 sec - in org.apache.phoenix.end2end.QueryWithLimitIT
Tests run: 2, Failures: 0, Errors: 0, Skipped: 0, Time elapsed: 16.88 sec - in org.apache.phoenix.end2end.QueryTimeoutIT
Tests run: 11, Failures: 0, Errors: 0, Skipped: 0, Time elapsed: 79.603 sec - in org.apache.phoenix.end2end.CsvBulkLoadToolIT
Running org.apache.phoenix.end2end.RenewLeaseIT
Tests run: 8, Failures: 0, Errors: 0, Skipped: 0, Time elapsed: 85.899 sec - in org.apache.phoenix.end2end.FlappingLocalIndexIT
Running org.apache.phoenix.end2end.SpillableGroupByIT
Running org.apache.phoenix.end2end.StatsCollectorIT
Running org.apache.phoenix.end2end.SysTableNamespaceMappedStatsCollectorIT
Tests run: 2, Failures: 0, Errors: 0, Skipped: 0, Time elapsed: 12.987 sec - in org.apache.phoenix.end2end.SpillableGroupByIT
Tests run: 1, Failures: 0, Errors: 0, Skipped: 0, Time elapsed: 37.357 sec - in org.apache.phoenix.end2end.RenewLeaseIT
Tests run: 10, Failures: 0, Errors: 0, Skipped: 0, Time elapsed: 78.099 sec - in org.apache.phoenix.end2end.RegexBulkLoadToolIT
Running org.apache.phoenix.end2end.UserDefinedFunctionsIT
Running org.apache.phoenix.end2end.index.ImmutableIndexIT
Running org.apache.phoenix.end2end.index.MutableIndexFailureIT
Running org.apache.phoenix.end2end.index.LocalIndexIT
Running org.apache.phoenix.end2end.index.MutableIndexReplicationIT
Tests run: 14, Failures: 0, Errors: 0, Skipped: 0, Time elapsed: 54.504 sec - in org.apache.phoenix.end2end.UserDefinedFunctionsIT
Tests run: 1, Failures: 0, Errors: 0, Skipped: 0, Time elapsed: 26.212 sec - in org.apache.phoenix.end2end.index.MutableIndexReplicationIT
Running org.apache.phoenix.end2end.index.txn.TxWriteFailureIT
Running org.apache.phoenix.execute.PartialCommitIT
Tests run: 12, Failures: 0, Errors: 0, Skipped: 0, Time elapsed: 11.358 sec - in org.apache.phoenix.execute.PartialCommitIT
Running org.apache.phoenix.hbase.index.FailForUnsupportedHBaseVersionsIT
Tests run: 2, Failures: 0, Errors: 0, Skipped: 0, Time elapsed: 18.762 sec - in org.apache.phoenix.hbase.index.FailForUnsupportedHBaseVersionsIT
Tests run: 11, Failures: 0, Errors: 0, Skipped: 0, Time elapsed: 142.065 sec - in org.apache.phoenix.end2end.index.MutableIndexFailureIT
Running org.apache.phoenix.hbase.index.covered.EndToEndCoveredColumnsIndexBuilderIT
Tests run: 80, Failures: 0, Errors: 0, Skipped: 0, Time elapsed: 281.791 sec - in org.apache.phoenix.end2end.IndexExtendedIT
Tests run: 8, Failures: 0, Errors: 0, Skipped: 0, Time elapsed: 66.802 sec - in org.apache.phoenix.end2end.index.txn.TxWriteFailureIT
Running org.apache.phoenix.hbase.index.covered.example.FailWithoutRetriesIT
Tests run: 2, Failures: 0, Errors: 0, Skipped: 0, Time elapsed: 18.065 sec - in org.apache.phoenix.hbase.index.covered.EndToEndCoveredColumnsIndexBuilderIT
Tests run: 1, Failures: 0, Errors: 0, Skipped: 0, Time elapsed: 8.166 sec - in org.apache.phoenix.hbase.index.covered.example.FailWithoutRetriesIT
Running org.apache.phoenix.hbase.index.covered.example.EndToEndCoveredIndexingIT
Running org.apache.phoenix.hbase.index.covered.example.EndtoEndIndexingWithCompressionIT
Running org.apache.phoenix.iterate.RoundRobinResultIteratorWithStatsIT
Running org.apache.phoenix.iterate.ScannerLeaseRenewalIT
Tests run: 1, Failures: 0, Errors: 0, Skipped: 0, Time elapsed: 18.142 sec - in org.apache.phoenix.iterate.RoundRobinResultIteratorWithStatsIT
Running org.apache.phoenix.monitoring.PhoenixMetricsIT
Tests run: 120, Failures: 0, Errors: 0, Skipped: 24, Time elapsed: 297.907 sec - in org.apache.phoenix.end2end.StatsCollectorIT
Tests run: 120, Failures: 0, Errors: 0, Skipped: 24, Time elapsed: 303.416 sec - in org.apache.phoenix.end2end.SysTableNamespaceMappedStatsCollectorIT
Running org.apache.phoenix.rpc.PhoenixClientRpcIT
Running org.apache.phoenix.rpc.PhoenixServerRpcIT
Tests run: 2, Failures: 0, Errors: 0, Skipped: 0, Time elapsed: 12.112 sec - in org.apache.phoenix.rpc.PhoenixClientRpcIT
Tests run: 11, Failures: 0, Errors: 0, Skipped: 0, Time elapsed: 137.211 sec - in org.apache.phoenix.hbase.index.covered.example.EndToEndCoveredIndexingIT
Tests run: 32, Failures: 0, Errors: 0, Skipped: 0, Time elapsed: 306.404 sec - in org.apache.phoenix.end2end.index.LocalIndexIT
Tests run: 2, Failures: 0, Errors: 0, Skipped: 0, Time elapsed: 21.831 sec - in org.apache.phoenix.rpc.PhoenixServerRpcIT
Tests run: 11, Failures: 0, Errors: 0, Skipped: 0, Time elapsed: 136.888 sec - in org.apache.phoenix.hbase.index.covered.example.EndtoEndIndexingWithCompressionIT
Tests run: 21, Failures: 0, Errors: 0, Skipped: 0, Time elapsed: 72.219 sec - in org.apache.phoenix.monitoring.PhoenixMetricsIT
Tests run: 24, Failures: 0, Errors: 0, Skipped: 0, Time elapsed: 329.854 sec - in org.apache.phoenix.end2end.index.ImmutableIndexIT
Tests run: 2, Failures: 0, Errors: 0, Skipped: 0, Time elapsed: 168.369 sec - in org.apache.phoenix.iterate.ScannerLeaseRenewalIT

Results :

Tests run: 523, Failures: 0, Errors: 0, Skipped: 48

[INFO] 
[INFO] --- maven-failsafe-plugin:2.19.1:verify (ParallelStatsEnabledTest) @ phoenix-core ---
[INFO] ------------------------------------------------------------------------
[INFO] Reactor Summary:
[INFO] 
[INFO] Apache Phoenix ..................................... SUCCESS [  2.626 s]
[INFO] Phoenix Core ....................................... FAILURE [53:50 min]
[INFO] Phoenix - Flume .................................... SKIPPED
[INFO] Phoenix - Kafka .................................... SKIPPED
[INFO] Phoenix - Pig ...................................... SKIPPED
[INFO] Phoenix Query Server Client ........................ SKIPPED
[INFO] Phoenix Query Server ............................... SKIPPED
[INFO] Phoenix - Pherf .................................... SKIPPED
[INFO] Phoenix - Spark .................................... SKIPPED
[INFO] Phoenix - Hive ..................................... SKIPPED
[INFO] Phoenix Client ..................................... SKIPPED
[INFO] Phoenix Server ..................................... SKIPPED
[INFO] Phoenix Assembly ................................... SKIPPED
[INFO] Phoenix - Tracing Web Application .................. SKIPPED
[INFO] ------------------------------------------------------------------------
[INFO] BUILD FAILURE
[INFO] ------------------------------------------------------------------------
[INFO] Total time: 53:55 min
[INFO] Finished at: 2017-05-31T21:11:40+00:00
[INFO] Final Memory: 63M/1508M
[INFO] ------------------------------------------------------------------------
[ERROR] Failed to execute goal org.apache.maven.plugins:maven-failsafe-plugin:2.19.1:verify
(ParallelStatsEnabledTest) on project phoenix-core: There was a timeout or other error in
the fork -> [Help 1]
[ERROR] 
[ERROR] To see the full stack trace of the errors, re-run Maven with the -e switch.
[ERROR] Re-run Maven using the -X switch to enable full debug logging.
[ERROR] 
[ERROR] For more information about the errors and possible solutions, please read the following
articles:
[ERROR] [Help 1] http://cwiki.apache.org/confluence/display/MAVEN/MojoExecutionException
[ERROR] 
[ERROR] After correcting the problems, you can resume the build with the command
[ERROR]   mvn <goals> -rf :phoenix-core
Build step 'Invoke top-level Maven targets' marked build as failure
Archiving artifacts
Recording test results

Mime
View raw message