phoenix-commits mailing list archives

Site index · List index
Message view « Date » · « Thread »
Top « Date » · « Thread »
From Apache Jenkins Server <jenk...@builds.apache.org>
Subject Build failed in Jenkins: Phoenix-4.x-HBase-1.1 #405
Date Fri, 26 May 2017 20:03:42 GMT
See <https://builds.apache.org/job/Phoenix-4.x-HBase-1.1/405/display/redirect?page=changes>

Changes:

[samarth] PHOENIX-3248 Enable HBase server-side scan metrics to be returned to

[samarth] PHOENIX-3248 Amend - add missing file

[samarth] PHOENIX-3752 Remove hadoop metrics integration from the tracing

[samarth] PHOENIX-3767 Prevent spurious tracing spans from Hadoop being written in

[thomas] PHOENIX-3784 Chunk commit data using lower of byte-based and row-count

------------------------------------------
[...truncated 425.71 KB...]
Tests run: 8, Failures: 0, Errors: 0, Skipped: 0, Time elapsed: 53.16 sec - in org.apache.phoenix.end2end.index.txn.RollbackIT
Running org.apache.phoenix.end2end.salted.SaltedTableVarLengthRowKeyIT
Tests run: 1, Failures: 0, Errors: 0, Skipped: 0, Time elapsed: 2.281 sec - in org.apache.phoenix.end2end.salted.SaltedTableVarLengthRowKeyIT
Running org.apache.phoenix.iterate.PhoenixQueryTimeoutIT
Tests run: 2, Failures: 0, Errors: 0, Skipped: 0, Time elapsed: 4.915 sec - in org.apache.phoenix.iterate.PhoenixQueryTimeoutIT
Running org.apache.phoenix.iterate.RoundRobinResultIteratorIT
Tests run: 67, Failures: 0, Errors: 0, Skipped: 0, Time elapsed: 454.242 sec - in org.apache.phoenix.end2end.index.IndexExpressionIT
Running org.apache.phoenix.replication.SystemCatalogWALEntryFilterIT
Tests run: 2, Failures: 0, Errors: 0, Skipped: 0, Time elapsed: 0.086 sec - in org.apache.phoenix.replication.SystemCatalogWALEntryFilterIT
Running org.apache.phoenix.rpc.UpdateCacheIT
Tests run: 6, Failures: 0, Errors: 0, Skipped: 0, Time elapsed: 26.732 sec - in org.apache.phoenix.end2end.salted.SaltedTableUpsertSelectIT
Running org.apache.phoenix.trace.PhoenixTableMetricsWriterIT
Tests run: 2, Failures: 0, Errors: 0, Skipped: 0, Time elapsed: 13.624 sec - in org.apache.phoenix.trace.PhoenixTableMetricsWriterIT
Running org.apache.phoenix.trace.PhoenixTracingEndToEndIT
Tests run: 7, Failures: 0, Errors: 0, Skipped: 0, Time elapsed: 27.775 sec - in org.apache.phoenix.rpc.UpdateCacheIT
Running org.apache.phoenix.tx.FlappingTransactionIT
Tests run: 4, Failures: 0, Errors: 0, Skipped: 0, Time elapsed: 9.496 sec - in org.apache.phoenix.tx.FlappingTransactionIT
Running org.apache.phoenix.tx.ParameterizedTransactionIT
Tests run: 9, Failures: 0, Errors: 0, Skipped: 0, Time elapsed: 50.297 sec - in org.apache.phoenix.iterate.RoundRobinResultIteratorIT
Running org.apache.phoenix.tx.TransactionIT
Tests run: 7, Failures: 0, Errors: 0, Skipped: 0, Time elapsed: 53.734 sec - in org.apache.phoenix.tx.TransactionIT
Running org.apache.phoenix.tx.TxCheckpointIT
Tests run: 102, Failures: 0, Errors: 0, Skipped: 0, Time elapsed: 1,112.916 sec - in org.apache.phoenix.end2end.SortMergeJoinIT
Tests run: 52, Failures: 0, Errors: 0, Skipped: 4, Time elapsed: 220.307 sec - in org.apache.phoenix.tx.ParameterizedTransactionIT
Tests run: 64, Failures: 0, Errors: 0, Skipped: 0, Time elapsed: 486.49 sec - in org.apache.phoenix.end2end.index.MutableIndexIT
Tests run: 40, Failures: 0, Errors: 0, Skipped: 0, Time elapsed: 289.982 sec - in org.apache.phoenix.tx.TxCheckpointIT

Results :

Tests run: 1750, Failures: 0, Errors: 0, Skipped: 4

[INFO] 
[INFO] --- maven-failsafe-plugin:2.19.1:integration-test (ClientManagedTimeTests) @ phoenix-core
---

-------------------------------------------------------
 T E S T S
-------------------------------------------------------
Running org.apache.phoenix.end2end.ColumnProjectionOptimizationIT
Running org.apache.phoenix.end2end.ArrayIT
Running org.apache.phoenix.end2end.AggregateQueryIT
Running org.apache.phoenix.end2end.CastAndCoerceIT
Running org.apache.phoenix.end2end.ClientTimeArithmeticQueryIT
Running org.apache.phoenix.end2end.CaseStatementIT
Tests run: 3, Failures: 0, Errors: 0, Skipped: 0, Time elapsed: 27.319 sec - in org.apache.phoenix.end2end.ColumnProjectionOptimizationIT
Running org.apache.phoenix.end2end.CreateSchemaIT
Tests run: 1, Failures: 0, Errors: 0, Skipped: 0, Time elapsed: 0.294 sec - in org.apache.phoenix.end2end.CreateSchemaIT
Running org.apache.phoenix.end2end.CreateTableIT
Tests run: 49, Failures: 0, Errors: 0, Skipped: 0, Time elapsed: 85.984 sec - in org.apache.phoenix.end2end.CastAndCoerceIT
Running org.apache.phoenix.end2end.CustomEntityDataIT
Tests run: 80, Failures: 0, Errors: 0, Skipped: 0, Time elapsed: 91.204 sec - in org.apache.phoenix.end2end.ArrayIT
Running org.apache.phoenix.end2end.DerivedTableIT
Tests run: 56, Failures: 0, Errors: 0, Skipped: 0, Time elapsed: 86.343 sec - in org.apache.phoenix.end2end.CaseStatementIT
Running org.apache.phoenix.end2end.DistinctCountIT
Tests run: 3, Failures: 0, Errors: 0, Skipped: 0, Time elapsed: 6.481 sec - in org.apache.phoenix.end2end.CustomEntityDataIT
Running org.apache.phoenix.end2end.DropSchemaIT
Tests run: 42, Failures: 0, Errors: 0, Skipped: 0, Time elapsed: 101.433 sec - in org.apache.phoenix.end2end.AggregateQueryIT
Running org.apache.phoenix.end2end.ExtendedQueryExecIT
Tests run: 2, Failures: 0, Errors: 0, Skipped: 0, Time elapsed: 11.947 sec - in org.apache.phoenix.end2end.DropSchemaIT
Running org.apache.phoenix.end2end.FunkyNamesIT
Tests run: 18, Failures: 0, Errors: 0, Skipped: 0, Time elapsed: 17.024 sec - in org.apache.phoenix.end2end.DerivedTableIT
Tests run: 4, Failures: 0, Errors: 0, Skipped: 0, Time elapsed: 6.707 sec - in org.apache.phoenix.end2end.ExtendedQueryExecIT
Tests run: 10, Failures: 0, Errors: 0, Skipped: 0, Time elapsed: 19.763 sec - in org.apache.phoenix.end2end.DistinctCountIT
Running org.apache.phoenix.end2end.GroupByIT
Tests run: 3, Failures: 0, Errors: 0, Skipped: 0, Time elapsed: 6.336 sec - in org.apache.phoenix.end2end.FunkyNamesIT
Running org.apache.phoenix.end2end.MutableQueryIT
Running org.apache.phoenix.end2end.NotQueryIT
Running org.apache.phoenix.end2end.NativeHBaseTypesIT
Tests run: 7, Failures: 0, Errors: 0, Skipped: 0, Time elapsed: 4.716 sec - in org.apache.phoenix.end2end.NativeHBaseTypesIT
Running org.apache.phoenix.end2end.PointInTimeQueryIT
Tests run: 245, Failures: 0, Errors: 0, Skipped: 0, Time elapsed: 148.69 sec - in org.apache.phoenix.end2end.ClientTimeArithmeticQueryIT
Tests run: 7, Failures: 0, Errors: 0, Skipped: 0, Time elapsed: 40.097 sec - in org.apache.phoenix.end2end.PointInTimeQueryIT
Running org.apache.phoenix.end2end.QueryDatabaseMetaDataIT
Tests run: 77, Failures: 0, Errors: 0, Skipped: 0, Time elapsed: 56.686 sec - in org.apache.phoenix.end2end.NotQueryIT
Running org.apache.phoenix.end2end.QueryIT
Running org.apache.phoenix.end2end.ProductMetricsIT
Tests run: 18, Failures: 0, Errors: 0, Skipped: 0, Time elapsed: 163.389 sec - in org.apache.phoenix.end2end.CreateTableIT
Running org.apache.phoenix.end2end.ReadIsolationLevelIT
Tests run: 2, Failures: 0, Errors: 0, Skipped: 0, Time elapsed: 6.197 sec - in org.apache.phoenix.end2end.ReadIsolationLevelIT
Running org.apache.phoenix.end2end.RowValueConstructorIT
Tests run: 61, Failures: 0, Errors: 0, Skipped: 0, Time elapsed: 21.275 sec - in org.apache.phoenix.end2end.ProductMetricsIT
Running org.apache.phoenix.end2end.ScanQueryIT
Tests run: 91, Failures: 0, Errors: 0, Skipped: 0, Time elapsed: 103.254 sec - in org.apache.phoenix.end2end.GroupByIT
Tests run: 112, Failures: 0, Errors: 0, Skipped: 0, Time elapsed: 68.555 sec - in org.apache.phoenix.end2end.QueryIT
Running org.apache.phoenix.end2end.SequenceBulkAllocationIT
Tests run: 112, Failures: 0, Errors: 0, Skipped: 0, Time elapsed: 58.019 sec - in org.apache.phoenix.end2end.ScanQueryIT
Running org.apache.phoenix.end2end.SequenceIT
Tests run: 56, Failures: 0, Errors: 0, Skipped: 0, Time elapsed: 26.252 sec - in org.apache.phoenix.end2end.SequenceBulkAllocationIT
Running org.apache.phoenix.end2end.TopNIT
Tests run: 4, Failures: 0, Errors: 0, Skipped: 0, Time elapsed: 6.291 sec - in org.apache.phoenix.end2end.TopNIT
Running org.apache.phoenix.end2end.TruncateFunctionIT
Tests run: 1, Failures: 0, Errors: 0, Skipped: 0, Time elapsed: 4.848 sec - in org.apache.phoenix.end2end.TruncateFunctionIT
Running org.apache.phoenix.end2end.UpsertSelectIT
Tests run: 19, Failures: 0, Errors: 0, Skipped: 0, Time elapsed: 131.452 sec - in org.apache.phoenix.end2end.QueryDatabaseMetaDataIT
Running org.apache.phoenix.end2end.UpsertValuesIT
Running org.apache.phoenix.end2end.ToNumberFunctionIT
Tests run: 112, Failures: 0, Errors: 0, Skipped: 0, Time elapsed: 185.054 sec - in org.apache.phoenix.end2end.MutableQueryIT
Tests run: 18, Failures: 0, Errors: 0, Skipped: 0, Time elapsed: 7.569 sec - in org.apache.phoenix.end2end.ToNumberFunctionIT
Running org.apache.phoenix.end2end.salted.SaltedTableIT
Tests run: 8, Failures: 0, Errors: 0, Skipped: 0, Time elapsed: 6.565 sec - in org.apache.phoenix.end2end.salted.SaltedTableIT
Running org.apache.phoenix.rpc.UpdateCacheWithScnIT
Tests run: 46, Failures: 0, Errors: 0, Skipped: 0, Time elapsed: 123.233 sec - in org.apache.phoenix.end2end.RowValueConstructorIT
Tests run: 1, Failures: 0, Errors: 0, Skipped: 0, Time elapsed: 6.092 sec - in org.apache.phoenix.rpc.UpdateCacheWithScnIT
Tests run: 54, Failures: 0, Errors: 0, Skipped: 0, Time elapsed: 50.163 sec - in org.apache.phoenix.end2end.SequenceIT
Running org.apache.phoenix.end2end.VariableLengthPKIT
Tests run: 50, Failures: 0, Errors: 0, Skipped: 0, Time elapsed: 43.224 sec - in org.apache.phoenix.end2end.VariableLengthPKIT
Tests run: 25, Failures: 0, Errors: 0, Skipped: 0, Time elapsed: 122.59 sec - in org.apache.phoenix.end2end.UpsertValuesIT
Tests run: 24, Failures: 0, Errors: 0, Skipped: 0, Time elapsed: 136.32 sec - in org.apache.phoenix.end2end.UpsertSelectIT

Results :

Tests run: 1421, Failures: 0, Errors: 0, Skipped: 0

[INFO] 
[INFO] --- maven-failsafe-plugin:2.19.1:integration-test (HBaseManagedTimeTests) @ phoenix-core
---

-------------------------------------------------------
 T E S T S
-------------------------------------------------------

Results :

Tests run: 0, Failures: 0, Errors: 0, Skipped: 0

[INFO] 
[INFO] --- maven-failsafe-plugin:2.19.1:integration-test (NeedTheirOwnClusterTests) @ phoenix-core
---

-------------------------------------------------------
 T E S T S
-------------------------------------------------------
Running org.apache.hadoop.hbase.regionserver.wal.WALReplayWithIndexWritesAndCompressedWALIT
Running org.apache.phoenix.end2end.ConnectionUtilIT
Tests run: 1, Failures: 0, Errors: 0, Skipped: 0, Time elapsed: 28.831 sec - in org.apache.hadoop.hbase.regionserver.wal.WALReplayWithIndexWritesAndCompressedWALIT
Running org.apache.phoenix.end2end.ContextClassloaderIT
Running org.apache.phoenix.end2end.CsvBulkLoadToolIT
Running org.apache.phoenix.end2end.CountDistinctCompressionIT
Tests run: 1, Failures: 0, Errors: 0, Skipped: 0, Time elapsed: 28.585 sec - in org.apache.phoenix.end2end.ConnectionUtilIT
Tests run: 3, Failures: 0, Errors: 0, Skipped: 0, Time elapsed: 8.53 sec - in org.apache.phoenix.end2end.ContextClassloaderIT
Tests run: 1, Failures: 0, Errors: 0, Skipped: 0, Time elapsed: 7.234 sec - in org.apache.phoenix.end2end.CountDistinctCompressionIT
Running org.apache.phoenix.end2end.FlappingLocalIndexIT
Running org.apache.phoenix.end2end.IndexExtendedIT
Running org.apache.phoenix.end2end.IndexToolForPartialBuildIT
Running org.apache.phoenix.end2end.IndexToolForPartialBuildWithNamespaceEnabledIT
Tests run: 2, Failures: 0, Errors: 0, Skipped: 0, Time elapsed: 30.936 sec - in org.apache.phoenix.end2end.IndexToolForPartialBuildIT
Tests run: 2, Failures: 0, Errors: 0, Skipped: 0, Time elapsed: 28.336 sec - in org.apache.phoenix.end2end.IndexToolForPartialBuildWithNamespaceEnabledIT
Running org.apache.phoenix.end2end.QueryTimeoutIT
Tests run: 11, Failures: 0, Errors: 0, Skipped: 0, Time elapsed: 78.726 sec - in org.apache.phoenix.end2end.CsvBulkLoadToolIT
Tests run: 2, Failures: 0, Errors: 0, Skipped: 0, Time elapsed: 19.739 sec - in org.apache.phoenix.end2end.QueryTimeoutIT
Running org.apache.phoenix.end2end.QueryWithLimitIT
Tests run: 8, Failures: 0, Errors: 0, Skipped: 0, Time elapsed: 80.508 sec - in org.apache.phoenix.end2end.FlappingLocalIndexIT
Running org.apache.phoenix.end2end.RegexBulkLoadToolIT
Tests run: 2, Failures: 0, Errors: 0, Skipped: 0, Time elapsed: 7.243 sec - in org.apache.phoenix.end2end.QueryWithLimitIT
Running org.apache.phoenix.end2end.RenewLeaseIT
Running org.apache.phoenix.end2end.SpillableGroupByIT
Running org.apache.phoenix.end2end.StatsCollectorIT
Tests run: 2, Failures: 0, Errors: 0, Skipped: 0, Time elapsed: 10.661 sec - in org.apache.phoenix.end2end.SpillableGroupByIT
Running org.apache.phoenix.end2end.SysTableNamespaceMappedStatsCollectorIT
Tests run: 1, Failures: 0, Errors: 0, Skipped: 0, Time elapsed: 36.736 sec - in org.apache.phoenix.end2end.RenewLeaseIT
Tests run: 10, Failures: 0, Errors: 0, Skipped: 0, Time elapsed: 77.391 sec - in org.apache.phoenix.end2end.RegexBulkLoadToolIT
Running org.apache.phoenix.end2end.UserDefinedFunctionsIT
Running org.apache.phoenix.end2end.index.ImmutableIndexIT
Running org.apache.phoenix.end2end.index.LocalIndexIT
Tests run: 14, Failures: 0, Errors: 0, Skipped: 0, Time elapsed: 52.253 sec - in org.apache.phoenix.end2end.UserDefinedFunctionsIT
Running org.apache.phoenix.end2end.index.MutableIndexFailureIT
Tests run: 1, Failures: 0, Errors: 0, Skipped: 1, Time elapsed: 0.003 sec - in org.apache.phoenix.end2end.index.MutableIndexFailureIT
Running org.apache.phoenix.end2end.index.MutableIndexReplicationIT
Tests run: 80, Failures: 0, Errors: 0, Skipped: 0, Time elapsed: 273.738 sec - in org.apache.phoenix.end2end.IndexExtendedIT
Tests run: 1, Failures: 0, Errors: 0, Skipped: 0, Time elapsed: 26.289 sec - in org.apache.phoenix.end2end.index.MutableIndexReplicationIT
Running org.apache.phoenix.end2end.index.txn.TxWriteFailureIT
Running org.apache.phoenix.execute.PartialCommitIT
Tests run: 12, Failures: 0, Errors: 0, Skipped: 0, Time elapsed: 4.648 sec - in org.apache.phoenix.execute.PartialCommitIT
Running org.apache.phoenix.hbase.index.FailForUnsupportedHBaseVersionsIT
Tests run: 2, Failures: 0, Errors: 0, Skipped: 0, Time elapsed: 19.158 sec - in org.apache.phoenix.hbase.index.FailForUnsupportedHBaseVersionsIT
Running org.apache.phoenix.hbase.index.covered.EndToEndCoveredColumnsIndexBuilderIT
Tests run: 8, Failures: 0, Errors: 0, Skipped: 0, Time elapsed: 59.35 sec - in org.apache.phoenix.end2end.index.txn.TxWriteFailureIT
Tests run: 2, Failures: 0, Errors: 0, Skipped: 0, Time elapsed: 17.875 sec - in org.apache.phoenix.hbase.index.covered.EndToEndCoveredColumnsIndexBuilderIT
Tests run: 120, Failures: 0, Errors: 0, Skipped: 24, Time elapsed: 285.339 sec - in org.apache.phoenix.end2end.StatsCollectorIT
Running org.apache.phoenix.hbase.index.covered.example.EndToEndCoveredIndexingIT
Running org.apache.phoenix.hbase.index.covered.example.FailWithoutRetriesIT
Tests run: 1, Failures: 0, Errors: 0, Skipped: 0, Time elapsed: 8.078 sec - in org.apache.phoenix.hbase.index.covered.example.FailWithoutRetriesIT
Tests run: 120, Failures: 0, Errors: 0, Skipped: 24, Time elapsed: 297.696 sec - in org.apache.phoenix.end2end.SysTableNamespaceMappedStatsCollectorIT
Running org.apache.phoenix.hbase.index.covered.example.EndtoEndIndexingWithCompressionIT
Running org.apache.phoenix.iterate.RoundRobinResultIteratorWithStatsIT
Running org.apache.phoenix.iterate.ScannerLeaseRenewalIT
Tests run: 1, Failures: 0, Errors: 0, Skipped: 0, Time elapsed: 18.205 sec - in org.apache.phoenix.iterate.RoundRobinResultIteratorWithStatsIT
Tests run: 32, Failures: 0, Errors: 0, Skipped: 0, Time elapsed: 302.439 sec - in org.apache.phoenix.end2end.index.LocalIndexIT
Running org.apache.phoenix.monitoring.PhoenixMetricsIT
Tests run: 1, Failures: 0, Errors: 1, Skipped: 0, Time elapsed: 0.005 sec <<< FAILURE!
- in org.apache.phoenix.monitoring.PhoenixMetricsIT
org.apache.phoenix.monitoring.PhoenixMetricsIT  Time elapsed: 0.005 sec  <<< ERROR!
org.apache.phoenix.exception.PhoenixIOException: java.lang.NullPointerException
	at org.apache.phoenix.monitoring.PhoenixMetricsIT.doSetup(PhoenixMetricsIT.java:95)
Caused by: java.util.concurrent.ExecutionException: java.lang.NullPointerException
	at org.apache.phoenix.monitoring.PhoenixMetricsIT.doSetup(PhoenixMetricsIT.java:95)
Caused by: java.lang.NullPointerException

Tests run: 24, Failures: 0, Errors: 0, Skipped: 0, Time elapsed: 341.282 sec - in org.apache.phoenix.end2end.index.ImmutableIndexIT
Running org.apache.phoenix.rpc.PhoenixClientRpcIT
Running org.apache.phoenix.rpc.PhoenixServerRpcIT
Tests run: 2, Failures: 0, Errors: 0, Skipped: 0, Time elapsed: 11.835 sec - in org.apache.phoenix.rpc.PhoenixClientRpcIT
Tests run: 11, Failures: 0, Errors: 0, Skipped: 0, Time elapsed: 138.56 sec - in org.apache.phoenix.hbase.index.covered.example.EndToEndCoveredIndexingIT
Tests run: 2, Failures: 0, Errors: 0, Skipped: 0, Time elapsed: 22.227 sec - in org.apache.phoenix.rpc.PhoenixServerRpcIT
Tests run: 11, Failures: 0, Errors: 0, Skipped: 0, Time elapsed: 137.02 sec - in org.apache.phoenix.hbase.index.covered.example.EndtoEndIndexingWithCompressionIT
Tests run: 2, Failures: 0, Errors: 0, Skipped: 0, Time elapsed: 166.705 sec - in org.apache.phoenix.iterate.ScannerLeaseRenewalIT

Results :

Tests in error: 
  PhoenixMetricsIT.doSetup:95->BaseTest.setUpTestDriver:563->BaseTest.setUpTestDriver:571->BaseTest.initAndRegisterTestDriver:687
ยป PhoenixIO

Tests run: 493, Failures: 0, Errors: 1, Skipped: 49

[INFO] 
[INFO] --- maven-failsafe-plugin:2.19.1:verify (ParallelStatsEnabledTest) @ phoenix-core ---
[INFO] ------------------------------------------------------------------------
[INFO] Reactor Summary:
[INFO] 
[INFO] Apache Phoenix ..................................... SUCCESS [  2.469 s]
[INFO] Phoenix Core ....................................... FAILURE [  01:02 h]
[INFO] Phoenix - Flume .................................... SKIPPED
[INFO] Phoenix - Kafka .................................... SKIPPED
[INFO] Phoenix - Pig ...................................... SKIPPED
[INFO] Phoenix Query Server Client ........................ SKIPPED
[INFO] Phoenix Query Server ............................... SKIPPED
[INFO] Phoenix - Pherf .................................... SKIPPED
[INFO] Phoenix - Spark .................................... SKIPPED
[INFO] Phoenix - Hive ..................................... SKIPPED
[INFO] Phoenix Client ..................................... SKIPPED
[INFO] Phoenix Server ..................................... SKIPPED
[INFO] Phoenix Assembly ................................... SKIPPED
[INFO] Phoenix - Tracing Web Application .................. SKIPPED
[INFO] ------------------------------------------------------------------------
[INFO] BUILD FAILURE
[INFO] ------------------------------------------------------------------------
[INFO] Total time: 01:02 h
[INFO] Finished at: 2017-05-26T19:57:40+00:00
[INFO] Final Memory: 63M/1023M
[INFO] ------------------------------------------------------------------------
[ERROR] Failed to execute goal org.apache.maven.plugins:maven-failsafe-plugin:2.19.1:verify
(ParallelStatsEnabledTest) on project phoenix-core: There was a timeout or other error in
the fork -> [Help 1]
[ERROR] 
[ERROR] To see the full stack trace of the errors, re-run Maven with the -e switch.
[ERROR] Re-run Maven using the -X switch to enable full debug logging.
[ERROR] 
[ERROR] For more information about the errors and possible solutions, please read the following
articles:
[ERROR] [Help 1] http://cwiki.apache.org/confluence/display/MAVEN/MojoExecutionException
[ERROR] 
[ERROR] After correcting the problems, you can resume the build with the command
[ERROR]   mvn <goals> -rf :phoenix-core
Build step 'Invoke top-level Maven targets' marked build as failure
Archiving artifacts
Recording test results

Mime
View raw message