phoenix-commits mailing list archives

Site index · List index
Message view « Date » · « Thread »
Top « Date » · « Thread »
From Apache Jenkins Server <jenk...@builds.apache.org>
Subject Build failed in Jenkins: Phoenix-4.x-HBase-1.2 #1
Date Fri, 12 May 2017 18:32:00 GMT
See <https://builds.apache.org/job/Phoenix-4.x-HBase-1.2/1/display/redirect>

------------------------------------------
[...truncated 73.82 KB...]
Tests run: 6, Failures: 0, Errors: 0, Skipped: 0, Time elapsed: 70.105 sec - in org.apache.phoenix.end2end.index.txn.MutableRollbackIT
Running org.apache.phoenix.end2end.salted.SaltedTableUpsertSelectIT
Tests run: 8, Failures: 0, Errors: 0, Skipped: 0, Time elapsed: 53.245 sec - in org.apache.phoenix.end2end.index.txn.RollbackIT
Running org.apache.phoenix.end2end.salted.SaltedTableVarLengthRowKeyIT
Tests run: 1, Failures: 0, Errors: 0, Skipped: 0, Time elapsed: 2.273 sec - in org.apache.phoenix.end2end.salted.SaltedTableVarLengthRowKeyIT
Running org.apache.phoenix.iterate.PhoenixQueryTimeoutIT
Tests run: 2, Failures: 0, Errors: 0, Skipped: 0, Time elapsed: 4.872 sec - in org.apache.phoenix.iterate.PhoenixQueryTimeoutIT
Running org.apache.phoenix.iterate.RoundRobinResultIteratorIT
Tests run: 6, Failures: 0, Errors: 0, Skipped: 0, Time elapsed: 26.675 sec - in org.apache.phoenix.end2end.salted.SaltedTableUpsertSelectIT
Running org.apache.phoenix.replication.SystemCatalogWALEntryFilterIT
Tests run: 2, Failures: 0, Errors: 0, Skipped: 0, Time elapsed: 0.08 sec - in org.apache.phoenix.replication.SystemCatalogWALEntryFilterIT
Running org.apache.phoenix.rpc.UpdateCacheIT
Tests run: 7, Failures: 0, Errors: 0, Skipped: 0, Time elapsed: 27.125 sec - in org.apache.phoenix.rpc.UpdateCacheIT
Running org.apache.phoenix.trace.PhoenixTableMetricsWriterIT
Tests run: 9, Failures: 0, Errors: 0, Skipped: 0, Time elapsed: 50.589 sec - in org.apache.phoenix.iterate.RoundRobinResultIteratorIT
Running org.apache.phoenix.trace.PhoenixTraceReaderIT
Tests run: 2, Failures: 0, Errors: 0, Skipped: 0, Time elapsed: 4.566 sec - in org.apache.phoenix.trace.PhoenixTableMetricsWriterIT
Running org.apache.phoenix.tx.FlappingTransactionIT
Tests run: 2, Failures: 0, Errors: 0, Skipped: 0, Time elapsed: 4.59 sec - in org.apache.phoenix.trace.PhoenixTraceReaderIT
Running org.apache.phoenix.tx.ParameterizedTransactionIT
Tests run: 4, Failures: 0, Errors: 0, Skipped: 0, Time elapsed: 9.459 sec - in org.apache.phoenix.tx.FlappingTransactionIT
Running org.apache.phoenix.tx.TransactionIT
Tests run: 16, Failures: 0, Errors: 0, Skipped: 0, Time elapsed: 318.921 sec - in org.apache.phoenix.end2end.index.DropColumnIT
Running org.apache.phoenix.tx.TxCheckpointIT
Tests run: 7, Failures: 0, Errors: 0, Skipped: 0, Time elapsed: 54.144 sec - in org.apache.phoenix.tx.TransactionIT
Tests run: 99, Failures: 0, Errors: 0, Skipped: 0, Time elapsed: 1,080.55 sec - in org.apache.phoenix.end2end.HashJoinIT
Tests run: 67, Failures: 0, Errors: 0, Skipped: 0, Time elapsed: 456.401 sec - in org.apache.phoenix.end2end.index.IndexExpressionIT
Tests run: 52, Failures: 0, Errors: 0, Skipped: 4, Time elapsed: 226.414 sec - in org.apache.phoenix.tx.ParameterizedTransactionIT
Tests run: 40, Failures: 0, Errors: 0, Skipped: 0, Time elapsed: 297.05 sec - in org.apache.phoenix.tx.TxCheckpointIT
Tests run: 102, Failures: 0, Errors: 0, Skipped: 0, Time elapsed: 1,106.134 sec - in org.apache.phoenix.end2end.SortMergeJoinIT
Tests run: 80, Failures: 0, Errors: 0, Skipped: 0, Time elapsed: 1,070.378 sec - in org.apache.phoenix.end2end.index.MutableIndexIT
Tests run: 304, Failures: 0, Errors: 0, Skipped: 0, Time elapsed: 2,037.92 sec - in org.apache.phoenix.end2end.index.IndexIT

Results :

Tests run: 2040, Failures: 0, Errors: 0, Skipped: 4

[INFO] 
[INFO] --- maven-failsafe-plugin:2.19.1:integration-test (ClientManagedTimeTests) @ phoenix-core
---

-------------------------------------------------------
 T E S T S
-------------------------------------------------------
Running org.apache.phoenix.end2end.ColumnProjectionOptimizationIT
Running org.apache.phoenix.end2end.CreateSchemaIT
Running org.apache.phoenix.end2end.ArrayIT
Tests run: 1, Failures: 0, Errors: 0, Skipped: 0, Time elapsed: 0.476 sec - in org.apache.phoenix.end2end.CreateSchemaIT
Running org.apache.phoenix.end2end.CreateTableIT
Running org.apache.phoenix.end2end.CustomEntityDataIT
Running org.apache.phoenix.end2end.AggregateQueryIT
Running org.apache.phoenix.end2end.CaseStatementIT
Running org.apache.phoenix.end2end.CastAndCoerceIT
Running org.apache.phoenix.end2end.ClientTimeArithmeticQueryIT
Tests run: 3, Failures: 0, Errors: 0, Skipped: 0, Time elapsed: 5.992 sec - in org.apache.phoenix.end2end.CustomEntityDataIT
Running org.apache.phoenix.end2end.DerivedTableIT
Tests run: 18, Failures: 0, Errors: 0, Skipped: 0, Time elapsed: 17.801 sec - in org.apache.phoenix.end2end.DerivedTableIT
Running org.apache.phoenix.end2end.DistinctCountIT
Tests run: 3, Failures: 0, Errors: 0, Skipped: 0, Time elapsed: 29.089 sec - in org.apache.phoenix.end2end.ColumnProjectionOptimizationIT
Running org.apache.phoenix.end2end.DropSchemaIT
Tests run: 2, Failures: 0, Errors: 0, Skipped: 0, Time elapsed: 12.03 sec - in org.apache.phoenix.end2end.DropSchemaIT
Running org.apache.phoenix.end2end.ExtendedQueryExecIT
Tests run: 10, Failures: 0, Errors: 0, Skipped: 0, Time elapsed: 19.237 sec - in org.apache.phoenix.end2end.DistinctCountIT
Running org.apache.phoenix.end2end.FunkyNamesIT
Tests run: 4, Failures: 0, Errors: 0, Skipped: 0, Time elapsed: 6.83 sec - in org.apache.phoenix.end2end.ExtendedQueryExecIT
Tests run: 3, Failures: 0, Errors: 0, Skipped: 0, Time elapsed: 6.249 sec - in org.apache.phoenix.end2end.FunkyNamesIT
Running org.apache.phoenix.end2end.GroupByIT
Running org.apache.phoenix.end2end.MutableQueryIT
Tests run: 49, Failures: 0, Errors: 0, Skipped: 0, Time elapsed: 84.516 sec - in org.apache.phoenix.end2end.CastAndCoerceIT
Tests run: 80, Failures: 0, Errors: 0, Skipped: 0, Time elapsed: 89.822 sec - in org.apache.phoenix.end2end.ArrayIT
Tests run: 56, Failures: 0, Errors: 0, Skipped: 0, Time elapsed: 86.31 sec - in org.apache.phoenix.end2end.CaseStatementIT
Running org.apache.phoenix.end2end.PointInTimeQueryIT
Running org.apache.phoenix.end2end.NotQueryIT
Running org.apache.phoenix.end2end.NativeHBaseTypesIT
Tests run: 7, Failures: 0, Errors: 0, Skipped: 0, Time elapsed: 4.431 sec - in org.apache.phoenix.end2end.NativeHBaseTypesIT
Running org.apache.phoenix.end2end.ProductMetricsIT
Tests run: 42, Failures: 0, Errors: 0, Skipped: 0, Time elapsed: 100.923 sec - in org.apache.phoenix.end2end.AggregateQueryIT
Running org.apache.phoenix.end2end.QueryDatabaseMetaDataIT
Tests run: 61, Failures: 0, Errors: 0, Skipped: 0, Time elapsed: 24.011 sec - in org.apache.phoenix.end2end.ProductMetricsIT
Tests run: 7, Failures: 0, Errors: 0, Skipped: 0, Time elapsed: 39.589 sec - in org.apache.phoenix.end2end.PointInTimeQueryIT
Running org.apache.phoenix.end2end.QueryIT
Tests run: 245, Failures: 0, Errors: 0, Skipped: 0, Time elapsed: 139.983 sec - in org.apache.phoenix.end2end.ClientTimeArithmeticQueryIT
Tests run: 91, Failures: 0, Errors: 0, Skipped: 0, Time elapsed: 95.746 sec - in org.apache.phoenix.end2end.GroupByIT
Running org.apache.phoenix.end2end.ScanQueryIT
Running org.apache.phoenix.end2end.ReadIsolationLevelIT
Tests run: 18, Failures: 0, Errors: 0, Skipped: 0, Time elapsed: 165.738 sec - in org.apache.phoenix.end2end.CreateTableIT
Running org.apache.phoenix.end2end.SequenceBulkAllocationIT
Tests run: 2, Failures: 0, Errors: 0, Skipped: 0, Time elapsed: 5.892 sec - in org.apache.phoenix.end2end.ReadIsolationLevelIT
Running org.apache.phoenix.end2end.SequenceIT
Running org.apache.phoenix.end2end.RowValueConstructorIT
Tests run: 77, Failures: 0, Errors: 0, Skipped: 0, Time elapsed: 88.358 sec - in org.apache.phoenix.end2end.NotQueryIT
Tests run: 56, Failures: 0, Errors: 0, Skipped: 0, Time elapsed: 28.715 sec - in org.apache.phoenix.end2end.SequenceBulkAllocationIT
Running org.apache.phoenix.end2end.TopNIT
Tests run: 112, Failures: 0, Errors: 0, Skipped: 0, Time elapsed: 63.284 sec - in org.apache.phoenix.end2end.QueryIT
Tests run: 4, Failures: 0, Errors: 0, Skipped: 0, Time elapsed: 6.703 sec - in org.apache.phoenix.end2end.TopNIT
Running org.apache.phoenix.end2end.TruncateFunctionIT
Tests run: 1, Failures: 0, Errors: 0, Skipped: 0, Time elapsed: 4.92 sec - in org.apache.phoenix.end2end.TruncateFunctionIT
Running org.apache.phoenix.end2end.UpsertSelectIT
Tests run: 112, Failures: 0, Errors: 0, Skipped: 0, Time elapsed: 61.798 sec - in org.apache.phoenix.end2end.ScanQueryIT
Running org.apache.phoenix.end2end.ToNumberFunctionIT
Tests run: 54, Failures: 0, Errors: 0, Skipped: 0, Time elapsed: 51.18 sec - in org.apache.phoenix.end2end.SequenceIT
Running org.apache.phoenix.end2end.salted.SaltedTableIT
Tests run: 18, Failures: 0, Errors: 0, Skipped: 0, Time elapsed: 8.106 sec - in org.apache.phoenix.end2end.ToNumberFunctionIT
Running org.apache.phoenix.rpc.UpdateCacheWithScnIT
Tests run: 8, Failures: 0, Errors: 0, Skipped: 0, Time elapsed: 6.819 sec - in org.apache.phoenix.end2end.salted.SaltedTableIT
Tests run: 1, Failures: 0, Errors: 0, Skipped: 0, Time elapsed: 6.186 sec - in org.apache.phoenix.rpc.UpdateCacheWithScnIT
Running org.apache.phoenix.end2end.UpsertValuesIT
Tests run: 19, Failures: 0, Errors: 0, Skipped: 0, Time elapsed: 129.64 sec - in org.apache.phoenix.end2end.QueryDatabaseMetaDataIT
Tests run: 112, Failures: 0, Errors: 0, Skipped: 0, Time elapsed: 180.18 sec - in org.apache.phoenix.end2end.MutableQueryIT
Running org.apache.phoenix.end2end.VariableLengthPKIT
Tests run: 50, Failures: 0, Errors: 0, Skipped: 0, Time elapsed: 41.419 sec - in org.apache.phoenix.end2end.VariableLengthPKIT
Tests run: 46, Failures: 0, Errors: 0, Skipped: 0, Time elapsed: 118.718 sec - in org.apache.phoenix.end2end.RowValueConstructorIT
Tests run: 24, Failures: 0, Errors: 0, Skipped: 0, Time elapsed: 135.959 sec - in org.apache.phoenix.end2end.UpsertSelectIT
Tests run: 25, Failures: 0, Errors: 0, Skipped: 0, Time elapsed: 119.121 sec - in org.apache.phoenix.end2end.UpsertValuesIT

Results :

Tests run: 1421, Failures: 0, Errors: 0, Skipped: 0

[INFO] 
[INFO] --- maven-failsafe-plugin:2.19.1:integration-test (HBaseManagedTimeTests) @ phoenix-core
---

-------------------------------------------------------
 T E S T S
-------------------------------------------------------

Results :

Tests run: 0, Failures: 0, Errors: 0, Skipped: 0

[INFO] 
[INFO] --- maven-failsafe-plugin:2.19.1:integration-test (NeedTheirOwnClusterTests) @ phoenix-core
---

-------------------------------------------------------
 T E S T S
-------------------------------------------------------
Running org.apache.hadoop.hbase.regionserver.wal.WALReplayWithIndexWritesAndCompressedWALIT
Running org.apache.phoenix.end2end.ConnectionUtilIT
Tests run: 1, Failures: 0, Errors: 0, Skipped: 0, Time elapsed: 28.441 sec - in org.apache.hadoop.hbase.regionserver.wal.WALReplayWithIndexWritesAndCompressedWALIT
Running org.apache.phoenix.end2end.CsvBulkLoadToolIT
Running org.apache.phoenix.end2end.CountDistinctCompressionIT
Running org.apache.phoenix.end2end.ContextClassloaderIT
Running org.apache.phoenix.end2end.FlappingLocalIndexIT
Tests run: 1, Failures: 0, Errors: 0, Skipped: 0, Time elapsed: 28.486 sec - in org.apache.phoenix.end2end.ConnectionUtilIT
Tests run: 3, Failures: 0, Errors: 0, Skipped: 0, Time elapsed: 5.483 sec - in org.apache.phoenix.end2end.ContextClassloaderIT
Tests run: 1, Failures: 0, Errors: 0, Skipped: 0, Time elapsed: 7.127 sec - in org.apache.phoenix.end2end.CountDistinctCompressionIT
Running org.apache.phoenix.end2end.IndexExtendedIT
Running org.apache.phoenix.end2end.IndexToolForPartialBuildIT
Running org.apache.phoenix.end2end.IndexToolForPartialBuildWithNamespaceEnabledIT
Tests run: 2, Failures: 0, Errors: 0, Skipped: 0, Time elapsed: 27.186 sec - in org.apache.phoenix.end2end.IndexToolForPartialBuildIT
Running org.apache.phoenix.end2end.QueryTimeoutIT
Running org.apache.phoenix.end2end.QueryWithLimitIT
Tests run: 2, Failures: 0, Errors: 0, Skipped: 0, Time elapsed: 27.399 sec - in org.apache.phoenix.end2end.IndexToolForPartialBuildWithNamespaceEnabledIT
Running org.apache.phoenix.end2end.RegexBulkLoadToolIT
Tests run: 2, Failures: 0, Errors: 0, Skipped: 0, Time elapsed: 8.361 sec - in org.apache.phoenix.end2end.QueryWithLimitIT
Tests run: 2, Failures: 0, Errors: 0, Skipped: 0, Time elapsed: 18.091 sec - in org.apache.phoenix.end2end.QueryTimeoutIT
Running org.apache.phoenix.end2end.RenewLeaseIT
Tests run: 11, Failures: 0, Errors: 0, Skipped: 0, Time elapsed: 79.177 sec - in org.apache.phoenix.end2end.CsvBulkLoadToolIT
Tests run: 8, Failures: 0, Errors: 0, Skipped: 0, Time elapsed: 87.02 sec - in org.apache.phoenix.end2end.FlappingLocalIndexIT
Running org.apache.phoenix.end2end.SpillableGroupByIT
Running org.apache.phoenix.end2end.StatsCollectorIT
Running org.apache.phoenix.end2end.SysTableNamespaceMappedStatsCollectorIT
Tests run: 1, Failures: 0, Errors: 0, Skipped: 0, Time elapsed: 37.038 sec - in org.apache.phoenix.end2end.RenewLeaseIT
Tests run: 2, Failures: 0, Errors: 0, Skipped: 0, Time elapsed: 17.995 sec - in org.apache.phoenix.end2end.SpillableGroupByIT
Running org.apache.phoenix.end2end.UserDefinedFunctionsIT
Tests run: 10, Failures: 0, Errors: 0, Skipped: 0, Time elapsed: 78.524 sec - in org.apache.phoenix.end2end.RegexBulkLoadToolIT
Running org.apache.phoenix.end2end.index.ImmutableIndexIT
Running org.apache.phoenix.end2end.index.MutableIndexFailureIT
Running org.apache.phoenix.end2end.index.LocalIndexIT
Running org.apache.phoenix.end2end.index.MutableIndexReplicationIT
Tests run: 14, Failures: 0, Errors: 0, Skipped: 0, Time elapsed: 54.609 sec - in org.apache.phoenix.end2end.UserDefinedFunctionsIT
Tests run: 1, Failures: 0, Errors: 0, Skipped: 0, Time elapsed: 26.465 sec - in org.apache.phoenix.end2end.index.MutableIndexReplicationIT
Running org.apache.phoenix.end2end.index.txn.TxWriteFailureIT
Running org.apache.phoenix.execute.PartialCommitIT
Tests run: 12, Failures: 0, Errors: 0, Skipped: 0, Time elapsed: 11.208 sec - in org.apache.phoenix.execute.PartialCommitIT
Running org.apache.phoenix.hbase.index.FailForUnsupportedHBaseVersionsIT
Tests run: 2, Failures: 0, Errors: 0, Skipped: 0, Time elapsed: 18.736 sec - in org.apache.phoenix.hbase.index.FailForUnsupportedHBaseVersionsIT
Tests run: 80, Failures: 0, Errors: 0, Skipped: 0, Time elapsed: 270.671 sec - in org.apache.phoenix.end2end.IndexExtendedIT
Tests run: 11, Failures: 0, Errors: 0, Skipped: 0, Time elapsed: 142.571 sec - in org.apache.phoenix.end2end.index.MutableIndexFailureIT
Running org.apache.phoenix.hbase.index.covered.EndToEndCoveredColumnsIndexBuilderIT
Tests run: 8, Failures: 0, Errors: 0, Skipped: 0, Time elapsed: 67.461 sec - in org.apache.phoenix.end2end.index.txn.TxWriteFailureIT
Running org.apache.phoenix.hbase.index.covered.example.FailWithoutRetriesIT
Tests run: 2, Failures: 0, Errors: 0, Skipped: 0, Time elapsed: 18.469 sec - in org.apache.phoenix.hbase.index.covered.EndToEndCoveredColumnsIndexBuilderIT
Running org.apache.phoenix.hbase.index.covered.example.EndToEndCoveredIndexingIT
Tests run: 1, Failures: 0, Errors: 0, Skipped: 0, Time elapsed: 8.083 sec - in org.apache.phoenix.hbase.index.covered.example.FailWithoutRetriesIT
Running org.apache.phoenix.hbase.index.covered.example.EndtoEndIndexingWithCompressionIT
Running org.apache.phoenix.iterate.RoundRobinResultIteratorWithStatsIT
Running org.apache.phoenix.iterate.ScannerLeaseRenewalIT
Tests run: 1, Failures: 0, Errors: 0, Skipped: 0, Time elapsed: 16.667 sec - in org.apache.phoenix.iterate.RoundRobinResultIteratorWithStatsIT
Running org.apache.phoenix.monitoring.PhoenixMetricsIT
Tests run: 120, Failures: 0, Errors: 0, Skipped: 24, Time elapsed: 295.979 sec - in org.apache.phoenix.end2end.StatsCollectorIT
Tests run: 120, Failures: 0, Errors: 0, Skipped: 24, Time elapsed: 295.436 sec - in org.apache.phoenix.end2end.SysTableNamespaceMappedStatsCollectorIT
Running org.apache.phoenix.rpc.PhoenixClientRpcIT
Tests run: 30, Failures: 0, Errors: 0, Skipped: 0, Time elapsed: 281.503 sec - in org.apache.phoenix.end2end.index.LocalIndexIT
Running org.apache.phoenix.rpc.PhoenixServerRpcIT
Tests run: 2, Failures: 0, Errors: 0, Skipped: 0, Time elapsed: 12.15 sec - in org.apache.phoenix.rpc.PhoenixClientRpcIT
Tests run: 24, Failures: 0, Errors: 0, Skipped: 0, Time elapsed: 313.664 sec - in org.apache.phoenix.end2end.index.ImmutableIndexIT
Tests run: 2, Failures: 0, Errors: 0, Skipped: 0, Time elapsed: 22.189 sec - in org.apache.phoenix.rpc.PhoenixServerRpcIT
Tests run: 11, Failures: 0, Errors: 0, Skipped: 0, Time elapsed: 138.62 sec - in org.apache.phoenix.hbase.index.covered.example.EndToEndCoveredIndexingIT
Tests run: 11, Failures: 0, Errors: 0, Skipped: 0, Time elapsed: 138.528 sec - in org.apache.phoenix.hbase.index.covered.example.EndtoEndIndexingWithCompressionIT
Tests run: 21, Failures: 0, Errors: 0, Skipped: 0, Time elapsed: 70.193 sec - in org.apache.phoenix.monitoring.PhoenixMetricsIT
Tests run: 2, Failures: 0, Errors: 0, Skipped: 0, Time elapsed: 167.267 sec - in org.apache.phoenix.iterate.ScannerLeaseRenewalIT

Results :

Tests run: 521, Failures: 0, Errors: 0, Skipped: 48

[INFO] 
[INFO] --- maven-failsafe-plugin:2.19.1:verify (ParallelStatsEnabledTest) @ phoenix-core ---
[INFO] ------------------------------------------------------------------------
[INFO] Reactor Summary:
[INFO] 
[INFO] Apache Phoenix ..................................... SUCCESS [  2.136 s]
[INFO] Phoenix Core ....................................... FAILURE [  01:13 h]
[INFO] Phoenix - Flume .................................... SKIPPED
[INFO] Phoenix - Kafka .................................... SKIPPED
[INFO] Phoenix - Pig ...................................... SKIPPED
[INFO] Phoenix Query Server Client ........................ SKIPPED
[INFO] Phoenix Query Server ............................... SKIPPED
[INFO] Phoenix - Pherf .................................... SKIPPED
[INFO] Phoenix - Spark .................................... SKIPPED
[INFO] Phoenix - Hive ..................................... SKIPPED
[INFO] Phoenix Client ..................................... SKIPPED
[INFO] Phoenix Server ..................................... SKIPPED
[INFO] Phoenix Assembly ................................... SKIPPED
[INFO] Phoenix - Tracing Web Application .................. SKIPPED
[INFO] ------------------------------------------------------------------------
[INFO] BUILD FAILURE
[INFO] ------------------------------------------------------------------------
[INFO] Total time: 01:13 h
[INFO] Finished at: 2017-05-12T18:29:38+00:00
[INFO] Final Memory: 62M/1595M
[INFO] ------------------------------------------------------------------------
[ERROR] Failed to execute goal org.apache.maven.plugins:maven-failsafe-plugin:2.19.1:verify
(ParallelStatsEnabledTest) on project phoenix-core: There are test failures.
[ERROR] 
[ERROR] Please refer to <https://builds.apache.org/job/Phoenix-4.x-HBase-1.2/ws/phoenix-core/target/failsafe-reports>
for the individual test results.
[ERROR] -> [Help 1]
[ERROR] 
[ERROR] To see the full stack trace of the errors, re-run Maven with the -e switch.
[ERROR] Re-run Maven using the -X switch to enable full debug logging.
[ERROR] 
[ERROR] For more information about the errors and possible solutions, please read the following
articles:
[ERROR] [Help 1] http://cwiki.apache.org/confluence/display/MAVEN/MojoFailureException
[ERROR] 
[ERROR] After correcting the problems, you can resume the build with the command
[ERROR]   mvn <goals> -rf :phoenix-core
Build step 'Invoke top-level Maven targets' marked build as failure
Archiving artifacts
No prior successful build to compare, so performing full copy of artifacts
Recording test results

Mime
View raw message