phoenix-commits mailing list archives

Site index · List index
Message view « Date » · « Thread »
Top « Date » · « Thread »
From Apache Jenkins Server <jenk...@builds.apache.org>
Subject Build failed in Jenkins: Phoenix | 4.x-HBase-0.98 #1496
Date Wed, 17 May 2017 00:33:41 GMT
See <https://builds.apache.org/job/Phoenix-4.x-HBase-0.98/1496/display/redirect?page=changes>

Changes:

[jamestaylor] PHOENIX-3796 LocalIndexes apply the entire batch for each mutation in a

[jamestaylor] PHOENIX-3855 Separate MutableIndexIT into multiple test classes

------------------------------------------
[...truncated 73.54 KB...]
Running org.apache.phoenix.rpc.UpdateCacheIT
Running org.apache.phoenix.end2end.salted.SaltedTableVarLengthRowKeyIT
Tests run: 1, Failures: 0, Errors: 0, Skipped: 0, Time elapsed: 0.804 sec - in org.apache.phoenix.end2end.salted.SaltedTableVarLengthRowKeyIT
Running org.apache.phoenix.trace.PhoenixTableMetricsWriterIT
Tests run: 2, Failures: 0, Errors: 0, Skipped: 0, Time elapsed: 2.83 sec - in org.apache.phoenix.trace.PhoenixTableMetricsWriterIT
Running org.apache.phoenix.trace.PhoenixTraceReaderIT
Tests run: 7, Failures: 0, Errors: 0, Skipped: 0, Time elapsed: 17.269 sec - in org.apache.phoenix.rpc.UpdateCacheIT
Running org.apache.phoenix.trace.PhoenixTracingEndToEndIT
Tests run: 2, Failures: 0, Errors: 0, Skipped: 0, Time elapsed: 2.652 sec - in org.apache.phoenix.trace.PhoenixTraceReaderIT
Running org.apache.phoenix.tx.FlappingTransactionIT
Tests run: 4, Failures: 0, Errors: 0, Skipped: 0, Time elapsed: 6.675 sec - in org.apache.phoenix.tx.FlappingTransactionIT
Running org.apache.phoenix.tx.ParameterizedTransactionIT
Tests run: 9, Failures: 0, Errors: 0, Skipped: 0, Time elapsed: 36.342 sec - in org.apache.phoenix.iterate.RoundRobinResultIteratorIT
Running org.apache.phoenix.tx.TransactionIT
Tests run: 7, Failures: 0, Errors: 0, Skipped: 0, Time elapsed: 29.688 sec - in org.apache.phoenix.tx.TransactionIT
Running org.apache.phoenix.tx.TxCheckpointIT
Tests run: 6, Failures: 0, Errors: 1, Skipped: 0, Time elapsed: 90.722 sec <<< FAILURE!
- in org.apache.phoenix.trace.PhoenixTracingEndToEndIT
testScanTracingOnServer(org.apache.phoenix.trace.PhoenixTracingEndToEndIT)  Time elapsed:
19.818 sec  <<< ERROR!
org.apache.phoenix.exception.PhoenixIOException: callTimeout=1200000, callDuration=9000101:
row '  TRACING_T000888' on table 'SYSTEM.CATALOG' at region=SYSTEM.CATALOG,,1494978628652.bb45a686504e4d09b09e645918009183.,
hostname=asf921.gq1.ygridcore.net,41350,1494978619560, seqNum=1
	at org.apache.phoenix.trace.PhoenixTracingEndToEndIT.checkStoredTraces(PhoenixTracingEndToEndIT.java:466)
	at org.apache.phoenix.trace.PhoenixTracingEndToEndIT.testScanTracingOnServer(PhoenixTracingEndToEndIT.java:341)
Caused by: java.net.SocketTimeoutException: callTimeout=1200000, callDuration=9000101: row
'  TRACING_T000888' on table 'SYSTEM.CATALOG' at region=SYSTEM.CATALOG,,1494978628652.bb45a686504e4d09b09e645918009183.,
hostname=asf921.gq1.ygridcore.net,41350,1494978619560, seqNum=1
Caused by: java.io.IOException: Call to asf921.gq1.ygridcore.net/67.195.81.141:41350 failed
on local exception: java.io.IOException: Call 3540 not added as the connection asf921.gq1.ygridcore.net/67.195.81.141:41350/ClientService/jenkins
(auth:SIMPLE)/1200000 is closing
Caused by: java.io.IOException: Call 3540 not added as the connection asf921.gq1.ygridcore.net/67.195.81.141:41350/ClientService/jenkins
(auth:SIMPLE)/1200000 is closing

Tests run: 64, Failures: 0, Errors: 0, Skipped: 0, Time elapsed: 447.988 sec - in org.apache.phoenix.end2end.index.MutableIndexIT
Tests run: 52, Failures: 0, Errors: 0, Skipped: 4, Time elapsed: 138.853 sec - in org.apache.phoenix.tx.ParameterizedTransactionIT
Tests run: 40, Failures: 0, Errors: 0, Skipped: 0, Time elapsed: 199.864 sec - in org.apache.phoenix.tx.TxCheckpointIT
Tests run: 304, Failures: 0, Errors: 0, Skipped: 0, Time elapsed: 1,449.4 sec - in org.apache.phoenix.end2end.index.IndexIT

Results :

Tests in error: 
  PhoenixTracingEndToEndIT.testScanTracingOnServer:341->checkStoredTraces:466 ยป PhoenixIO

Tests run: 2028, Failures: 0, Errors: 1, Skipped: 4

[INFO] 
[INFO] --- maven-failsafe-plugin:2.19.1:integration-test (ClientManagedTimeTests) @ phoenix-core
---

-------------------------------------------------------
 T E S T S
-------------------------------------------------------
Running org.apache.phoenix.end2end.ArrayIT
Running org.apache.phoenix.end2end.AggregateQueryIT
Running org.apache.phoenix.end2end.CastAndCoerceIT
Running org.apache.phoenix.end2end.ClientTimeArithmeticQueryIT
Running org.apache.phoenix.end2end.CaseStatementIT
Tests run: 80, Failures: 0, Errors: 0, Skipped: 0, Time elapsed: 58.225 sec - in org.apache.phoenix.end2end.ArrayIT
Running org.apache.phoenix.end2end.ColumnProjectionOptimizationIT
Tests run: 49, Failures: 0, Errors: 0, Skipped: 0, Time elapsed: 58.323 sec - in org.apache.phoenix.end2end.CastAndCoerceIT
Running org.apache.phoenix.end2end.CreateSchemaIT
Tests run: 1, Failures: 0, Errors: 0, Skipped: 0, Time elapsed: 0.25 sec - in org.apache.phoenix.end2end.CreateSchemaIT
Running org.apache.phoenix.end2end.CreateTableIT
Tests run: 56, Failures: 0, Errors: 0, Skipped: 0, Time elapsed: 58.755 sec - in org.apache.phoenix.end2end.CaseStatementIT
Running org.apache.phoenix.end2end.CustomEntityDataIT
Tests run: 3, Failures: 0, Errors: 0, Skipped: 0, Time elapsed: 3.703 sec - in org.apache.phoenix.end2end.CustomEntityDataIT
Running org.apache.phoenix.end2end.DerivedTableIT
Tests run: 42, Failures: 0, Errors: 0, Skipped: 0, Time elapsed: 76.418 sec - in org.apache.phoenix.end2end.AggregateQueryIT
Running org.apache.phoenix.end2end.DistinctCountIT
Tests run: 3, Failures: 0, Errors: 0, Skipped: 0, Time elapsed: 18.62 sec - in org.apache.phoenix.end2end.ColumnProjectionOptimizationIT
Running org.apache.phoenix.end2end.DropSchemaIT
Tests run: 18, Failures: 0, Errors: 0, Skipped: 0, Time elapsed: 12.687 sec - in org.apache.phoenix.end2end.DerivedTableIT
Running org.apache.phoenix.end2end.ExtendedQueryExecIT
Tests run: 2, Failures: 0, Errors: 0, Skipped: 0, Time elapsed: 5.518 sec - in org.apache.phoenix.end2end.DropSchemaIT
Running org.apache.phoenix.end2end.FunkyNamesIT
Tests run: 4, Failures: 0, Errors: 0, Skipped: 0, Time elapsed: 4.066 sec - in org.apache.phoenix.end2end.ExtendedQueryExecIT
Tests run: 3, Failures: 0, Errors: 0, Skipped: 0, Time elapsed: 3.701 sec - in org.apache.phoenix.end2end.FunkyNamesIT
Running org.apache.phoenix.end2end.GroupByIT
Tests run: 10, Failures: 0, Errors: 0, Skipped: 0, Time elapsed: 11.87 sec - in org.apache.phoenix.end2end.DistinctCountIT
Running org.apache.phoenix.end2end.MutableQueryIT
Running org.apache.phoenix.end2end.NativeHBaseTypesIT
Tests run: 7, Failures: 0, Errors: 0, Skipped: 0, Time elapsed: 2.937 sec - in org.apache.phoenix.end2end.NativeHBaseTypesIT
Running org.apache.phoenix.end2end.NotQueryIT
Tests run: 245, Failures: 0, Errors: 0, Skipped: 0, Time elapsed: 132.569 sec - in org.apache.phoenix.end2end.ClientTimeArithmeticQueryIT
Tests run: 18, Failures: 0, Errors: 0, Skipped: 0, Time elapsed: 76.523 sec - in org.apache.phoenix.end2end.CreateTableIT
Running org.apache.phoenix.end2end.PointInTimeQueryIT
Tests run: 91, Failures: 0, Errors: 0, Skipped: 0, Time elapsed: 56.643 sec - in org.apache.phoenix.end2end.GroupByIT
Tests run: 77, Failures: 0, Errors: 0, Skipped: 0, Time elapsed: 45.022 sec - in org.apache.phoenix.end2end.NotQueryIT
Running org.apache.phoenix.end2end.QueryDatabaseMetaDataIT
Tests run: 7, Failures: 0, Errors: 0, Skipped: 0, Time elapsed: 20.951 sec - in org.apache.phoenix.end2end.PointInTimeQueryIT
Running org.apache.phoenix.end2end.ReadIsolationLevelIT
Running org.apache.phoenix.end2end.ProductMetricsIT
Tests run: 2, Failures: 0, Errors: 0, Skipped: 0, Time elapsed: 3.452 sec - in org.apache.phoenix.end2end.ReadIsolationLevelIT
Running org.apache.phoenix.end2end.RowValueConstructorIT
Running org.apache.phoenix.end2end.QueryIT
Tests run: 61, Failures: 0, Errors: 0, Skipped: 0, Time elapsed: 21.864 sec - in org.apache.phoenix.end2end.ProductMetricsIT
Running org.apache.phoenix.end2end.ScanQueryIT
Tests run: 112, Failures: 0, Errors: 0, Skipped: 0, Time elapsed: 125.831 sec - in org.apache.phoenix.end2end.MutableQueryIT
Tests run: 112, Failures: 0, Errors: 0, Skipped: 0, Time elapsed: 47.165 sec - in org.apache.phoenix.end2end.QueryIT
Running org.apache.phoenix.end2end.SequenceIT
Tests run: 19, Failures: 0, Errors: 0, Skipped: 0, Time elapsed: 81.793 sec - in org.apache.phoenix.end2end.QueryDatabaseMetaDataIT
Tests run: 46, Failures: 0, Errors: 0, Skipped: 0, Time elapsed: 66.61 sec - in org.apache.phoenix.end2end.RowValueConstructorIT
Running org.apache.phoenix.end2end.ToNumberFunctionIT
Tests run: 112, Failures: 0, Errors: 0, Skipped: 0, Time elapsed: 48.375 sec - in org.apache.phoenix.end2end.ScanQueryIT
Tests run: 18, Failures: 0, Errors: 0, Skipped: 0, Time elapsed: 8.419 sec - in org.apache.phoenix.end2end.ToNumberFunctionIT
Running org.apache.phoenix.end2end.UpsertSelectIT
Running org.apache.phoenix.end2end.SequenceBulkAllocationIT
Running org.apache.phoenix.end2end.TopNIT
Tests run: 54, Failures: 0, Errors: 0, Skipped: 0, Time elapsed: 29.118 sec - in org.apache.phoenix.end2end.SequenceIT
Tests run: 4, Failures: 0, Errors: 0, Skipped: 0, Time elapsed: 3.668 sec - in org.apache.phoenix.end2end.TopNIT
Running org.apache.phoenix.end2end.UpsertValuesIT
Running org.apache.phoenix.end2end.TruncateFunctionIT
Tests run: 56, Failures: 0, Errors: 0, Skipped: 0, Time elapsed: 14.993 sec - in org.apache.phoenix.end2end.SequenceBulkAllocationIT
Running org.apache.phoenix.end2end.salted.SaltedTableIT
Tests run: 1, Failures: 0, Errors: 0, Skipped: 0, Time elapsed: 3.041 sec - in org.apache.phoenix.end2end.TruncateFunctionIT
Running org.apache.phoenix.rpc.UpdateCacheWithScnIT
Tests run: 8, Failures: 0, Errors: 0, Skipped: 0, Time elapsed: 4.269 sec - in org.apache.phoenix.end2end.salted.SaltedTableIT
Tests run: 1, Failures: 0, Errors: 0, Skipped: 0, Time elapsed: 3.274 sec - in org.apache.phoenix.rpc.UpdateCacheWithScnIT
Running org.apache.phoenix.end2end.VariableLengthPKIT
Tests run: 22, Failures: 0, Errors: 0, Skipped: 0, Time elapsed: 72.965 sec - in org.apache.phoenix.end2end.UpsertSelectIT
Tests run: 50, Failures: 0, Errors: 0, Skipped: 0, Time elapsed: 33.938 sec - in org.apache.phoenix.end2end.VariableLengthPKIT
Tests run: 25, Failures: 0, Errors: 0, Skipped: 0, Time elapsed: 59.091 sec - in org.apache.phoenix.end2end.UpsertValuesIT

Results :

Tests run: 1419, Failures: 0, Errors: 0, Skipped: 0

[INFO] 
[INFO] --- maven-failsafe-plugin:2.19.1:integration-test (HBaseManagedTimeTests) @ phoenix-core
---

-------------------------------------------------------
 T E S T S
-------------------------------------------------------

Results :

Tests run: 0, Failures: 0, Errors: 0, Skipped: 0

[INFO] 
[INFO] --- maven-failsafe-plugin:2.19.1:integration-test (NeedTheirOwnClusterTests) @ phoenix-core
---

-------------------------------------------------------
 T E S T S
-------------------------------------------------------
Running org.apache.hadoop.hbase.regionserver.wal.WALReplayWithIndexWritesAndCompressedWALIT
Running org.apache.phoenix.end2end.ConnectionUtilIT
Tests run: 1, Failures: 0, Errors: 0, Skipped: 0, Time elapsed: 17.326 sec - in org.apache.hadoop.hbase.regionserver.wal.WALReplayWithIndexWritesAndCompressedWALIT
Running org.apache.phoenix.end2end.CountDistinctCompressionIT
Running org.apache.phoenix.end2end.ContextClassloaderIT
Running org.apache.phoenix.end2end.CsvBulkLoadToolIT
Tests run: 1, Failures: 0, Errors: 0, Skipped: 0, Time elapsed: 12.099 sec - in org.apache.phoenix.end2end.CountDistinctCompressionIT
Tests run: 3, Failures: 0, Errors: 0, Skipped: 0, Time elapsed: 12.027 sec - in org.apache.phoenix.end2end.ContextClassloaderIT
Tests run: 1, Failures: 0, Errors: 0, Skipped: 0, Time elapsed: 28.251 sec - in org.apache.phoenix.end2end.ConnectionUtilIT
Running org.apache.phoenix.end2end.FlappingLocalIndexIT
Running org.apache.phoenix.end2end.IndexExtendedIT
Running org.apache.phoenix.end2end.IndexToolForPartialBuildIT
Running org.apache.phoenix.end2end.IndexToolForPartialBuildWithNamespaceEnabledIT
Tests run: 2, Failures: 0, Errors: 0, Skipped: 0, Time elapsed: 21.328 sec - in org.apache.phoenix.end2end.IndexToolForPartialBuildWithNamespaceEnabledIT
Tests run: 2, Failures: 0, Errors: 0, Skipped: 0, Time elapsed: 22.332 sec - in org.apache.phoenix.end2end.IndexToolForPartialBuildIT
Tests run: 11, Failures: 0, Errors: 0, Skipped: 0, Time elapsed: 71.875 sec - in org.apache.phoenix.end2end.CsvBulkLoadToolIT
Tests run: 40, Failures: 0, Errors: 0, Skipped: 16, Time elapsed: 51.448 sec - in org.apache.phoenix.end2end.IndexExtendedIT
Tests run: 8, Failures: 0, Errors: 0, Skipped: 0, Time elapsed: 64.326 sec - in org.apache.phoenix.end2end.FlappingLocalIndexIT
Running org.apache.phoenix.end2end.QueryTimeoutIT
Running org.apache.phoenix.end2end.QueryWithLimitIT
Running org.apache.phoenix.end2end.RegexBulkLoadToolIT
Tests run: 2, Failures: 0, Errors: 0, Skipped: 0, Time elapsed: 4.402 sec - in org.apache.phoenix.end2end.QueryWithLimitIT
Tests run: 2, Failures: 0, Errors: 0, Skipped: 0, Time elapsed: 12.043 sec - in org.apache.phoenix.end2end.QueryTimeoutIT
Running org.apache.phoenix.end2end.RenewLeaseIT
Running org.apache.phoenix.end2end.SpillableGroupByIT
Running org.apache.phoenix.end2end.StatsCollectorIT
Running org.apache.phoenix.end2end.SysTableNamespaceMappedStatsCollectorIT
Tests run: 2, Failures: 0, Errors: 0, Skipped: 0, Time elapsed: 13.101 sec - in org.apache.phoenix.end2end.SpillableGroupByIT
Tests run: 1, Failures: 0, Errors: 0, Skipped: 0, Time elapsed: 33.56 sec - in org.apache.phoenix.end2end.RenewLeaseIT
Tests run: 10, Failures: 0, Errors: 0, Skipped: 0, Time elapsed: 65.651 sec - in org.apache.phoenix.end2end.RegexBulkLoadToolIT
Running org.apache.phoenix.end2end.UserDefinedFunctionsIT
Running org.apache.phoenix.end2end.index.ImmutableIndexIT
Running org.apache.phoenix.end2end.index.LocalIndexIT
Tests run: 14, Failures: 0, Errors: 0, Skipped: 0, Time elapsed: 31.155 sec - in org.apache.phoenix.end2end.UserDefinedFunctionsIT
Running org.apache.phoenix.end2end.index.MutableIndexFailureIT
Tests run: 1, Failures: 0, Errors: 0, Skipped: 1, Time elapsed: 0.001 sec - in org.apache.phoenix.end2end.index.MutableIndexFailureIT
Running org.apache.phoenix.end2end.index.MutableIndexReplicationIT
Tests run: 1, Failures: 0, Errors: 0, Skipped: 0, Time elapsed: 17.48 sec - in org.apache.phoenix.end2end.index.MutableIndexReplicationIT
Running org.apache.phoenix.end2end.index.txn.TxWriteFailureIT
Tests run: 120, Failures: 0, Errors: 0, Skipped: 24, Time elapsed: 185.451 sec - in org.apache.phoenix.end2end.StatsCollectorIT
Tests run: 120, Failures: 0, Errors: 0, Skipped: 24, Time elapsed: 186.393 sec - in org.apache.phoenix.end2end.SysTableNamespaceMappedStatsCollectorIT
Running org.apache.phoenix.hbase.index.FailForUnsupportedHBaseVersionsIT
Tests run: 2, Failures: 0, Errors: 0, Skipped: 0, Time elapsed: 19.309 sec - in org.apache.phoenix.hbase.index.FailForUnsupportedHBaseVersionsIT
Tests run: 8, Failures: 0, Errors: 0, Skipped: 0, Time elapsed: 51.993 sec - in org.apache.phoenix.end2end.index.txn.TxWriteFailureIT
Running org.apache.phoenix.execute.PartialCommitIT
Running org.apache.phoenix.hbase.index.covered.EndToEndCoveredColumnsIndexBuilderIT
Tests run: 12, Failures: 0, Errors: 0, Skipped: 0, Time elapsed: 4.319 sec - in org.apache.phoenix.execute.PartialCommitIT
Tests run: 2, Failures: 0, Errors: 0, Skipped: 0, Time elapsed: 7.756 sec - in org.apache.phoenix.hbase.index.covered.EndToEndCoveredColumnsIndexBuilderIT
Running org.apache.phoenix.hbase.index.covered.example.FailWithoutRetriesIT
Running org.apache.phoenix.hbase.index.covered.example.EndToEndCoveredIndexingIT
Tests run: 1, Failures: 0, Errors: 0, Skipped: 0, Time elapsed: 7.939 sec - in org.apache.phoenix.hbase.index.covered.example.FailWithoutRetriesIT
Running org.apache.phoenix.hbase.index.covered.example.EndtoEndIndexingWithCompressionIT
Running org.apache.phoenix.iterate.RoundRobinResultIteratorWithStatsIT
Tests run: 30, Failures: 0, Errors: 0, Skipped: 0, Time elapsed: 231.243 sec - in org.apache.phoenix.end2end.index.LocalIndexIT
Tests run: 1, Failures: 0, Errors: 0, Skipped: 0, Time elapsed: 12.331 sec - in org.apache.phoenix.iterate.RoundRobinResultIteratorWithStatsIT
Tests run: 11, Failures: 0, Errors: 0, Skipped: 0, Time elapsed: 61.775 sec - in org.apache.phoenix.hbase.index.covered.example.EndToEndCoveredIndexingIT
Running org.apache.phoenix.iterate.ScannerLeaseRenewalIT
Tests run: 11, Failures: 0, Errors: 0, Skipped: 0, Time elapsed: 63.02 sec - in org.apache.phoenix.hbase.index.covered.example.EndtoEndIndexingWithCompressionIT
Tests run: 24, Failures: 0, Errors: 0, Skipped: 0, Time elapsed: 263.44 sec - in org.apache.phoenix.end2end.index.ImmutableIndexIT
Running org.apache.phoenix.monitoring.PhoenixMetricsIT
Running org.apache.phoenix.rpc.PhoenixClientRpcIT
Running org.apache.phoenix.rpc.PhoenixServerRpcIT
Tests run: 2, Failures: 0, Errors: 0, Skipped: 0, Time elapsed: 5.003 sec - in org.apache.phoenix.rpc.PhoenixClientRpcIT
Tests run: 2, Failures: 0, Errors: 0, Skipped: 0, Time elapsed: 15.37 sec - in org.apache.phoenix.rpc.PhoenixServerRpcIT
Tests run: 21, Failures: 0, Errors: 0, Skipped: 0, Time elapsed: 46.879 sec - in org.apache.phoenix.monitoring.PhoenixMetricsIT
Tests run: 2, Failures: 0, Errors: 0, Skipped: 0, Time elapsed: 162.667 sec - in org.apache.phoenix.iterate.ScannerLeaseRenewalIT

Results :

Tests run: 471, Failures: 0, Errors: 0, Skipped: 65

[INFO] 
[INFO] --- maven-failsafe-plugin:2.19.1:verify (ParallelStatsEnabledTest) @ phoenix-core ---
[INFO] ------------------------------------------------------------------------
[INFO] Reactor Summary:
[INFO] 
[INFO] Apache Phoenix ..................................... SUCCESS [  3.116 s]
[INFO] Phoenix Core ....................................... FAILURE [  01:05 h]
[INFO] Phoenix - Flume .................................... SKIPPED
[INFO] Phoenix - Kafka .................................... SKIPPED
[INFO] Phoenix - Pig ...................................... SKIPPED
[INFO] Phoenix Query Server Client ........................ SKIPPED
[INFO] Phoenix Query Server ............................... SKIPPED
[INFO] Phoenix - Pherf .................................... SKIPPED
[INFO] Phoenix - Spark .................................... SKIPPED
[INFO] Phoenix - Hive ..................................... SKIPPED
[INFO] Phoenix Client ..................................... SKIPPED
[INFO] Phoenix Server ..................................... SKIPPED
[INFO] Phoenix Assembly ................................... SKIPPED
[INFO] Phoenix - Tracing Web Application .................. SKIPPED
[INFO] ------------------------------------------------------------------------
[INFO] BUILD FAILURE
[INFO] ------------------------------------------------------------------------
[INFO] Total time: 01:05 h
[INFO] Finished at: 2017-05-17T00:28:21+00:00
[INFO] Final Memory: 60M/1175M
[INFO] ------------------------------------------------------------------------
[ERROR] Failed to execute goal org.apache.maven.plugins:maven-failsafe-plugin:2.19.1:verify
(ParallelStatsEnabledTest) on project phoenix-core: There are test failures.
[ERROR] 
[ERROR] Please refer to <https://builds.apache.org/job/Phoenix-4.x-HBase-0.98/ws/phoenix-core/target/failsafe-reports>
for the individual test results.
[ERROR] -> [Help 1]
[ERROR] 
[ERROR] To see the full stack trace of the errors, re-run Maven with the -e switch.
[ERROR] Re-run Maven using the -X switch to enable full debug logging.
[ERROR] 
[ERROR] For more information about the errors and possible solutions, please read the following
articles:
[ERROR] [Help 1] http://cwiki.apache.org/confluence/display/MAVEN/MojoFailureException
[ERROR] 
[ERROR] After correcting the problems, you can resume the build with the command
[ERROR]   mvn <goals> -rf :phoenix-core
Build step 'Invoke top-level Maven targets' marked build as failure
Archiving artifacts
Compressed 1.53 GB of artifacts by 46.0% relative to #1490
Recording test results

Mime
View raw message