phoenix-commits mailing list archives

Site index · List index
Message view « Date » · « Thread »
Top « Date » · « Thread »
From Apache Jenkins Server <jenk...@builds.apache.org>
Subject Build failed in Jenkins: Phoenix-4.x-HBase-1.1 #386
Date Thu, 11 May 2017 01:26:21 GMT
See <https://builds.apache.org/job/Phoenix-4.x-HBase-1.1/386/display/redirect?page=changes>

Changes:

[apurtell] PHOENIX-3842 Turn off all BloomFilter for Phoenix tables (Lars Hofhansl)

------------------------------------------
[...truncated 47.91 KB...]

Tests run: 1498, Failures: 0, Errors: 0, Skipped: 6

[INFO] 
[INFO] --- maven-source-plugin:2.2.1:jar-no-fork (attach-sources) @ phoenix-core ---
[INFO] Building jar: <https://builds.apache.org/job/Phoenix-4.x-HBase-1.1/386/artifact/phoenix-core/target/phoenix-core-4.11.0-HBase-1.1-SNAPSHOT-sources.jar>
[INFO] 
[INFO] --- maven-jar-plugin:2.4:test-jar (default) @ phoenix-core ---
[INFO] Building jar: <https://builds.apache.org/job/Phoenix-4.x-HBase-1.1/386/artifact/phoenix-core/target/phoenix-core-4.11.0-HBase-1.1-SNAPSHOT-tests.jar>
[INFO] 
[INFO] --- maven-jar-plugin:2.4:jar (default-jar) @ phoenix-core ---
[INFO] Building jar: <https://builds.apache.org/job/Phoenix-4.x-HBase-1.1/386/artifact/phoenix-core/target/phoenix-core-4.11.0-HBase-1.1-SNAPSHOT.jar>
[INFO] 
[INFO] --- maven-site-plugin:3.2:attach-descriptor (attach-descriptor) @ phoenix-core ---
[INFO] 
[INFO] --- maven-assembly-plugin:2.5.2:single (core) @ phoenix-core ---
[INFO] Reading assembly descriptor: src/build/phoenix-core.xml
[WARNING] Artifact: org.apache.phoenix:phoenix-core:jar:4.11.0-HBase-1.1-SNAPSHOT references
the same file as the assembly destination file. Moving it to a temporary location for inclusion.
[INFO] Building jar: <https://builds.apache.org/job/Phoenix-4.x-HBase-1.1/386/artifact/phoenix-core/target/phoenix-core-4.11.0-HBase-1.1-SNAPSHOT.jar>
[INFO] 
[INFO] --- maven-failsafe-plugin:2.19.1:integration-test (ParallelStatsEnabledTest) @ phoenix-core
---

-------------------------------------------------------
 T E S T S
-------------------------------------------------------
Running org.apache.phoenix.end2end.MultiCfQueryExecIT
Running org.apache.phoenix.end2end.ParallelIteratorsIT
Running org.apache.phoenix.coprocessor.StatisticsCollectionRunTrackerIT
Running org.apache.phoenix.end2end.TenantSpecificTablesDDLIT
Running org.apache.phoenix.end2end.KeyOnlyIT
Running org.apache.phoenix.end2end.SaltedViewIT
Tests run: 3, Failures: 0, Errors: 0, Skipped: 0, Time elapsed: 9.942 sec - in org.apache.phoenix.end2end.ParallelIteratorsIT
Running org.apache.phoenix.end2end.TenantSpecificTablesDMLIT
Tests run: 3, Failures: 0, Errors: 0, Skipped: 0, Time elapsed: 13.631 sec - in org.apache.phoenix.end2end.KeyOnlyIT
Running org.apache.phoenix.end2end.TransactionalViewIT
Tests run: 2, Failures: 0, Errors: 0, Skipped: 0, Time elapsed: 4.44 sec - in org.apache.phoenix.end2end.TransactionalViewIT
Running org.apache.phoenix.end2end.ViewIT
Tests run: 4, Failures: 0, Errors: 0, Skipped: 0, Time elapsed: 18.41 sec - in org.apache.phoenix.coprocessor.StatisticsCollectionRunTrackerIT
Running org.apache.phoenix.end2end.index.ImmutableIndexWithStatsIT
Tests run: 9, Failures: 0, Errors: 0, Skipped: 0, Time elapsed: 24.017 sec - in org.apache.phoenix.end2end.MultiCfQueryExecIT
Tests run: 1, Failures: 0, Errors: 0, Skipped: 0, Time elapsed: 3.854 sec - in org.apache.phoenix.end2end.index.ImmutableIndexWithStatsIT
Tests run: 4, Failures: 0, Errors: 0, Skipped: 0, Time elapsed: 31.154 sec - in org.apache.phoenix.end2end.SaltedViewIT
Tests run: 16, Failures: 0, Errors: 0, Skipped: 0, Time elapsed: 100.496 sec - in org.apache.phoenix.end2end.TenantSpecificTablesDMLIT
Tests run: 16, Failures: 0, Errors: 0, Skipped: 0, Time elapsed: 113.703 sec - in org.apache.phoenix.end2end.TenantSpecificTablesDDLIT
Tests run: 46, Failures: 0, Errors: 0, Skipped: 0, Time elapsed: 161.522 sec - in org.apache.phoenix.end2end.ViewIT

Results :

Tests run: 104, Failures: 0, Errors: 0, Skipped: 0

[INFO] 
[INFO] --- maven-failsafe-plugin:2.19.1:integration-test (ParallelStatsDisabledTest) @ phoenix-core
---

-------------------------------------------------------
 T E S T S
-------------------------------------------------------
Running org.apache.phoenix.end2end.AppendOnlySchemaIT
Running org.apache.phoenix.end2end.AbsFunctionEnd2EndIT
Running org.apache.phoenix.end2end.AlterMultiTenantTableWithViewsIT
Tests run: 1, Failures: 0, Errors: 0, Skipped: 0, Time elapsed: 1.699 sec - in org.apache.phoenix.end2end.AbsFunctionEnd2EndIT
Running org.apache.phoenix.end2end.ArithmeticQueryIT
Running org.apache.phoenix.end2end.AlterTableIT
Running org.apache.phoenix.end2end.AlterSessionIT
Running org.apache.phoenix.end2end.AlterTableWithViewsIT
Tests run: 2, Failures: 0, Errors: 0, Skipped: 0, Time elapsed: 2.663 sec - in org.apache.phoenix.end2end.AlterSessionIT
Running org.apache.phoenix.end2end.ArrayAppendFunctionIT
Tests run: 8, Failures: 0, Errors: 0, Skipped: 0, Time elapsed: 24.797 sec - in org.apache.phoenix.end2end.AppendOnlySchemaIT
Running org.apache.phoenix.end2end.ArrayConcatFunctionIT
Tests run: 26, Failures: 0, Errors: 0, Skipped: 0, Time elapsed: 49.346 sec - in org.apache.phoenix.end2end.ArithmeticQueryIT
Running org.apache.phoenix.end2end.ArrayFillFunctionIT
Tests run: 34, Failures: 0, Errors: 0, Skipped: 0, Time elapsed: 57.177 sec - in org.apache.phoenix.end2end.ArrayAppendFunctionIT
Running org.apache.phoenix.end2end.ArrayPrependFunctionIT
Tests run: 30, Failures: 0, Errors: 0, Skipped: 0, Time elapsed: 55.086 sec - in org.apache.phoenix.end2end.ArrayConcatFunctionIT
Running org.apache.phoenix.end2end.ArrayToStringFunctionIT
Tests run: 9, Failures: 0, Errors: 0, Skipped: 0, Time elapsed: 79.555 sec - in org.apache.phoenix.end2end.AlterMultiTenantTableWithViewsIT
Running org.apache.phoenix.end2end.ArraysWithNullsIT
Tests run: 16, Failures: 0, Errors: 0, Skipped: 0, Time elapsed: 23.511 sec - in org.apache.phoenix.end2end.ArraysWithNullsIT
Running org.apache.phoenix.end2end.AutoCommitIT
Tests run: 1, Failures: 0, Errors: 0, Skipped: 0, Time elapsed: 1.317 sec - in org.apache.phoenix.end2end.AutoCommitIT
Running org.apache.phoenix.end2end.AutoPartitionViewsIT
Tests run: 26, Failures: 0, Errors: 0, Skipped: 0, Time elapsed: 55.01 sec - in org.apache.phoenix.end2end.ArrayFillFunctionIT
Running org.apache.phoenix.end2end.BinaryRowKeyIT
Tests run: 3, Failures: 0, Errors: 0, Skipped: 0, Time elapsed: 4.88 sec - in org.apache.phoenix.end2end.BinaryRowKeyIT
Running org.apache.phoenix.end2end.CSVCommonsLoaderIT
Tests run: 34, Failures: 0, Errors: 0, Skipped: 0, Time elapsed: 55.739 sec - in org.apache.phoenix.end2end.ArrayPrependFunctionIT
Running org.apache.phoenix.end2end.CbrtFunctionEnd2EndIT
Tests run: 2, Failures: 0, Errors: 0, Skipped: 0, Time elapsed: 6.338 sec - in org.apache.phoenix.end2end.CbrtFunctionEnd2EndIT
Running org.apache.phoenix.end2end.CoalesceFunctionIT
Tests run: 16, Failures: 0, Errors: 0, Skipped: 0, Time elapsed: 25.59 sec - in org.apache.phoenix.end2end.CSVCommonsLoaderIT
Running org.apache.phoenix.end2end.ColumnEncodedBytesPropIT
Tests run: 2, Failures: 0, Errors: 0, Skipped: 0, Time elapsed: 5.92 sec - in org.apache.phoenix.end2end.ColumnEncodedBytesPropIT
Running org.apache.phoenix.end2end.ConvertTimezoneFunctionIT
Tests run: 11, Failures: 0, Errors: 0, Skipped: 0, Time elapsed: 17.067 sec - in org.apache.phoenix.end2end.CoalesceFunctionIT
Running org.apache.phoenix.end2end.DateTimeIT
Tests run: 36, Failures: 0, Errors: 0, Skipped: 0, Time elapsed: 74.402 sec - in org.apache.phoenix.end2end.ArrayToStringFunctionIT
Running org.apache.phoenix.end2end.DecodeFunctionIT
Tests run: 8, Failures: 0, Errors: 0, Skipped: 0, Time elapsed: 15.246 sec - in org.apache.phoenix.end2end.ConvertTimezoneFunctionIT
Running org.apache.phoenix.end2end.DefaultColumnValueIT
Tests run: 12, Failures: 0, Errors: 0, Skipped: 0, Time elapsed: 56.083 sec - in org.apache.phoenix.end2end.AutoPartitionViewsIT
Running org.apache.phoenix.end2end.DeleteIT
Tests run: 6, Failures: 0, Errors: 0, Skipped: 0, Time elapsed: 9.529 sec - in org.apache.phoenix.end2end.DecodeFunctionIT
Running org.apache.phoenix.end2end.DisableLocalIndexIT
Tests run: 1, Failures: 0, Errors: 0, Skipped: 0, Time elapsed: 3.658 sec - in org.apache.phoenix.end2end.DisableLocalIndexIT
Running org.apache.phoenix.end2end.DistinctPrefixFilterIT
Tests run: 24, Failures: 0, Errors: 0, Skipped: 0, Time elapsed: 56.79 sec - in org.apache.phoenix.end2end.DefaultColumnValueIT
Running org.apache.phoenix.end2end.DynamicColumnIT
Tests run: 25, Failures: 0, Errors: 0, Skipped: 0, Time elapsed: 85.372 sec - in org.apache.phoenix.end2end.DeleteIT
Running org.apache.phoenix.end2end.DynamicFamilyIT
Tests run: 4, Failures: 0, Errors: 0, Skipped: 0, Time elapsed: 2.627 sec - in org.apache.phoenix.end2end.DynamicFamilyIT
Running org.apache.phoenix.end2end.DynamicUpsertIT
Tests run: 5, Failures: 0, Errors: 0, Skipped: 0, Time elapsed: 85.72 sec - in org.apache.phoenix.end2end.DistinctPrefixFilterIT
Running org.apache.phoenix.end2end.EncodeFunctionIT
Tests run: 6, Failures: 0, Errors: 0, Skipped: 0, Time elapsed: 45.6 sec - in org.apache.phoenix.end2end.DynamicColumnIT
Running org.apache.phoenix.end2end.EvaluationOfORIT
Tests run: 7, Failures: 0, Errors: 0, Skipped: 0, Time elapsed: 10.959 sec - in org.apache.phoenix.end2end.DynamicUpsertIT
Running org.apache.phoenix.end2end.ExecuteStatementsIT
Tests run: 2, Failures: 0, Errors: 0, Skipped: 0, Time elapsed: 1.305 sec - in org.apache.phoenix.end2end.EvaluationOfORIT
Running org.apache.phoenix.end2end.ExpFunctionEnd2EndIT
Tests run: 6, Failures: 0, Errors: 0, Skipped: 0, Time elapsed: 11.267 sec - in org.apache.phoenix.end2end.EncodeFunctionIT
Running org.apache.phoenix.end2end.FirstValueFunctionIT
Tests run: 49, Failures: 0, Errors: 0, Skipped: 0, Time elapsed: 128.422 sec - in org.apache.phoenix.end2end.DateTimeIT
Running org.apache.phoenix.end2end.FlappingAlterTableIT
Tests run: 3, Failures: 0, Errors: 0, Skipped: 0, Time elapsed: 12.007 sec - in org.apache.phoenix.end2end.ExpFunctionEnd2EndIT
Running org.apache.phoenix.end2end.GetSetByteBitFunctionEnd2EndIT
Tests run: 7, Failures: 0, Errors: 0, Skipped: 0, Time elapsed: 11.95 sec - in org.apache.phoenix.end2end.FirstValueFunctionIT
Running org.apache.phoenix.end2end.GroupByCaseIT
Tests run: 1, Failures: 0, Errors: 0, Skipped: 0, Time elapsed: 2.298 sec - in org.apache.phoenix.end2end.GetSetByteBitFunctionEnd2EndIT
Running org.apache.phoenix.end2end.HashJoinIT
Tests run: 2, Failures: 0, Errors: 0, Skipped: 0, Time elapsed: 16.735 sec - in org.apache.phoenix.end2end.ExecuteStatementsIT
Running org.apache.phoenix.end2end.HashJoinLocalIndexIT
Tests run: 2, Failures: 0, Errors: 0, Skipped: 0, Time elapsed: 16.46 sec - in org.apache.phoenix.end2end.FlappingAlterTableIT
Running org.apache.phoenix.end2end.HashJoinMoreIT
Tests run: 1, Failures: 0, Errors: 0, Skipped: 0, Time elapsed: 14.771 sec - in org.apache.phoenix.end2end.HashJoinLocalIndexIT
Running org.apache.phoenix.end2end.ImmutableTablePropertiesIT
Tests run: 5, Failures: 0, Errors: 0, Skipped: 0, Time elapsed: 7.553 sec - in org.apache.phoenix.end2end.ImmutableTablePropertiesIT
Running org.apache.phoenix.end2end.InListIT
Tests run: 17, Failures: 0, Errors: 0, Skipped: 0, Time elapsed: 49.445 sec - in org.apache.phoenix.end2end.GroupByCaseIT
Running org.apache.phoenix.end2end.InstrFunctionIT
Tests run: 8, Failures: 0, Errors: 0, Skipped: 0, Time elapsed: 13.414 sec - in org.apache.phoenix.end2end.InstrFunctionIT
Running org.apache.phoenix.end2end.IsNullIT
Tests run: 8, Failures: 0, Errors: 0, Skipped: 0, Time elapsed: 50.092 sec - in org.apache.phoenix.end2end.HashJoinMoreIT
Running org.apache.phoenix.end2end.LastValueFunctionIT
Tests run: 3, Failures: 0, Errors: 0, Skipped: 0, Time elapsed: 3.761 sec - in org.apache.phoenix.end2end.IsNullIT
Running org.apache.phoenix.end2end.LikeExpressionIT
Tests run: 11, Failures: 0, Errors: 0, Skipped: 0, Time elapsed: 17.928 sec - in org.apache.phoenix.end2end.LastValueFunctionIT
Tests run: 6, Failures: 0, Errors: 0, Skipped: 0, Time elapsed: 18.306 sec - in org.apache.phoenix.end2end.LikeExpressionIT
Running org.apache.phoenix.end2end.LnLogFunctionEnd2EndIT
Tests run: 1, Failures: 0, Errors: 0, Skipped: 0, Time elapsed: 3.816 sec - in org.apache.phoenix.end2end.LnLogFunctionEnd2EndIT
Running org.apache.phoenix.end2end.MD5FunctionIT
Tests run: 3, Failures: 0, Errors: 0, Skipped: 0, Time elapsed: 3.841 sec - in org.apache.phoenix.end2end.MD5FunctionIT
Running org.apache.phoenix.end2end.MapReduceIT
Tests run: 2, Failures: 0, Errors: 0, Skipped: 0, Time elapsed: 10.627 sec - in org.apache.phoenix.end2end.MapReduceIT
Running org.apache.phoenix.end2end.MinMaxAggregateFunctionIT
Tests run: 1, Failures: 0, Errors: 0, Skipped: 0, Time elapsed: 1.336 sec - in org.apache.phoenix.end2end.MinMaxAggregateFunctionIT
Running org.apache.phoenix.end2end.ModulusExpressionIT
Tests run: 48, Failures: 0, Errors: 0, Skipped: 0, Time elapsed: 376.83 sec - in org.apache.phoenix.end2end.AlterTableWithViewsIT
Running org.apache.phoenix.end2end.NamespaceSchemaMappingIT
Running org.apache.phoenix.end2end.MappingTableDataTypeIT
Tests run: 1, Failures: 0, Errors: 0, Skipped: 0, Time elapsed: 14.156 sec - in org.apache.phoenix.end2end.NamespaceSchemaMappingIT
Running org.apache.phoenix.end2end.NthValueFunctionIT
Tests run: 11, Failures: 0, Errors: 0, Skipped: 0, Time elapsed: 19.824 sec - in org.apache.phoenix.end2end.ModulusExpressionIT
Tests run: 1, Failures: 0, Errors: 0, Skipped: 0, Time elapsed: 9.266 sec - in org.apache.phoenix.end2end.MappingTableDataTypeIT
Running org.apache.phoenix.end2end.OctetLengthFunctionEnd2EndIT
Tests run: 1, Failures: 0, Errors: 0, Skipped: 0, Time elapsed: 2.303 sec - in org.apache.phoenix.end2end.OctetLengthFunctionEnd2EndIT
Running org.apache.phoenix.end2end.OnDuplicateKeyIT
Tests run: 13, Failures: 0, Errors: 0, Skipped: 0, Time elapsed: 20.911 sec - in org.apache.phoenix.end2end.NthValueFunctionIT
Running org.apache.phoenix.end2end.PercentileIT
Running org.apache.phoenix.end2end.OrderByIT
Tests run: 17, Failures: 0, Errors: 0, Skipped: 0, Time elapsed: 35.681 sec - in org.apache.phoenix.end2end.PercentileIT
Running org.apache.phoenix.end2end.PhoenixRuntimeIT
Tests run: 2, Failures: 0, Errors: 0, Skipped: 0, Time elapsed: 18.557 sec - in org.apache.phoenix.end2end.PhoenixRuntimeIT
Running org.apache.phoenix.end2end.PowerFunctionEnd2EndIT
Tests run: 1, Failures: 0, Errors: 0, Skipped: 0, Time elapsed: 3.753 sec - in org.apache.phoenix.end2end.PowerFunctionEnd2EndIT
Running org.apache.phoenix.end2end.PrimitiveTypeIT
Tests run: 9, Failures: 0, Errors: 0, Skipped: 0, Time elapsed: 13.597 sec - in org.apache.phoenix.end2end.PrimitiveTypeIT
Running org.apache.phoenix.end2end.QueryExecWithoutSCNIT
Tests run: 1, Failures: 0, Errors: 0, Skipped: 0, Time elapsed: 2.36 sec - in org.apache.phoenix.end2end.QueryExecWithoutSCNIT
Running org.apache.phoenix.end2end.QueryMoreIT
Tests run: 9, Failures: 0, Errors: 0, Skipped: 0, Time elapsed: 33.123 sec - in org.apache.phoenix.end2end.QueryMoreIT
Running org.apache.phoenix.end2end.QueryWithOffsetIT
Tests run: 11, Failures: 0, Errors: 0, Skipped: 0, Time elapsed: 92.254 sec - in org.apache.phoenix.end2end.OrderByIT
Running org.apache.phoenix.end2end.RTrimFunctionIT
Tests run: 2, Failures: 0, Errors: 0, Skipped: 0, Time elapsed: 3.563 sec - in org.apache.phoenix.end2end.RTrimFunctionIT
Running org.apache.phoenix.end2end.ReadOnlyIT
Build step 'Invoke top-level Maven targets' marked build as failure
Archiving artifacts
ERROR: Failed to archive artifacts: **/surefire-reports/*,**/failsafe-reports/*.xml,**/*.txt,**/*.jar,**/bin/*.sh,**/bin/*.sh,**/bin/*.xml,**/bin/*.properties
hudson.remoting.ProxyException: java.lang.Throwable
	at hudson.remoting.FastPipedOutputStream.<init>(FastPipedOutputStream.java:49)
	at hudson.remoting.Pipe.readObject(Pipe.java:189)
	at sun.reflect.GeneratedMethodAccessor44.invoke(Unknown Source)
	at sun.reflect.DelegatingMethodAccessorImpl.invoke(DelegatingMethodAccessorImpl.java:43)
	at java.lang.reflect.Method.invoke(Method.java:606)
	at java.io.ObjectStreamClass.invokeReadObject(ObjectStreamClass.java:1017)
	at java.io.ObjectInputStream.readSerialData(ObjectInputStream.java:1893)
	at java.io.ObjectInputStream.readOrdinaryObject(ObjectInputStream.java:1798)
	at java.io.ObjectInputStream.readObject0(ObjectInputStream.java:1350)
	at java.io.ObjectInputStream.defaultReadFields(ObjectInputStream.java:1990)
	at java.io.ObjectInputStream.readSerialData(ObjectInputStream.java:1915)
	at java.io.ObjectInputStream.readOrdinaryObject(ObjectInputStream.java:1798)
	at java.io.ObjectInputStream.readObject0(ObjectInputStream.java:1350)
	at java.io.ObjectInputStream.defaultReadFields(ObjectInputStream.java:1990)
	at java.io.ObjectInputStream.readSerialData(ObjectInputStream.java:1915)
	at java.io.ObjectInputStream.readOrdinaryObject(ObjectInputStream.java:1798)
	at java.io.ObjectInputStream.readObject0(ObjectInputStream.java:1350)
	at java.io.ObjectInputStream.readObject(ObjectInputStream.java:370)
	at hudson.remoting.UserRequest.deserialize(UserRequest.java:217)
	at hudson.remoting.UserRequest.perform(UserRequest.java:131)
	at hudson.remoting.UserRequest.perform(UserRequest.java:50)
	at hudson.remoting.Request$2.run(Request.java:336)
Caused: hudson.remoting.ProxyException: java.io.IOException: Reader side has already been
abandoned
	at hudson.remoting.FastPipedOutputStream.sink(FastPipedOutputStream.java:81)
	at hudson.remoting.FastPipedOutputStream.write(FastPipedOutputStream.java:151)
	at hudson.remoting.FastPipedOutputStream.write(FastPipedOutputStream.java:138)
	at hudson.remoting.ProxyOutputStream$Chunk$1.run(ProxyOutputStream.java:255)
	at hudson.remoting.PipeWriter$1.run(PipeWriter.java:158)
	at java.util.concurrent.Executors$RunnableAdapter.call(Executors.java:471)
	at java.util.concurrent.FutureTask.run(FutureTask.java:262)
	at hudson.remoting.SingleLaneExecutorService$1.run(SingleLaneExecutorService.java:112)
	at hudson.remoting.InterceptingExecutorService$1.call(InterceptingExecutorService.java:68)
	at java.util.concurrent.FutureTask.run(FutureTask.java:262)
	at java.util.concurrent.ThreadPoolExecutor.runWorker(ThreadPoolExecutor.java:1145)
	at java.util.concurrent.ThreadPoolExecutor$Worker.run(ThreadPoolExecutor.java:615)
	at java.lang.Thread.run(Thread.java:745)
Caused: java.io.IOException: Pipe is already closed
	at hudson.remoting.PipeWindow.checkDeath(PipeWindow.java:108)
	at hudson.remoting.PipeWindow$Real.get(PipeWindow.java:203)
	at hudson.remoting.ProxyOutputStream.write(ProxyOutputStream.java:124)
	at java.io.BufferedOutputStream.flushBuffer(BufferedOutputStream.java:82)
	at java.io.BufferedOutputStream.write(BufferedOutputStream.java:126)
	at java.util.zip.GZIPOutputStream.finish(GZIPOutputStream.java:168)
	at java.util.zip.DeflaterOutputStream.close(DeflaterOutputStream.java:238)
	at jsync.protocol.BaseWriter.close(BaseWriter.java:14)
	at jsync.protocol.BlockIterableWriter.close(BlockIterableWriter.java:26)
	at com.cloudbees.jenkins.plugins.jsync.archiver.JSyncArtifactManager.remoteSync(JSyncArtifactManager.java:151)
	at com.cloudbees.jenkins.plugins.jsync.archiver.JSyncArtifactManager.archive(JSyncArtifactManager.java:76)
	at hudson.tasks.ArtifactArchiver.perform(ArtifactArchiver.java:240)
	at hudson.tasks.BuildStepCompatibilityLayer.perform(BuildStepCompatibilityLayer.java:78)
	at hudson.tasks.BuildStepMonitor$1.perform(BuildStepMonitor.java:20)
	at hudson.model.AbstractBuild$AbstractBuildExecution.perform(AbstractBuild.java:779)
	at hudson.model.AbstractBuild$AbstractBuildExecution.performAllBuildSteps(AbstractBuild.java:720)
	at hudson.model.Build$BuildExecution.post2(Build.java:186)
	at hudson.model.AbstractBuild$AbstractBuildExecution.post(AbstractBuild.java:665)
	at hudson.model.Run.execute(Run.java:1753)
	at hudson.model.FreeStyleBuild.run(FreeStyleBuild.java:43)
	at hudson.model.ResourceController.execute(ResourceController.java:98)
	at hudson.model.Executor.run(Executor.java:405)
Recording test results
Not sending mail to unregistered user ankitsinghal59@gmail.com

Mime
View raw message